UnstableConsole Output

Skipping 66 KB.. Full Log
.SAXParserImpl
Loaded reasoner: Pellet (com.clarkparsia.pellet.owlapiv3.PelletReasoner)
 UNIT TEST INCOMPLETE AFTER FRAMEWORK CHANGE, BECAUSE CLASS HIERARCHY IS NOT PASSED TO REFINEMENT OPERATOR 
∃ hasPiece.(∃ hasLowerRankThan.(BKing ⊓ WRook))
∃ hasPiece.(∃ hasLowerRankThan.(WKing ⊓ WRook))
∃ hasPiece.(∃ hasLowerRankThan.(WRook ⊓ WRook))
∃ hasPiece.(∃ hasLowerRankThan.(WRook ⊓ (¬BKing)))
∃ hasPiece.(∃ hasLowerRankThan.(WRook ⊓ (¬WKing)))
∃ hasPiece.(∃ hasLowerRankThan.(WRook ⊓ (¬WRook)))
∃ hasPiece.(≥ 2 hasLowerRankThan.(WRook ⊓ ⊤))
≥ 2 hasPiece.(∃ hasLowerRankThan.(WRook ⊓ ⊤))
Loaded reasoner: Pellet (com.clarkparsia.pellet.owlapiv3.PelletReasoner)
car ⊓ (∃ hasOwner.man)
car ⊓ (∃ hasOwner.woman)
limo ⊓ (∃ hasOwner.person)
suv ⊓ (∃ hasOwner.person)
http://www.oracle.com/xml/jaxp/properties/entityExpansionLimit not supported by parser type org.apache.xerces.jaxp.SAXParserImpl
entityExpansionLimit not supported by parser type org.apache.xerces.jaxp.SAXParserImpl
Loaded reasoner: Pellet (com.clarkparsia.pellet.owlapiv3.PelletReasoner)
(¬Requirement) ⊔ (∀ isCreatedBy.(¬Creditor))
(¬AbstractRequirement) ⊔ (∀ isCreatedBy.(¬Creditor))
(¬Requirement) ⊔ (∀ isCreatedBy.(¬Stakeholder))
http://www.oracle.com/xml/jaxp/properties/entityExpansionLimit not supported by parser type org.apache.xerces.jaxp.SAXParserImpl
entityExpansionLimit not supported by parser type org.apache.xerces.jaxp.SAXParserImpl
Loaded reasoner: Pellet (com.clarkparsia.pellet.owlapiv3.PelletReasoner)
http://www.oracle.com/xml/jaxp/properties/entityExpansionLimit not supported by parser type org.apache.xerces.jaxp.SAXParserImpl
entityExpansionLimit not supported by parser type org.apache.xerces.jaxp.SAXParserImpl
http://www.oracle.com/xml/jaxp/properties/entityExpansionLimit not supported by parser type org.apache.xerces.jaxp.SAXParserImpl
entityExpansionLimit not supported by parser type org.apache.xerces.jaxp.SAXParserImpl
Loaded reasoner: Pellet (com.clarkparsia.pellet.owlapiv3.PelletReasoner)
female
male
person ⊓ person
person ⊓ (City ⊔ City)
person ⊓ (City ⊔ person)
person ⊓ (person ⊔ person)
person ⊓ (¬City)
person ⊓ (¬fatherBornInLeipzig)
person ⊓ (¬female)
person ⊓ (∃ birthPlaceOf.⊤)
person ⊓ (∃ isChildOf.⊤)
Tests run: 9, Failures: 0, Errors: 0, Skipped: 0, Time elapsed: 27.772 sec - in org.dllearner.test.junit.RefinementOperatorTest
Running org.dllearner.test.junit.ReasonerTest
http://www.oracle.com/xml/jaxp/properties/entityExpansionLimit not supported by parser type org.apache.xerces.jaxp.SAXParserImpl
entityExpansionLimit not supported by parser type org.apache.xerces.jaxp.SAXParserImpl
Notice: root element does not have an xml:base. Relative IRIs will be resolved against file:/usr/share/tomcat6/.jenkins/jobs/DL-Learner%20Merge-M/branches/leap-alternative/workspace/components-core/src/test/resources/nlp2rdf/positives.owl
http://www.oracle.com/xml/jaxp/properties/entityExpansionLimit not supported by parser type org.apache.xerces.jaxp.SAXParserImpl
entityExpansionLimit not supported by parser type org.apache.xerces.jaxp.SAXParserImpl
Notice: root element does not have an xml:base. Relative IRIs will be resolved against file:/usr/share/tomcat6/.jenkins/jobs/DL-Learner%20Merge-M/branches/leap-alternative/workspace/components-core/src/test/resources/nlp2rdf/string.owl
http://www.oracle.com/xml/jaxp/properties/entityExpansionLimit not supported by parser type org.apache.xerces.jaxp.SAXParserImpl
entityExpansionLimit not supported by parser type org.apache.xerces.jaxp.SAXParserImpl
Notice: root element does not have an xml:base. Relative IRIs will be resolved against file:/usr/share/tomcat6/.jenkins/jobs/DL-Learner%20Merge-M/branches/leap-alternative/workspace/components-core/src/test/resources/nlp2rdf/sso.owl
Loaded reasoner: Pellet (com.clarkparsia.pellet.owlapiv3.PelletReasoner)
Materializing TBox...
...TBox materialised in 1503 ms.
Tests run: 1, Failures: 0, Errors: 0, Skipped: 0, Time elapsed: 2.512 sec - in org.dllearner.test.junit.ReasonerTest
Running org.dllearner.test.junit.UtilitiesTest
Loaded reasoner: Pellet (com.clarkparsia.pellet.owlapiv3.PelletReasoner)
[]: 
  classes: []
  object properties: [hasChild, married]
[hasChild]: 
  classes: []
  object properties: []
[married]: 
  classes: []
  object properties: []

Tests run: 1, Failures: 0, Errors: 0, Skipped: 0, Time elapsed: 0.138 sec - in org.dllearner.test.junit.UtilitiesTest
Running org.dllearner.test.junit.ConfigOptionTest
Tests run: 1, Failures: 0, Errors: 0, Skipped: 0, Time elapsed: 0 sec - in org.dllearner.test.junit.ConfigOptionTest
Running org.dllearner.test.junit.ParserTest
∃ someproperty.{someindividual}
Tests run: 1, Failures: 0, Errors: 0, Skipped: 0, Time elapsed: 0 sec - in org.dllearner.test.junit.ParserTest
Running org.dllearner.test.junit.HeuristicTest
Loaded reasoner: Pellet (com.clarkparsia.pellet.owlapiv3.PelletReasoner)
Loaded reasoner: Pellet (com.clarkparsia.pellet.owlapiv3.PelletReasoner)
Tests run: 3, Failures: 0, Errors: 0, Skipped: 0, Time elapsed: 0.319 sec - in org.dllearner.test.junit.HeuristicTest
Running org.dllearner.test.junit.PropertyAxiomLearningTest
Started learning of ObjectPropertyDomain axioms for object property http://dllearner.org/test/op1...
Generating sample...
...done. Sample size: 232 triples
Learning of ObjectPropertyDomain axioms ...
    50%
    100%
 ... ObjectPropertyDomain axioms finished
...finished learning of ObjectPropertyDomain axioms for object property http://dllearner.org/test/op1 in 113ms.
Found 2 axiom candidates. 
Best axiom candidate is ∃ op1.⊤ ⊑ A with an accuracy of 0.7126
∃ op1.⊤ ⊑ A(0.7126037418604017)
Started learning of ReflexiveObjectProperty axioms for object property http://dbpedia.org/ontology/influencedBy...
Cannot make ReflexiveObjectProperty axiom suggestions for empty object property http://dbpedia.org/ontology/influencedBy
[]
Started learning of SymmetricObjectProperty axioms for object property http://dbpedia.org/ontology/influencedBy...
Cannot make SymmetricObjectProperty axiom suggestions for empty object property http://dbpedia.org/ontology/influencedBy
[]
Started learning of FunctionalObjectProperty axioms for object property http://dbpedia.org/ontology/league...
Cannot make FunctionalObjectProperty axiom suggestions for empty object property http://dbpedia.org/ontology/league
[]
Started learning of EquivalentObjectProperties axioms for object property http://dllearner.org/test/op1...
Generating sample...
...done. Sample size: 191 triples
Learning of EquivalentObjectProperties axioms ...
    100%
 ... EquivalentObjectProperties axioms finished
...finished learning of EquivalentObjectProperties axioms for object property http://dllearner.org/test/op1 in 55ms.
Found 1 axiom candidates. 
Best axiom candidate is op1 ≡ op2 with an accuracy of 0.4626
op1 ≡ op2(0.4626865671641791)
Started learning of DisjointDataProperties axioms for data property http://dbpedia.org/ontology/height...
Cannot make DisjointDataProperties axiom suggestions for empty data property http://dbpedia.org/ontology/height
[]
Started learning of ObjectPropertyRange axioms for object property http://dbpedia.org/ontology/writer...
Cannot make ObjectPropertyRange axiom suggestions for empty object property http://dbpedia.org/ontology/writer
[]
Started learning of EquivalentDataProperties axioms for data property http://dbpedia.org/ontology/height...
Cannot make EquivalentDataProperties axiom suggestions for empty data property http://dbpedia.org/ontology/height
[]
Started learning of SubObjectPropertyOf axioms for object property http://dllearner.org/test/op1...
Generating sample...
...done. Sample size: 191 triples
Learning of SubObjectPropertyOf axioms ...
    100%
 ... SubObjectPropertyOf axioms finished
...finished learning of SubObjectPropertyOf axioms for object property http://dllearner.org/test/op1 in 42ms.
Found 1 axiom candidates. 
Best axiom candidate is op1 ⊑ op2 with an accuracy of 0.4626
op1 ⊑ op2(0.4626865671641791)
Tests run: 9, Failures: 0, Errors: 0, Skipped: 0, Time elapsed: 0.255 sec - in org.dllearner.test.junit.PropertyAxiomLearningTest
Running org.dllearner.test.junit.SimulationTest
Loaded reasoner: Pellet (com.clarkparsia.pellet.owlapiv3.PelletReasoner)
Loaded reasoner: Pellet (com.clarkparsia.pellet.owlapiv3.PelletReasoner)
Loaded reasoner: Pellet (com.clarkparsia.pellet.owlapiv3.PelletReasoner)
Loaded reasoner: Pellet (com.clarkparsia.pellet.owlapiv3.PelletReasoner)
Loaded reasoner: Pellet (com.clarkparsia.pellet.owlapiv3.PelletReasoner)
Loaded reasoner: Pellet (com.clarkparsia.pellet.owlapiv3.PelletReasoner)
Loaded reasoner: Pellet (com.clarkparsia.pellet.owlapiv3.PelletReasoner)
Tests run: 7, Failures: 0, Errors: 0, Skipped: 0, Time elapsed: 0.583 sec - in org.dllearner.test.junit.SimulationTest
Running org.dllearner.test.junit.ComponentTest
Tests run: 1, Failures: 0, Errors: 0, Skipped: 0, Time elapsed: 0 sec - in org.dllearner.test.junit.ComponentTest
Running org.dllearner.test.junit.LiteralLearningTest
Loaded reasoner: Pellet (com.clarkparsia.pellet.owlapiv3.PelletReasoner)
Materializing TBox...
...TBox materialised in 4 ms.
start class:⊤
more accurate (50.00%) class expression found after 0ms: ⊤
more accurate (100.00%) class expression found after 7ms: ∃ stringValue.({X})
Algorithm terminated successfully (time: 1s 61ms, 1000 descriptions tested, 811 nodes in the search tree).

number of retrievals: 1345
retrieval reasoning time: 54ms ( 0ms per retrieval)
(complex) subsumption checks: 975 (0 multiple)
subsumption reasoning time: 173ms ( 0ms per subsumption check)
overall reasoning time: 228ms

solutions:
1: ∃ stringValue.({X}) (pred. acc.: 100.00%, F-measure: 100.00%)
2: (∃ stringValue.({X})) (pred. acc.: 100.00%, F-measure: 100.00%)
3: A ⊓ (∃ stringValue.({X})) (pred. acc.: 100.00%, F-measure: 100.00%)
4: A (pred. acc.: 50.00%, F-measure: 66.67%)
5: ⊤ (pred. acc.: 50.00%, F-measure: 66.67%)
6: A (pred. acc.: 50.00%, F-measure: 66.67%)
7: ⊤ (pred. acc.: 50.00%, F-measure: 66.67%)
8: A (pred. acc.: 50.00%, F-measure: 66.67%)
9: A ⊔ (∃ stringValue.({Y})) (pred. acc.: 50.00%, F-measure: 66.67%)
10: A ⊔ (∃ stringValue.({X})) (pred. acc.: 50.00%, F-measure: 66.67%)

http://www.oracle.com/xml/jaxp/properties/entityExpansionLimit not supported by parser type org.apache.xerces.jaxp.SAXParserImpl
entityExpansionLimit not supported by parser type org.apache.xerces.jaxp.SAXParserImpl
Loaded reasoner: Pellet (com.clarkparsia.pellet.owlapiv3.PelletReasoner)
Materializing TBox...
...TBox materialised in 1 ms.
start class:⊤
more accurate (50.00%) class expression found after 2ms: ⊤
more accurate (66.67%) class expression found after 38ms: ∃ value.(dateTime[≤ 2001-09-24T12:34:56])
more accurate (83.33%) class expression found after 67ms: ∃ value.(dateTime[≤ 1971-09-24T02:22:22])
more accurate (100.00%) class expression found after 311ms: ∃ value.(dateTime[≥ 1970-01-22T08:10:10 , ≤ 1971-09-24T02:22:22])
Algorithm terminated successfully (time: 1s 52ms, 1000 descriptions tested, 743 nodes in the search tree).

number of retrievals: 1048
retrieval reasoning time: 451ms ( 0ms per retrieval)
(complex) subsumption checks: 70 (0 multiple)
subsumption reasoning time: 129ms ( 1ms per subsumption check)
overall reasoning time: 580ms

solutions:
1: ∃ value.(dateTime[≥ 1970-01-22T08:10:10 , ≤ 1971-09-24T02:22:22]) (pred. acc.: 100.00%, F-measure: 100.00%)
2: ∃ value.(dateTime[≤ 1971-09-24T02:22:22]) (pred. acc.: 83.33%, F-measure: 85.71%)
3: ∃ value.(dateTime[≥ 1970-01-22T08:10:10 , ≤ 1999-03-03T04:33:21]) (pred. acc.: 83.33%, F-measure: 85.71%)
4: ∃ value.(dateTime[≥ 1970-01-22T08:10:10 , ≤ 1980-04-10T23:59:59]) (pred. acc.: 83.33%, F-measure: 85.71%)
5: ∃ value.(dateTime[≥ 1970-01-22T08:10:10 , ≤ 1976-11-29T21:19:22]) (pred. acc.: 83.33%, F-measure: 85.71%)
6: ∃ value.(dateTime[≥ 1970-01-22T08:10:10 , ≤ 1974-10-06T22:22:22]) (pred. acc.: 83.33%, F-measure: 85.71%)
7: ∃ value.(dateTime[≥ 1970-01-22T08:10:10 , ≤ 1972-03-24T12:45:56]) (pred. acc.: 83.33%, F-measure: 85.71%)
8: ∃ value.(dateTime[≥ 1970-01-05T10:09:10 , ≤ 1971-09-24T02:22:22]) (pred. acc.: 83.33%, F-measure: 85.71%)
9: ∃ value.(dateTime[≥ 1950-12-31T21:19:00 , ≤ 1971-09-24T02:22:22]) (pred. acc.: 83.33%, F-measure: 85.71%)
10: Number ⊓ (∃ value.(dateTime[≤ 1971-09-24T02:22:22])) (pred. acc.: 83.33%, F-measure: 85.71%)

http://www.oracle.com/xml/jaxp/properties/entityExpansionLimit not supported by parser type org.apache.xerces.jaxp.SAXParserImpl
entityExpansionLimit not supported by parser type org.apache.xerces.jaxp.SAXParserImpl
Loaded reasoner: Pellet (com.clarkparsia.pellet.owlapiv3.PelletReasoner)
Materializing TBox...
...TBox materialised in 4 ms.
Loaded reasoner: Pellet (com.clarkparsia.pellet.owlapiv3.PelletReasoner)
start class:⊤
more accurate (50.00%) class expression found after 0ms: ⊤
more accurate (83.33%) class expression found after 5ms: ∃ value.(double[≤ 101.0])
more accurate (100.00%) class expression found after 7ms: ∃ value.(double[≤ 55.0])
Algorithm terminated successfully (time: 1s 154ms, 1000 descriptions tested, 863 nodes in the search tree).

number of retrievals: 1036
retrieval reasoning time: 19ms ( 0ms per retrieval)
(complex) subsumption checks: 40 (0 multiple)
subsumption reasoning time: 24ms ( 0ms per subsumption check)
overall reasoning time: 44ms

solutions:
1: ∃ value.(double[≤ 9.5]) (pred. acc.: 100.00%, F-measure: 100.00%)
2: ∃ value.(double[≤ 7.5]) (pred. acc.: 100.00%, F-measure: 100.00%)
3: ∃ value.(double[≤ 6.5]) (pred. acc.: 100.00%, F-measure: 100.00%)
4: ∃ value.(double[≤ 55.0]) (pred. acc.: 100.00%, F-measure: 100.00%)
5: ∃ value.(double[≤ 5.5]) (pred. acc.: 100.00%, F-measure: 100.00%)
6: ∃ value.(double[≤ 3.5]) (pred. acc.: 100.00%, F-measure: 100.00%)
7: ∃ value.(double[≥ 1.0 , ≤ 9.5]) (pred. acc.: 100.00%, F-measure: 100.00%)
8: ∃ value.(double[≥ 1.0 , ≤ 7.5]) (pred. acc.: 100.00%, F-measure: 100.00%)
9: ∃ value.(double[≥ 1.0 , ≤ 6.5]) (pred. acc.: 100.00%, F-measure: 100.00%)
10: ∃ value.(double[≥ 1.0 , ≤ 55.0]) (pred. acc.: 100.00%, F-measure: 100.00%)

start class:⊤
more accurate (50.00%) class expression found after 0ms: ⊤
more accurate (83.33%) class expression found after 132ms: ∃ value.(double[≤ 101.0])
more accurate (100.00%) class expression found after 166ms: ∃ value.(double[≤ 55.0])
Algorithm terminated successfully (time: 5s 778ms, 1000 descriptions tested, 863 nodes in the search tree).

number of retrievals: 1036
retrieval reasoning time: 4s 539ms ( 4ms per retrieval)
(complex) subsumption checks: 40 (0 multiple)
subsumption reasoning time: 13ms ( 0ms per subsumption check)
overall reasoning time: 4s 552ms

solutions:
1: ∃ value.(double[≤ 9.5]) (pred. acc.: 100.00%, F-measure: 100.00%)
2: ∃ value.(double[≤ 7.5]) (pred. acc.: 100.00%, F-measure: 100.00%)
3: ∃ value.(double[≤ 6.5]) (pred. acc.: 100.00%, F-measure: 100.00%)
4: ∃ value.(double[≤ 55.0]) (pred. acc.: 100.00%, F-measure: 100.00%)
5: ∃ value.(double[≤ 5.5]) (pred. acc.: 100.00%, F-measure: 100.00%)
6: ∃ value.(double[≤ 3.5]) (pred. acc.: 100.00%, F-measure: 100.00%)
7: ∃ value.(double[≥ 1.0 , ≤ 9.5]) (pred. acc.: 100.00%, F-measure: 100.00%)
8: ∃ value.(double[≥ 1.0 , ≤ 7.5]) (pred. acc.: 100.00%, F-measure: 100.00%)
9: ∃ value.(double[≥ 1.0 , ≤ 6.5]) (pred. acc.: 100.00%, F-measure: 100.00%)
10: ∃ value.(double[≥ 1.0 , ≤ 55.0]) (pred. acc.: 100.00%, F-measure: 100.00%)

http://www.oracle.com/xml/jaxp/properties/entityExpansionLimit not supported by parser type org.apache.xerces.jaxp.SAXParserImpl
entityExpansionLimit not supported by parser type org.apache.xerces.jaxp.SAXParserImpl
Loaded reasoner: Pellet (com.clarkparsia.pellet.owlapiv3.PelletReasoner)
Materializing TBox...
...TBox materialised in 5 ms.
Loaded reasoner: Pellet (com.clarkparsia.pellet.owlapiv3.PelletReasoner)
start class:⊤
more accurate (50.00%) class expression found after 0ms: ⊤
more accurate (83.33%) class expression found after 3ms: ∃ value.(short[≤ 101])
more accurate (100.00%) class expression found after 3ms: ∃ value.(short[≤ 55])
Algorithm terminated successfully (time: 1s 10ms, 1000 descriptions tested, 860 nodes in the search tree).

number of retrievals: 1085
retrieval reasoning time: 20ms ( 0ms per retrieval)
(complex) subsumption checks: 109 (0 multiple)
subsumption reasoning time: 59ms ( 0ms per subsumption check)
overall reasoning time: 79ms

solutions:
1: ∃ value.(short[≤ 9]) (pred. acc.: 100.00%, F-measure: 100.00%)
2: ∃ value.(short[≤ 7]) (pred. acc.: 100.00%, F-measure: 100.00%)
3: ∃ value.(short[≤ 6]) (pred. acc.: 100.00%, F-measure: 100.00%)
4: ∃ value.(short[≤ 55]) (pred. acc.: 100.00%, F-measure: 100.00%)
5: ∃ value.(short[≤ 5]) (pred. acc.: 100.00%, F-measure: 100.00%)
6: ∃ value.(short[≤ 3]) (pred. acc.: 100.00%, F-measure: 100.00%)
7: ∃ value.(short[≥ 1 , ≤ 9]) (pred. acc.: 100.00%, F-measure: 100.00%)
8: ∃ value.(short[≥ 1 , ≤ 7]) (pred. acc.: 100.00%, F-measure: 100.00%)
9: ∃ value.(short[≥ 1 , ≤ 6]) (pred. acc.: 100.00%, F-measure: 100.00%)
10: ∃ value.(short[≥ 1 , ≤ 55]) (pred. acc.: 100.00%, F-measure: 100.00%)

start class:⊤
more accurate (50.00%) class expression found after 0ms: ⊤
more accurate (83.33%) class expression found after 36ms: ∃ value.(short[≤ 101])
more accurate (100.00%) class expression found after 43ms: ∃ value.(short[≤ 55])
Algorithm terminated successfully (time: 5s 319ms, 1000 descriptions tested, 860 nodes in the search tree).

number of retrievals: 1085
retrieval reasoning time: 4s 126ms ( 3ms per retrieval)
(complex) subsumption checks: 109 (0 multiple)
subsumption reasoning time: 37ms ( 0ms per subsumption check)
overall reasoning time: 4s 164ms

solutions:
1: ∃ value.(short[≤ 9]) (pred. acc.: 100.00%, F-measure: 100.00%)
2: ∃ value.(short[≤ 7]) (pred. acc.: 100.00%, F-measure: 100.00%)
3: ∃ value.(short[≤ 6]) (pred. acc.: 100.00%, F-measure: 100.00%)
4: ∃ value.(short[≤ 55]) (pred. acc.: 100.00%, F-measure: 100.00%)
5: ∃ value.(short[≤ 5]) (pred. acc.: 100.00%, F-measure: 100.00%)
6: ∃ value.(short[≤ 3]) (pred. acc.: 100.00%, F-measure: 100.00%)
7: ∃ value.(short[≥ 1 , ≤ 9]) (pred. acc.: 100.00%, F-measure: 100.00%)
8: ∃ value.(short[≥ 1 , ≤ 7]) (pred. acc.: 100.00%, F-measure: 100.00%)
9: ∃ value.(short[≥ 1 , ≤ 6]) (pred. acc.: 100.00%, F-measure: 100.00%)
10: ∃ value.(short[≥ 1 , ≤ 55]) (pred. acc.: 100.00%, F-measure: 100.00%)

http://www.oracle.com/xml/jaxp/properties/entityExpansionLimit not supported by parser type org.apache.xerces.jaxp.SAXParserImpl
entityExpansionLimit not supported by parser type org.apache.xerces.jaxp.SAXParserImpl
Loaded reasoner: Pellet (com.clarkparsia.pellet.owlapiv3.PelletReasoner)
Materializing TBox...
...TBox materialised in 1 ms.
Loaded reasoner: Pellet (com.clarkparsia.pellet.owlapiv3.PelletReasoner)
start class:⊤
more accurate (50.00%) class expression found after 0ms: ⊤
more accurate (66.67%) class expression found after 15ms: ∃ value.(gMonth[≤ --11])
more accurate (83.33%) class expression found after 31ms: ∃ value.(gMonth[≤ --05])
more accurate (100.00%) class expression found after 82ms: ∃ value.(gMonth[≥ --03 , ≤ --05])
Algorithm terminated successfully (time: 464ms, 1000 descriptions tested, 749 nodes in the search tree).

number of retrievals: 1048
retrieval reasoning time: 127ms ( 0ms per retrieval)
(complex) subsumption checks: 70 (0 multiple)
subsumption reasoning time: 58ms ( 0ms per subsumption check)
overall reasoning time: 186ms

solutions:
1: ∃ value.(gMonth[≥ --03 , ≤ --05]) (pred. acc.: 100.00%, F-measure: 100.00%)
2: ∃ value.(gMonth[≤ --05]) (pred. acc.: 83.33%, F-measure: 85.71%)
3: ∃ value.(gMonth[≥ --03 , ≤ --10]) (pred. acc.: 83.33%, F-measure: 85.71%)
4: ∃ value.(gMonth[≥ --03 , ≤ --09]) (pred. acc.: 83.33%, F-measure: 85.71%)
5: ∃ value.(gMonth[≥ --03 , ≤ --08]) (pred. acc.: 83.33%, F-measure: 85.71%)
6: ∃ value.(gMonth[≥ --03 , ≤ --07]) (pred. acc.: 83.33%, F-measure: 85.71%)
7: ∃ value.(gMonth[≥ --03 , ≤ --06]) (pred. acc.: 83.33%, F-measure: 85.71%)
8: ∃ value.(gMonth[≥ --02 , ≤ --05]) (pred. acc.: 83.33%, F-measure: 85.71%)
9: ∃ value.(gMonth[≥ --01 , ≤ --05]) (pred. acc.: 83.33%, F-measure: 85.71%)
10: Month ⊓ (∃ value.(gMonth[≤ --05])) (pred. acc.: 83.33%, F-measure: 85.71%)

start class:⊤
more accurate (50.00%) class expression found after 2ms: ⊤
more accurate (66.67%) class expression found after 36ms: ∃ value.(gMonth[≤ --11])
more accurate (83.33%) class expression found after 81ms: ∃ value.(gMonth[≤ --05])
more accurate (100.00%) class expression found after 405ms: ∃ value.(gMonth[≥ --03 , ≤ --05])
Algorithm terminated successfully (time: 3s 659ms, 1000 descriptions tested, 749 nodes in the search tree).

number of retrievals: 1048
retrieval reasoning time: 3s 322ms ( 3ms per retrieval)
(complex) subsumption checks: 70 (0 multiple)
subsumption reasoning time: 22ms ( 0ms per subsumption check)
overall reasoning time: 3s 344ms

solutions:
1: ∃ value.(gMonth[≥ --03 , ≤ --05]) (pred. acc.: 100.00%, F-measure: 100.00%)
2: ∃ value.(gMonth[≤ --05]) (pred. acc.: 83.33%, F-measure: 85.71%)
3: ∃ value.(gMonth[≥ --03 , ≤ --10]) (pred. acc.: 83.33%, F-measure: 85.71%)
4: ∃ value.(gMonth[≥ --03 , ≤ --09]) (pred. acc.: 83.33%, F-measure: 85.71%)
5: ∃ value.(gMonth[≥ --03 , ≤ --08]) (pred. acc.: 83.33%, F-measure: 85.71%)
6: ∃ value.(gMonth[≥ --03 , ≤ --07]) (pred. acc.: 83.33%, F-measure: 85.71%)
7: ∃ value.(gMonth[≥ --03 , ≤ --06]) (pred. acc.: 83.33%, F-measure: 85.71%)
8: ∃ value.(gMonth[≥ --02 , ≤ --05]) (pred. acc.: 83.33%, F-measure: 85.71%)
9: ∃ value.(gMonth[≥ --01 , ≤ --05]) (pred. acc.: 83.33%, F-measure: 85.71%)
10: Month ⊓ (∃ value.(gMonth[≤ --05])) (pred. acc.: 83.33%, F-measure: 85.71%)

4
-1
Same sorting:false
http://www.oracle.com/xml/jaxp/properties/entityExpansionLimit not supported by parser type org.apache.xerces.jaxp.SAXParserImpl
entityExpansionLimit not supported by parser type org.apache.xerces.jaxp.SAXParserImpl
Loaded reasoner: Pellet (com.clarkparsia.pellet.owlapiv3.PelletReasoner)
Materializing TBox...
...TBox materialised in 1 ms.
Loaded reasoner: Pellet (com.clarkparsia.pellet.owlapiv3.PelletReasoner)
start class:⊤
more accurate (50.00%) class expression found after 0ms: ⊤
more accurate (83.33%) class expression found after 3ms: ∃ value.(integer[≤ 101])
more accurate (100.00%) class expression found after 4ms: ∃ value.(integer[≤ 55])
Algorithm terminated successfully (time: 1s 30ms, 1000 descriptions tested, 864 nodes in the search tree).

number of retrievals: 1036
retrieval reasoning time: 17ms ( 0ms per retrieval)
(complex) subsumption checks: 40 (0 multiple)
subsumption reasoning time: 11ms ( 0ms per subsumption check)
overall reasoning time: 28ms

solutions:
1: ∃ value.(integer[≤ 9]) (pred. acc.: 100.00%, F-measure: 100.00%)
2: ∃ value.(integer[≤ 7]) (pred. acc.: 100.00%, F-measure: 100.00%)
3: ∃ value.(integer[≤ 6]) (pred. acc.: 100.00%, F-measure: 100.00%)
4: ∃ value.(integer[≤ 55]) (pred. acc.: 100.00%, F-measure: 100.00%)
5: ∃ value.(integer[≤ 5]) (pred. acc.: 100.00%, F-measure: 100.00%)
6: ∃ value.(integer[≤ 3]) (pred. acc.: 100.00%, F-measure: 100.00%)
7: ∃ value.(integer[≥ 1 , ≤ 9]) (pred. acc.: 100.00%, F-measure: 100.00%)
8: ∃ value.(integer[≥ 1 , ≤ 7]) (pred. acc.: 100.00%, F-measure: 100.00%)
9: ∃ value.(integer[≥ 1 , ≤ 6]) (pred. acc.: 100.00%, F-measure: 100.00%)
10: ∃ value.(integer[≥ 1 , ≤ 55]) (pred. acc.: 100.00%, F-measure: 100.00%)

start class:⊤
more accurate (50.00%) class expression found after 0ms: ⊤
more accurate (83.33%) class expression found after 31ms: ∃ value.(integer[≤ 101])
more accurate (100.00%) class expression found after 36ms: ∃ value.(integer[≤ 55])
Algorithm terminated successfully (time: 4s 472ms, 1000 descriptions tested, 864 nodes in the search tree).

number of retrievals: 1036
retrieval reasoning time: 3s 491ms ( 3ms per retrieval)
(complex) subsumption checks: 40 (0 multiple)
subsumption reasoning time: 11ms ( 0ms per subsumption check)
overall reasoning time: 3s 503ms

solutions:
1: ∃ value.(integer[≤ 9]) (pred. acc.: 100.00%, F-measure: 100.00%)
2: ∃ value.(integer[≤ 7]) (pred. acc.: 100.00%, F-measure: 100.00%)
3: ∃ value.(integer[≤ 6]) (pred. acc.: 100.00%, F-measure: 100.00%)
4: ∃ value.(integer[≤ 55]) (pred. acc.: 100.00%, F-measure: 100.00%)
5: ∃ value.(integer[≤ 5]) (pred. acc.: 100.00%, F-measure: 100.00%)
6: ∃ value.(integer[≤ 3]) (pred. acc.: 100.00%, F-measure: 100.00%)
7: ∃ value.(integer[≥ 1 , ≤ 9]) (pred. acc.: 100.00%, F-measure: 100.00%)
8: ∃ value.(integer[≥ 1 , ≤ 7]) (pred. acc.: 100.00%, F-measure: 100.00%)
9: ∃ value.(integer[≥ 1 , ≤ 6]) (pred. acc.: 100.00%, F-measure: 100.00%)
10: ∃ value.(integer[≥ 1 , ≤ 55]) (pred. acc.: 100.00%, F-measure: 100.00%)

http://www.oracle.com/xml/jaxp/properties/entityExpansionLimit not supported by parser type org.apache.xerces.jaxp.SAXParserImpl
entityExpansionLimit not supported by parser type org.apache.xerces.jaxp.SAXParserImpl
Loaded reasoner: Pellet (com.clarkparsia.pellet.owlapiv3.PelletReasoner)
Materializing TBox...
...TBox materialised in 3 ms.
Loaded reasoner: Pellet (com.clarkparsia.pellet.owlapiv3.PelletReasoner)
start class:⊤
more accurate (50.00%) class expression found after 0ms: ⊤
more accurate (83.33%) class expression found after 6ms: ∃ value.(float[≤ 101.0])
more accurate (100.00%) class expression found after 7ms: ∃ value.(float[≤ 55.0])
Algorithm terminated successfully (time: 1s 92ms, 1000 descriptions tested, 859 nodes in the search tree).

number of retrievals: 1085
retrieval reasoning time: 18ms ( 0ms per retrieval)
(complex) subsumption checks: 109 (0 multiple)
subsumption reasoning time: 44ms ( 0ms per subsumption check)
overall reasoning time: 62ms

solutions:
1: ∃ value.(float[≤ 9.5]) (pred. acc.: 100.00%, F-measure: 100.00%)
2: ∃ value.(float[≤ 7.5]) (pred. acc.: 100.00%, F-measure: 100.00%)
3: ∃ value.(float[≤ 6.5]) (pred. acc.: 100.00%, F-measure: 100.00%)
4: ∃ value.(float[≤ 55.0]) (pred. acc.: 100.00%, F-measure: 100.00%)
5: ∃ value.(float[≤ 5.5]) (pred. acc.: 100.00%, F-measure: 100.00%)
6: ∃ value.(float[≤ 3.5]) (pred. acc.: 100.00%, F-measure: 100.00%)
7: ∃ value.(float[≥ 1.0 , ≤ 9.5]) (pred. acc.: 100.00%, F-measure: 100.00%)
8: ∃ value.(float[≥ 1.0 , ≤ 7.5]) (pred. acc.: 100.00%, F-measure: 100.00%)
9: ∃ value.(float[≥ 1.0 , ≤ 6.5]) (pred. acc.: 100.00%, F-measure: 100.00%)
10: ∃ value.(float[≥ 1.0 , ≤ 55.0]) (pred. acc.: 100.00%, F-measure: 100.00%)

start class:⊤
more accurate (50.00%) class expression found after 0ms: ⊤
more accurate (83.33%) class expression found after 37ms: ∃ value.(float[≤ 101.0])
more accurate (100.00%) class expression found after 62ms: ∃ value.(float[≤ 55.0])
Algorithm terminated successfully (time: 5s 212ms, 1000 descriptions tested, 859 nodes in the search tree).

number of retrievals: 1085
retrieval reasoning time: 4s 60ms ( 3ms per retrieval)
(complex) subsumption checks: 109 (0 multiple)
subsumption reasoning time: 28ms ( 0ms per subsumption check)
overall reasoning time: 4s 89ms

solutions:
1: ∃ value.(float[≤ 9.5]) (pred. acc.: 100.00%, F-measure: 100.00%)
2: ∃ value.(float[≤ 7.5]) (pred. acc.: 100.00%, F-measure: 100.00%)
3: ∃ value.(float[≤ 6.5]) (pred. acc.: 100.00%, F-measure: 100.00%)
4: ∃ value.(float[≤ 55.0]) (pred. acc.: 100.00%, F-measure: 100.00%)
5: ∃ value.(float[≤ 5.5]) (pred. acc.: 100.00%, F-measure: 100.00%)
6: ∃ value.(float[≤ 3.5]) (pred. acc.: 100.00%, F-measure: 100.00%)
7: ∃ value.(float[≥ 1.0 , ≤ 9.5]) (pred. acc.: 100.00%, F-measure: 100.00%)
8: ∃ value.(float[≥ 1.0 , ≤ 7.5]) (pred. acc.: 100.00%, F-measure: 100.00%)
9: ∃ value.(float[≥ 1.0 , ≤ 6.5]) (pred. acc.: 100.00%, F-measure: 100.00%)
10: ∃ value.(float[≥ 1.0 , ≤ 55.0]) (pred. acc.: 100.00%, F-measure: 100.00%)

http://www.oracle.com/xml/jaxp/properties/entityExpansionLimit not supported by parser type org.apache.xerces.jaxp.SAXParserImpl
entityExpansionLimit not supported by parser type org.apache.xerces.jaxp.SAXParserImpl
Loaded reasoner: Pellet (com.clarkparsia.pellet.owlapiv3.PelletReasoner)
Materializing TBox...
...TBox materialised in 1 ms.
Loaded reasoner: Pellet (com.clarkparsia.pellet.owlapiv3.PelletReasoner)
start class:⊤
more accurate (50.00%) class expression found after 0ms: ⊤
more accurate (66.67%) class expression found after 3ms: ∃ value.(date[≤ 2001-09-24])
more accurate (83.33%) class expression found after 6ms: ∃ value.(date[≤ 1971-09-24])
more accurate (100.00%) class expression found after 31ms: ∃ value.(date[≥ 1970-01-22 , ≤ 1971-09-24])
Algorithm terminated successfully (time: 346ms, 1000 descriptions tested, 743 nodes in the search tree).

number of retrievals: 1048
retrieval reasoning time: 111ms ( 0ms per retrieval)
(complex) subsumption checks: 70 (0 multiple)
subsumption reasoning time: 17ms ( 0ms per subsumption check)
overall reasoning time: 129ms

solutions:
1: ∃ value.(date[≥ 1970-01-22 , ≤ 1971-09-24]) (pred. acc.: 100.00%, F-measure: 100.00%)
2: ∃ value.(date[≤ 1971-09-24]) (pred. acc.: 83.33%, F-measure: 85.71%)
3: ∃ value.(date[≥ 1970-01-22 , ≤ 1999-03-03]) (pred. acc.: 83.33%, F-measure: 85.71%)
4: ∃ value.(date[≥ 1970-01-22 , ≤ 1980-04-10]) (pred. acc.: 83.33%, F-measure: 85.71%)
5: ∃ value.(date[≥ 1970-01-22 , ≤ 1976-11-29]) (pred. acc.: 83.33%, F-measure: 85.71%)
6: ∃ value.(date[≥ 1970-01-22 , ≤ 1974-10-06]) (pred. acc.: 83.33%, F-measure: 85.71%)
7: ∃ value.(date[≥ 1970-01-22 , ≤ 1972-03-24]) (pred. acc.: 83.33%, F-measure: 85.71%)
8: ∃ value.(date[≥ 1970-01-05 , ≤ 1971-09-24]) (pred. acc.: 83.33%, F-measure: 85.71%)
9: ∃ value.(date[≥ 1950-12-31 , ≤ 1971-09-24]) (pred. acc.: 83.33%, F-measure: 85.71%)
10: Number ⊓ (∃ value.(date[≤ 1971-09-24])) (pred. acc.: 83.33%, F-measure: 85.71%)

start class:⊤
more accurate (50.00%) class expression found after 0ms: ⊤
more accurate (66.67%) class expression found after 18ms: ∃ value.(date[≤ 2001-09-24])
more accurate (83.33%) class expression found after 57ms: ∃ value.(date[≤ 1971-09-24])
more accurate (100.00%) class expression found after 322ms: ∃ value.(date[≥ 1970-01-22 , ≤ 1971-09-24])
Algorithm terminated successfully (time: 3s 995ms, 1000 descriptions tested, 743 nodes in the search tree).

number of retrievals: 1048
retrieval reasoning time: 3s 721ms ( 3ms per retrieval)
(complex) subsumption checks: 70 (0 multiple)
subsumption reasoning time: 9ms ( 0ms per subsumption check)
overall reasoning time: 3s 731ms

solutions:
1: ∃ value.(date[≥ 1970-01-22 , ≤ 1971-09-24]) (pred. acc.: 100.00%, F-measure: 100.00%)
2: ∃ value.(date[≤ 1971-09-24]) (pred. acc.: 83.33%, F-measure: 85.71%)
3: ∃ value.(date[≥ 1970-01-22 , ≤ 1999-03-03]) (pred. acc.: 83.33%, F-measure: 85.71%)
4: ∃ value.(date[≥ 1970-01-22 , ≤ 1980-04-10]) (pred. acc.: 83.33%, F-measure: 85.71%)
5: ∃ value.(date[≥ 1970-01-22 , ≤ 1976-11-29]) (pred. acc.: 83.33%, F-measure: 85.71%)
6: ∃ value.(date[≥ 1970-01-22 , ≤ 1974-10-06]) (pred. acc.: 83.33%, F-measure: 85.71%)
7: ∃ value.(date[≥ 1970-01-22 , ≤ 1972-03-24]) (pred. acc.: 83.33%, F-measure: 85.71%)
8: ∃ value.(date[≥ 1970-01-05 , ≤ 1971-09-24]) (pred. acc.: 83.33%, F-measure: 85.71%)
9: ∃ value.(date[≥ 1950-12-31 , ≤ 1971-09-24]) (pred. acc.: 83.33%, F-measure: 85.71%)
10: Number ⊓ (∃ value.(date[≤ 1971-09-24])) (pred. acc.: 83.33%, F-measure: 85.71%)

Tests run: 9, Failures: 0, Errors: 0, Skipped: 0, Time elapsed: 37.075 sec - in org.dllearner.test.junit.LiteralLearningTest
Running org.dllearner.test.junit.ClassExpressionTest
http://www.oracle.com/xml/jaxp/properties/entityExpansionLimit not supported by parser type org.apache.xerces.jaxp.SAXParserImpl
entityExpansionLimit not supported by parser type org.apache.xerces.jaxp.SAXParserImpl
Loaded reasoner: Pellet (com.clarkparsia.pellet.owlapiv3.PelletReasoner)
http://www.oracle.com/xml/jaxp/properties/entityExpansionLimit not supported by parser type org.apache.xerces.jaxp.SAXParserImpl
entityExpansionLimit not supported by parser type org.apache.xerces.jaxp.SAXParserImpl
Unparsed triple: http://acl/BMV#notHasPrognosis -> http://www.w3.org/2002/07/owl#disjointObjectProperties -> http://acl/BMV#hasPrognosis
Unparsed triple: http://acl/BMV#hasNegIntent -> http://www.w3.org/2002/07/owl#disjointObjectProperties -> http://acl/BMV#hasPosIntent
Unparsed triple: http://acl/BMV#hasTreatment -> http://www.w3.org/2002/07/owl#disjointObjectProperties -> http://acl/BMV#notHasTreatment
Loaded reasoner: Pellet (com.clarkparsia.pellet.owlapiv3.PelletReasoner)
[[<p1>]] ? [[<p1>]]
[[<p1>]] ? [[<p1>]]
[[<p2>, <p1>], [<p2>]] ? [[<p2>, <p1>], [<p2>]]
[[<p1>]] ? [[<p1>]]
[[<p3>, <p2>, <p1>], [<p3>, <p2>]] ? [[<p3>, <p2>, <p1>], [<p3>, <p2>]]
Tests run: 4, Failures: 0, Errors: 0, Skipped: 0, Time elapsed: 0.334 sec - in org.dllearner.test.junit.ClassExpressionTest
Running org.dllearner.test.junit.ELDownTest
http://www.oracle.com/xml/jaxp/properties/entityExpansionLimit not supported by parser type org.apache.xerces.jaxp.SAXParserImpl
entityExpansionLimit not supported by parser type org.apache.xerces.jaxp.SAXParserImpl
Loaded reasoner: Pellet (com.clarkparsia.pellet.owlapiv3.PelletReasoner)
Galen loaded.
false
TEST 1
Loaded reasoner: Pellet (com.clarkparsia.pellet.owlapiv3.PelletReasoner)
refining: human ⊓ (∃ has.animal)
desired: human ⊓ (∃ has.animal) ⊓ (∃ has.(∃ has.⊤))
desired: human ⊓ (∃ has.animal) ⊓ (∃ has.human)
desired: human ⊓ (∃ has.animal) ⊓ (∃ hasChild.⊤)
desired: human ⊓ (∃ has.animal) ⊓ (∃ hasPet.⊤)
desired: human ⊓ (∃ has.(animal ⊓ (∃ has.⊤)))
desired: human ⊓ (∃ has.bird)
desired: human ⊓ (∃ has.cat)
desired: human ⊓ (∃ hasPet.animal)

produced refinements and their unit test status (true = assertion satisfied):
true: human ⊓ (∃ has.animal) ⊓ (∃ hasPet.⊤)
true: human ⊓ (∃ has.cat)
true: human ⊓ (∃ has.animal) ⊓ (∃ hasChild.⊤)
true: human ⊓ (∃ hasPet.animal)
true: human ⊓ (∃ has.animal) ⊓ (∃ has.(∃ has.⊤))
true: human ⊓ (∃ has.(animal ⊓ (∃ has.⊤)))
true: human ⊓ (∃ has.animal) ⊓ (∃ has.human)
true: human ⊓ (∃ has.bird)
TEST 2
desired: human ⊓ ((∃ has.(animal ⊓ (∃ has.⊤))) ⊓ (∃ hasPet.bird))
desired: human ⊓ ((∃ has.(bird ⊓ (∃ has.⊤))) ⊓ (∃ hasPet.bird))
desired: human ⊓ ((∃ has.(bird ⊓ cat)) ⊓ (∃ hasPet.bird))
desired: human ⊓ ((∃ has.(∃ has.⊤)) ⊓ (∃ hasPet.bird))
desired: human ⊓ ((∃ has.cat) ⊓ (∃ hasPet.bird))
desired: human ⊓ ((∃ has.human) ⊓ (∃ hasPet.bird))
desired: human ⊓ ((∃ hasChild.⊤) ⊓ (∃ hasPet.bird))
desired: human ⊓ ((∃ hasPet.bird) ⊓ (∃ hasPet.(animal ⊓ (∃ has.⊤))))
desired: human ⊓ ((∃ hasPet.bird) ⊓ (∃ hasPet.(∃ has.⊤)))
desired: human ⊓ ((∃ hasPet.bird) ⊓ (∃ hasPet.cat))
desired: human ⊓ ((∃ hasPet.bird) ⊓ (∃ hasPet.human))
desired: human ⊓ (∃ hasPet.(bird ⊓ (∃ has.⊤)))
desired: human ⊓ (∃ hasPet.(bird ⊓ cat))

produced refinements and their unit test status (true = assertion satisfied):
TEST 3
desired: human ⊓ (∃ has.animal) ⊓ (∃ has.⊤) ⊓ (∃ hasChild.human)
desired: human ⊓ (∃ has.animal) ⊓ (∃ has.(∃ has.⊤)) ⊓ (∃ hasChild.human)
desired: human ⊓ (∃ has.(animal ⊓ (∃ has.⊤))) ⊓ (∃ hasChild.human)
desired: human ⊓ (∃ has.(animal ⊓ human)) ⊓ (∃ hasChild.human)
desired: human ⊓ (∃ has.bird) ⊓ (∃ hasChild.human)
desired: human ⊓ (∃ has.cat) ⊓ (∃ hasChild.human)
desired: human ⊓ (∃ hasChild.human) ⊓ (∃ hasPet.animal)
desired: animal ⊓ human ⊓ (∃ has.animal) ⊓ (∃ hasChild.human)

produced refinements and their unit test status (true = assertion satisfied):
true: human ⊓ (∃ has.cat) ⊓ (∃ hasChild.human)
true: human ⊓ (∃ has.bird) ⊓ (∃ hasChild.human)
Galen loaded.
∃ wheels.⊤
∃ load_count.⊤
∃ hasShape.⊤
∃ has_car.⊤
∃ load.⊤
Tests run: 6, Failures: 0, Errors: 0, Skipped: 0, Time elapsed: 47.651 sec - in org.dllearner.test.junit.ELDownTest
Running org.dllearner.test.junit.LearningProblemTest
Tests run: 1, Failures: 0, Errors: 0, Skipped: 0, Time elapsed: 0.076 sec - in org.dllearner.test.junit.LearningProblemTest
Running org.dllearner.test.junit.ELDescriptionTreeTest
Tests run: 3, Failures: 0, Errors: 0, Skipped: 0, Time elapsed: 0.162 sec - in org.dllearner.test.junit.ELDescriptionTreeTest
Running org.dllearner.utilities.owl.SimpleOntologyToByteConverterTest
Tests run: 1, Failures: 0, Errors: 0, Skipped: 0, Time elapsed: 0.08 sec - in org.dllearner.utilities.owl.SimpleOntologyToByteConverterTest
Running org.dllearner.utilities.owl.OWLClassExpressionTest
length of ∃ p1.(integer[≥ 10]) is 2
length of ∃ p1.(int[≤ 20]) is 2
length of ∃ p1.{true} is 2
length of ∀ op1.⊤ is 3
length of ∃ op1⁻.⊤ is 3
length of ≤ 3 op1.⊤ is 4
length of ≥ 3 op1.⊤ is 4
length of ∀ op1.C is 3
length of ∀ op1.(¬C) is 3
Tests run: 1, Failures: 0, Errors: 0, Skipped: 0, Time elapsed: 0.001 sec - in org.dllearner.utilities.owl.OWLClassExpressionTest
Running org.dllearner.utilities.NonStandardReasoningServicesTest
Tests run: 1, Failures: 0, Errors: 0, Skipped: 0, Time elapsed: 0.077 sec - in org.dllearner.utilities.NonStandardReasoningServicesTest
Running org.dllearner.utilities.split.DataValuesSplitterTest
{r=[1, 7, 13, 20, 26, 33, 40, 46, 53, 60]}
@prefix : <http://example.org/> .
@prefix owl: <http://www.w3.org/2002/07/owl#> .
@prefix rdfs: <http://www.w3.org/2000/01/rdf-schema#> .
@prefix rdf: <http://www.w3.org/1999/02/22-rdf-syntax-ns#> .
@prefix xsd: <http://www.w3.org/2001/XMLSchema#> .
:r a owl:DatatypeProperty ; rdfs:range xsd:nonNegativeInteger . 
:p0 :r "1"^^xsd:nonNegativeInteger .
:p1 :r "2"^^xsd:nonNegativeInteger .
:p2 :r "3"^^xsd:nonNegativeInteger .
:p3 :r "4"^^xsd:nonNegativeInteger .
:p4 :r "5"^^xsd:nonNegativeInteger .
:p5 :r "6"^^xsd:nonNegativeInteger .
:p6 :r "10"^^xsd:nonNegativeInteger .
:p7 :r "12"^^xsd:nonNegativeInteger .
:p8 :r "16"^^xsd:nonNegativeInteger .
:p9 :r "20"^^xsd:nonNegativeInteger .
:p10 :r "28"^^xsd:nonNegativeInteger .
:p11 :r "30"^^xsd:nonNegativeInteger .

{r=[1, 4, 14, 30]}
{r=[1, 5, 28]}
Tests run: 3, Failures: 0, Errors: 0, Skipped: 0, Time elapsed: 0.251 sec - in org.dllearner.utilities.split.DataValuesSplitterTest

Results :

Tests run: 95, Failures: 0, Errors: 0, Skipped: 0

[JENKINS] Recording test results
[INFO] 
[INFO] --- jacoco-maven-plugin:0.7.6.201602180812:report (report) @ components-core ---
[INFO] Analyzed bundle 'DL Learner Core Components' with 552 classes
[INFO] 
[INFO] --- maven-jar-plugin:3.0.2:jar (default-jar) @ components-core ---
[INFO] Building jar: /usr/share/tomcat6/.jenkins/jobs/DL-Learner Merge-M/branches/leap-alternative/workspace/components-core/target/components-core-1.3.1-SNAPSHOT.jar
[INFO] 
[INFO] --- maven-jar-plugin:3.0.2:test-jar (default) @ components-core ---
[INFO] Building jar: /usr/share/tomcat6/.jenkins/jobs/DL-Learner Merge-M/branches/leap-alternative/workspace/components-core/target/components-core-1.3.1-SNAPSHOT-tests.jar
[INFO] 
[INFO] --- maven-install-plugin:2.4:install (default-install) @ components-core ---
[INFO] Installing /usr/share/tomcat6/.jenkins/jobs/DL-Learner Merge-M/branches/leap-alternative/workspace/components-core/target/components-core-1.3.1-SNAPSHOT.jar to /usr/share/tomcat6/.m2/repository/org/dllearner/components-core/1.3.1-SNAPSHOT/components-core-1.3.1-SNAPSHOT.jar
[INFO] Installing /usr/share/tomcat6/.jenkins/jobs/DL-Learner Merge-M/branches/leap-alternative/workspace/components-core/pom.xml to /usr/share/tomcat6/.m2/repository/org/dllearner/components-core/1.3.1-SNAPSHOT/components-core-1.3.1-SNAPSHOT.pom
[INFO] Installing /usr/share/tomcat6/.jenkins/jobs/DL-Learner Merge-M/branches/leap-alternative/workspace/components-core/target/components-core-1.3.1-SNAPSHOT-tests.jar to /usr/share/tomcat6/.m2/repository/org/dllearner/components-core/1.3.1-SNAPSHOT/components-core-1.3.1-SNAPSHOT-tests.jar
[INFO]                                                                         
[INFO] ------------------------------------------------------------------------
[INFO] Building components-ext 1.3.1-SNAPSHOT
[INFO] ------------------------------------------------------------------------
[INFO] Downloading: http://maven.aksw.org/repository/snapshots/unife/edge/3.3.2-SNAPSHOT/maven-metadata.xml
[INFO] Downloading: http://maven.aksw.org/repository/internal/unife/edge/3.3.2-SNAPSHOT/maven-metadata.xml
[INFO] Downloading: https://api.bitbucket.org/1.0/repositories/giuseta/ml-unife-maven-repository.git/raw/snapshots/unife/edge/3.3.2-SNAPSHOT/maven-metadata.xml
[INFO] Downloading: http://dev.davidsoergel.com/nexus/content/repositories/releases/unife/edge/3.3.2-SNAPSHOT/maven-metadata.xml
[INFO] Downloaded: https://api.bitbucket.org/1.0/repositories/giuseta/ml-unife-maven-repository.git/raw/snapshots/unife/edge/3.3.2-SNAPSHOT/maven-metadata.xml (759 B at 0.8 KB/sec)
[INFO] Downloading: https://api.bitbucket.org/1.0/repositories/giuseta/ml-unife-maven-repository.git/raw/snapshots/unife/bundle/2.3.1-SNAPSHOT/maven-metadata.xml
[INFO] Downloading: http://maven.aksw.org/repository/snapshots/unife/bundle/2.3.1-SNAPSHOT/maven-metadata.xml
[INFO] Downloading: http://dev.davidsoergel.com/nexus/content/repositories/releases/unife/bundle/2.3.1-SNAPSHOT/maven-metadata.xml
[INFO] Downloading: http://maven.aksw.org/repository/internal/unife/bundle/2.3.1-SNAPSHOT/maven-metadata.xml
[INFO] Downloading: https://api.bitbucket.org/1.0/repositories/giuseta/ml-unife-maven-repository.git/raw/snapshots/unife/bundle/2.3.1-SNAPSHOT/maven-metadata.xml
[INFO] Downloaded: https://api.bitbucket.org/1.0/repositories/giuseta/ml-unife-maven-repository.git/raw/snapshots/unife/bundle/2.3.1-SNAPSHOT/maven-metadata.xml (761 B at 2.6 KB/sec)
[INFO] Downloaded: https://api.bitbucket.org/1.0/repositories/giuseta/ml-unife-maven-repository.git/raw/snapshots/unife/bundle/2.3.1-SNAPSHOT/maven-metadata.xml (761 B at 1.5 KB/sec)
[INFO] Downloading: http://maven.aksw.org/repository/snapshots/unife/unife-math/1.0-SNAPSHOT/maven-metadata.xml
[INFO] Downloading: http://maven.aksw.org/repository/internal/unife/unife-math/1.0-SNAPSHOT/maven-metadata.xml
[INFO] Downloading: https://api.bitbucket.org/1.0/repositories/giuseta/ml-unife-maven-repository.git/raw/snapshots/unife/unife-math/1.0-SNAPSHOT/maven-metadata.xml
[INFO] Downloading: http://dev.davidsoergel.com/nexus/content/repositories/releases/unife/unife-math/1.0-SNAPSHOT/maven-metadata.xml
[INFO] Downloading: https://api.bitbucket.org/1.0/repositories/giuseta/ml-unife-maven-repository.git/raw/snapshots/unife/unife-math/1.0-SNAPSHOT/maven-metadata.xml
[INFO] Downloading: https://api.bitbucket.org/1.0/repositories/machinelearningunife/ml-unife-maven-repository.git/raw/releases/unife/unife-math/1.0-SNAPSHOT/maven-metadata.xml
[INFO] Downloading: https://api.bitbucket.org/1.0/repositories/machinelearningunife/ml-unife-maven-repository.git/raw/snapshots/unife/unife-math/1.0-SNAPSHOT/maven-metadata.xml
[INFO] Downloaded: https://api.bitbucket.org/1.0/repositories/machinelearningunife/ml-unife-maven-repository.git/raw/snapshots/unife/unife-math/1.0-SNAPSHOT/maven-metadata.xml (759 B at 1.6 KB/sec)
[INFO] 
[INFO] --- maven-clean-plugin:2.5:clean (default-clean) @ components-ext ---
[INFO] 
[INFO] --- maven-resources-plugin:3.0.1:resources (default-resources) @ components-ext ---
[INFO] Using 'UTF-8' encoding to copy filtered resources.
[INFO] Copying 58 resources
[INFO] 
[INFO] --- maven-compiler-plugin:3.5.1:compile (default-compile) @ components-ext ---
[INFO] Changes detected - recompiling the module!
[INFO] Compiling 105 source files to /usr/share/tomcat6/.jenkins/jobs/DL-Learner Merge-M/branches/leap-alternative/workspace/components-ext/target/classes
[INFO] /usr/share/tomcat6/.jenkins/jobs/DL-Learner Merge-M/branches/leap-alternative/workspace/components-ext/src/main/java/org/dllearner/unife/algorithms/probabilistic/parameter/edge/DummyParameterLearner.java: Some input files use unchecked or unsafe operations.
[INFO] /usr/share/tomcat6/.jenkins/jobs/DL-Learner Merge-M/branches/leap-alternative/workspace/components-ext/src/main/java/org/dllearner/unife/algorithms/probabilistic/parameter/edge/DummyParameterLearner.java: Recompile with -Xlint:unchecked for details.
[INFO] 
[INFO] --- maven-resources-plugin:3.0.1:testResources (default-testResources) @ components-ext ---
[INFO] Using 'UTF-8' encoding to copy filtered resources.
[INFO] Copying 30 resources
[INFO] 
[INFO] --- maven-compiler-plugin:3.5.1:testCompile (default-testCompile) @ components-ext ---
[INFO] Changes detected - recompiling the module!
[INFO] Compiling 3 source files to /usr/share/tomcat6/.jenkins/jobs/DL-Learner Merge-M/branches/leap-alternative/workspace/components-ext/target/test-classes
[INFO] 
[INFO] --- maven-surefire-plugin:2.18.1:test (default-test) @ components-ext ---
[INFO] Surefire report directory: /usr/share/tomcat6/.jenkins/jobs/DL-Learner Merge-M/branches/leap-alternative/workspace/components-ext/target/surefire-reports

-------------------------------------------------------
 T E S T S
-------------------------------------------------------
Running org.dllearner.algorithms.miles.MILESTest
log4j: Trying to find [log4j.properties] using context classloader sun.misc.Launcher$AppClassLoader@135fbaa4.
log4j: Using URL [file:/usr/share/tomcat6/.jenkins/jobs/DL-Learner%20Merge-M/branches/leap-alternative/workspace/components-ext/target/test-classes/log4j.properties] for automatic log4j configuration.
log4j: Reading configuration from URL file:/usr/share/tomcat6/.jenkins/jobs/DL-Learner%20Merge-M/branches/leap-alternative/workspace/components-ext/target/test-classes/log4j.properties
log4j: Parsing for [root] with value=[DEBUG, stdout].
log4j: Level token is [DEBUG].
log4j: Category root set to DEBUG
log4j: Parsing appender named "stdout".
log4j: Parsing layout options for "stdout".
log4j: Setting property [conversionPattern] to [%m%n].
log4j: End of parsing for "stdout".
log4j: Setting property [target] to [System.out].
log4j: Parsed "stdout" options.
log4j: Parsing for [unife] with value=[INFO, APPENDER_OUT].
log4j: Level token is [INFO].
log4j: Category unife set to INFO
log4j: Parsing appender named "APPENDER_OUT".
log4j: Parsing layout options for "APPENDER_OUT".
log4j: Setting property [conversionPattern] to [%5p (%F:%L) - %m%n].
log4j: End of parsing for "APPENDER_OUT".
log4j: Parsed "APPENDER_OUT" options.
log4j: Handling log4j.additivity.unife=[null]
log4j: Parsing for [org.apache.http.wire] with value=[OFF].
log4j: Level token is [OFF].
log4j: Category org.apache.http.wire set to OFF
log4j: Handling log4j.additivity.org.apache.http.wire=[null]
log4j: Parsing for [org.apache.solr.level] with value=[OFF].
log4j: Level token is [OFF].
log4j: Category org.apache.solr.level set to OFF
log4j: Handling log4j.additivity.org.apache.solr.level=[null]
log4j: Parsing for [org.dllearner.sparqlquerygenerator] with value=[OFF].
log4j: Level token is [OFF].
log4j: Category org.dllearner.sparqlquerygenerator set to OFF
log4j: Handling log4j.additivity.org.dllearner.sparqlquerygenerator=[null]
log4j: Parsing for [org.apache.http] with value=[OFF].
log4j: Level token is [OFF].
log4j: Category org.apache.http set to OFF
log4j: Handling log4j.additivity.org.apache.http=[null]
log4j: Parsing for [org.dllearner.algorithm.tbsl] with value=[INFO].
log4j: Level token is [INFO].
log4j: Category org.dllearner.algorithm.tbsl set to INFO
log4j: Handling log4j.additivity.org.dllearner.algorithm.tbsl=[null]
log4j: Parsing for [org.dllearner.algorithm.tbsl.templator] with value=[WARN].
log4j: Level token is [WARN].
log4j: Category org.dllearner.algorithm.tbsl.templator set to WARN
log4j: Handling log4j.additivity.org.dllearner.algorithm.tbsl.templator=[null]
log4j: Parsing for [org.dllearner.autosparql.server] with value=[OFF].
log4j: Level token is [OFF].
log4j: Category org.dllearner.autosparql.server set to OFF
log4j: Handling log4j.additivity.org.dllearner.autosparql.server=[null]
log4j: Parsing for [org.dllearner.algorithm.tbsl.ltag.parser] with value=[WARN].
log4j: Level token is [WARN].
log4j: Category org.dllearner.algorithm.tbsl.ltag.parser set to WARN
log4j: Handling log4j.additivity.org.dllearner.algorithm.tbsl.ltag.parser=[null]
log4j: Parsing for [org.dllearner.algorithms.probabilistic] with value=[DEBUG, APPENDER_FILE, APPENDER_OUT].
log4j: Level token is [DEBUG].
log4j: Category org.dllearner.algorithms.probabilistic set to DEBUG
log4j: Parsing appender named "APPENDER_FILE".
log4j: Parsing layout options for "APPENDER_FILE".
log4j: Setting property [conversionPattern] to [%d{yyyy-MM-dd HH:mm:ss} %p [%C:%L] - %m%n].
log4j: End of parsing for "APPENDER_FILE".
log4j: Setting property [maxFileSize] to [10MB].
log4j: Setting property [file] to [log/leap.log].
log4j: Setting property [maxBackupIndex] to [1].
log4j: setFile called: log/leap.log, true
log4j: setFile ended
log4j: Parsed "APPENDER_FILE" options.
log4j: Parsing appender named "APPENDER_OUT".
log4j: Appender "APPENDER_OUT" was already parsed.
log4j: Handling log4j.additivity.org.dllearner.algorithms.probabilistic=[null]
log4j: Finished configuring.
Jena initialization
Add location: LocatorFile
Add location: ClassLoaderLocator
Failed to find configuration: file:location-mapping.rdf;file:location-mapping.n3;file:location-mapping.ttl;file:etc/location-mapping.rdf;file:etc/location-mapping.n3;file:etc/location-mapping.ttl
Add location: LocatorFile
Add location: LocatorURL
Add location: ClassLoaderLocator
Failed to find configuration: location-mapping.ttl;location-mapping.rdf;location-mapping.n3;etc/location-mapping.rdf;etc/location-mapping.n3;etc/location-mapping.ttl
System architecture: 64 bit
http://www.oracle.com/xml/jaxp/properties/entityExpansionLimit not supported by parser type org.apache.xerces.jaxp.SAXParserImpl
entityExpansionLimit not supported by parser type org.apache.xerces.jaxp.SAXParserImpl
Total number of triples: 999
list: <http://ns.softwiki.de/req/AbstractComment>
list: <http://ns.softwiki.de/req/AbstractRequirement>
list: <http://ns.softwiki.de/req/Keyword>
list: <http://ns.softwiki.de/req/AbstractComment>
list: <http://ns.softwiki.de/req/AbstractRequirement>
list: <http://ns.softwiki.de/req/Keyword>
list: <http://ns.softwiki.de/req/Requirement>
list: ObjectSomeValuesFrom(<http://ns.softwiki.de/req/isCreatedBy> <http://ns.softwiki.de/req/Customer>)
list: <http://ns.softwiki.de/req/Goal>
list: <http://ns.softwiki.de/req/Requirement>
list: <http://ns.softwiki.de/req/Requirement>
list: ObjectSomeValuesFrom(<http://ns.softwiki.de/req/willLeadTo> <http://ns.softwiki.de/req/SystemRequirement>)
list: <http://ns.softwiki.de/req/AbstractSource>
list: ObjectSomeValuesFrom(<http://ns.softwiki.de/req/leadsTo> <http://ns.softwiki.de/req/AbstractRequirement>)
Loaded OntologyID(OntologyIRI(<http://ns.softwiki.de/req/>) VersionIRI(<null>))
dumping remaining triples
done dumping remaining triples
Loaded reasoner: Pellet (com.clarkparsia.pellet.owlapiv3.PelletReasoner)
Materializing TBox...
materialising concepts
materialising object properties ...
finished materialising object properties.
materialising datatype properties
finished materialising data properties.
...TBox materialised in 105 ms.
Numeric Splits: {averageRate=[], rate=[]}
start class:Thing
Computing linear combination...
@relation rel

@attribute t {0,1}

@data
1
1
1
1
0
0
0
0
0
0
0
0
0
0
0
0
0
0
0
0
0
0
0
0
0
0
0
0
0
0
0
0
0
0
0
0
0
0
0
0
0
0
0
0
0
0
0
0
0
0
0
0
0
0
0
0
0
0
0
0
0
0
0
0
0
0
0
0
0
0
0
0
0
0
0
0
0
0
0
0
0
0
0
0
0
0
0
0
0
0
0
0
0
0
more accurate (15.62%) class expression found after 167ms: Thing
computeM
BOOL DPs:[]
Numeric DPs:[averageRate, rate]
most general properties:
`broader=0
`comments=4
`cui=0
`defines=5
`depentsOn=1
`details=1
`documentation=0
`entails=1
`invalidates=0
`isCommentedBy=1
`isCreatedBy=1
`isDefinedBy=2
`isDetailedBy=1
`isInvalidFor=0
`isLeadingTo=1
`isReleatedTo=0
`leadsTo=5
`rates=1
`refersTo=1
`relevantRequirements=5
`specifies=3
`undirectedrelation=0
`votes=1
`willLeadTo=1
`taggedWithTag=0
m: {1=[AbstractComment, AbstractReferencePoint, AbstractRequirement, AbstractSource, SystemRequirement, Image, Concept, Document], 2=[not (AllocatedRequirement), not (ApplicationPointer), not (ApplicationState), not (Author), not (Comment), not (Creditor), not (Customer), not (CustomerRequirement), not (DerivedRequirement), not (DesignRequirement), not (Document), not (FunctionalRequirement), not (Goal), not (Government), not (PerformanceRequirement), not (PriorityRating), not (Programmer), not (QualityRating), not (QualityRequirement), not (SeniorManagementStaff), not (SystemRequirement), not (TextualScenario), not (Topic), not (TradeUnion), not (Vote), not (Image), not (Concept), not (Document)], 3=[broader some Thing, comments some Thing, cui some Thing, defines some Thing, depentsOn some Thing, details some Thing, documentation some Thing, entails some Thing, invalidates some Thing, isCommentedBy some Thing, isCreatedBy some Thing, isDefinedBy some Thing, isDetailedBy some Thing, isInvalidFor some Thing, isLeadingTo some Thing, isReleatedTo some Thing, leadsTo some Thing, rates some Thing, refersTo some Thing, relevantRequirements some Thing, specifies some Thing, undirectedrelation some Thing, votes some Thing, willLeadTo some Thing, taggedWithTag some Thing, broader only Thing, comments only Thing, cui only Thing, defines only Thing, depentsOn only Thing, details only Thing, documentation only Thing, entails only Thing, invalidates only Thing, isCommentedBy only Thing, isCreatedBy only Thing, isDefinedBy only Thing, isDetailedBy only Thing, isInvalidFor only Thing, isLeadingTo only Thing, isReleatedTo only Thing, leadsTo only Thing, rates only Thing, refersTo only Thing, relevantRequirements only Thing, specifies only Thing, undirectedrelation only Thing, votes only Thing, willLeadTo only Thing, taggedWithTag only Thing], 4=[comments max 3 Thing, defines max 4 Thing, depentsOn max 0 Thing, details max 0 Thing, entails max 0 Thing, isCommentedBy max 0 Thing, isCreatedBy max 0 Thing, isDefinedBy max 1 Thing, isDetailedBy max 0 Thing, isLeadingTo max 0 Thing, leadsTo max 4 Thing, rates max 0 Thing, refersTo max 0 Thing, relevantRequirements max 4 Thing, specifies max 2 Thing, votes max 0 Thing, willLeadTo max 0 Thing]}
=== Summary ===

Correctly Classified Instances          90               95.7447 %
Incorrectly Classified Instances         4                4.2553 %
Kappa statistic                          0     
K&B Relative Info Score                433.5572 %
K&B Information Score                    1.3758 bits      0.0146 bits/instance
Class complexity | order 0              24.7899 bits      0.2637 bits/instance
Class complexity | scheme               24.8735 bits      0.2646 bits/instance
Complexity improvement     (Sf)         -0.0836 bits     -0.0009 bits/instance
Mean absolute error                      0.0817
Root mean squared error                  0.2033
Relative absolute error                 89.4343 %
Root relative squared error             99.8984 %
Coverage of cases (0.95 level)          95.7447 %
Mean rel. region size (0.95 level)      50      %
Total Number of Instances               94     

Operation took 495ms
Computing linear combination...
@relation rel

@attribute C_0 numeric
@attribute C_1 numeric
@attribute C_2 numeric
@attribute C_3 numeric
@attribute C_4 numeric
@attribute t {0,1}

@data
1,1,1,1,1,1
1,1,1,1,1,1
1,1,1,1,1,1
1,1,1,1,1,1
1,0,0,1,1,0
1,1,1,1,1,0
1,0,0,1,1,0
1,1,1,1,1,0
1,1,1,1,1,0
1,0,0,1,1,0
1,1,1,1,1,0
1,0,0,1,1,0
1,0,0,1,1,0
1,1,1,1,1,0
1,0,0,1,1,0
1,0,0,1,1,0
1,1,1,1,1,0
1,1,1,1,1,0
1,0,0,1,1,0
1,1,1,1,1,0
1,0,0,1,1,0
1,0,1,1,1,0
1,0,0,1,0,0
1,0,0,0,1,0
1,1,1,1,1,0
1,0,0,1,1,0
1,1,1,1,1,0
1,0,0,1,1,0
1,0,1,1,1,0
1,0,0,1,1,0
1,1,1,1,1,0
1,0,1,1,1,0
1,1,1,1,1,0
1,0,0,1,1,0
1,1,1,1,1,0
1,0,0,1,1,0
1,0,0,1,1,0
1,0,0,0,1,0
1,0,1,1,1,0
1,1,1,1,1,0
1,0,0,1,1,0
1,0,0,1,1,0
1,0,0,1,0,0
1,0,0,1,1,0
1,0,1,1,1,0
1,0,0,1,1,0
1,0,0,1,0,0
1,0,1,1,1,0
1,1,1,1,1,0
1,0,0,1,1,0
1,0,0,1,0,0
1,0,0,1,1,0
1,0,0,1,1,0
1,1,1,1,1,0
1,0,0,1,1,0
1,0,1,1,1,0
1,0,0,1,1,0
1,0,1,1,1,0
1,0,1,1,1,0
1,0,1,1,1,0
1,0,0,1,1,0
1,0,1,1,1,0
1,0,1,1,1,0
1,0,1,1,1,0
1,1,1,1,1,0
1,0,0,1,1,0
1,0,0,0,1,0
1,1,1,1,1,0
1,0,1,1,1,0
1,0,0,1,1,0
1,0,0,1,1,0
1,0,1,1,1,0
1,0,0,1,0,0
1,0,0,1,0,0
1,0,0,1,1,0
1,1,1,1,1,0
1,1,1,1,1,0
1,0,0,0,1,0
1,0,0,1,1,0
1,1,1,1,1,0
1,0,0,0,1,0
1,0,0,1,1,0
1,1,1,1,1,0
1,0,0,0,1,0
1,0,0,1,1,0
1,0,0,1,0,0
1,1,1,1,1,0
1,0,0,1,0,0
1,1,1,1,1,0
1,0,0,1,1,0
1,1,1,1,1,0
1,1,1,1,1,0
1,1,1,1,1,0
1,0,0,1,1,0
=== Summary ===

Correctly Classified Instances          90               95.7447 %
Incorrectly Classified Instances         4                4.2553 %
Kappa statistic                          0     
K&B Relative Info Score                433.5572 %
K&B Information Score                    1.3758 bits      0.0146 bits/instance
Class complexity | order 0              24.7899 bits      0.2637 bits/instance
Class complexity | scheme               24.8735 bits      0.2646 bits/instance
Complexity improvement     (Sf)         -0.0836 bits     -0.0009 bits/instance
Mean absolute error                      0.0817
Root mean squared error                  0.2033
Relative absolute error                 89.4343 %
Root relative squared error             99.8984 %
Coverage of cases (0.95 level)          95.7447 %
Mean rel. region size (0.95 level)      50      %
Total Number of Instances               94     

Operation took 205ms
more accurate (43.75%) class expression found after 1s473ms: not (PerformanceRequirement)
more accurate (100.00%) class expression found after 1s828ms: isCreatedBy some Customer
Computing linear combination...
@relation rel

@attribute C_0 numeric
@attribute C_1 numeric
@attribute C_2 numeric
@attribute C_3 numeric
@attribute C_4 numeric
@attribute t {0,1}

@data
1,1,1,1,1,1
1,1,1,1,1,1
1,1,1,1,1,1
1,1,1,1,1,1
0,0,0,1,0,0
0,0,1,0,1,0
0,0,0,1,0,0
0,0,1,1,1,0
0,0,1,0,1,0
0,0,0,1,0,0
0,1,0,1,1,0
0,0,0,1,0,0
0,0,0,1,0,0
0,0,0,1,0,0
0,0,0,1,0,0
0,0,0,1,0,0
0,0,0,1,0,0
0,0,0,1,0,0
0,0,0,1,0,0
0,0,1,1,1,0
0,0,0,1,0,0
0,0,0,1,0,0
0,0,0,1,0,0
0,0,0,1,0,0
0,0,0,1,0,0
0,0,0,1,0,0
0,0,1,0,1,0
0,0,0,1,0,0
0,0,0,1,0,0
0,0,0,1,0,0
0,0,0,1,0,0
0,0,0,1,0,0
0,0,0,1,0,0
0,0,0,1,0,0
0,0,1,0,1,0
0,0,0,1,0,0
0,0,0,1,0,0
0,0,0,1,0,0
0,0,1,1,1,0
0,0,1,0,1,0
0,0,0,1,0,0
0,0,0,1,0,0
0,0,0,1,0,0
0,0,0,1,0,0
0,1,0,1,1,0
0,0,0,1,0,0
0,0,0,1,0,0
0,0,0,1,0,0
0,0,1,0,1,0
0,0,0,1,0,0
0,0,0,1,0,0
0,0,0,1,0,0
0,0,0,1,0,0
0,1,0,1,1,0
0,0,0,1,0,0
0,0,0,1,0,0
0,0,0,1,0,0
0,0,0,1,0,0
0,0,0,1,0,0
0,0,0,1,0,0
0,0,0,1,0,0
0,0,0,1,0,0
0,0,0,1,0,0
0,0,0,1,0,0
0,0,1,0,1,0
0,0,0,1,0,0
0,0,0,1,0,0
0,0,1,1,1,0
0,0,0,1,0,0
0,0,0,1,0,0
0,0,0,1,0,0
0,0,0,1,0,0
0,0,0,1,0,0
0,0,0,1,0,0
0,0,0,1,0,0
0,0,1,0,1,0
0,1,0,1,1,0
0,0,0,1,0,0
0,0,0,1,0,0
0,0,0,1,0,0
0,0,0,1,0,0
0,0,0,1,0,0
0,0,1,1,1,0
0,0,0,1,0,0
0,0,0,1,0,0
0,0,0,1,0,0
0,0,0,1,0,0
0,0,0,1,0,0
0,0,1,1,1,0
0,0,0,1,0,0
0,0,1,1,1,0
0,0,1,0,1,0
0,0,0,1,0,0
0,0,0,1,0,0
=== Summary ===

Correctly Classified Instances          94              100      %
Incorrectly Classified Instances         0                0      %
Kappa statistic                          1     
K&B Relative Info Score               7812.1625 %
K&B Information Score                   24.7899 bits      0.2637 bits/instance
Class complexity | order 0              24.7899 bits      0.2637 bits/instance
Class complexity | scheme                0      bits      0      bits/instance
Complexity improvement     (Sf)         24.7899 bits      0.2637 bits/instance
Mean absolute error                      0     
Root mean squared error                  0     
Relative absolute error                  0      %
Root relative squared error              0      %
Coverage of cases (0.95 level)         100      %
Mean rel. region size (0.95 level)      50      %
Total Number of Instances               94     

Operation took 92ms
Computing linear combination...
@relation rel

@attribute C_0 numeric
@attribute C_1 numeric
@attribute C_2 numeric
@attribute C_3 numeric
@attribute C_4 numeric
@attribute t {0,1}

@data
1,1,1,1,1,1
1,1,1,1,1,1
1,1,1,1,1,1
1,1,1,1,1,1
0,0,0,0,0,0
0,0,0,0,0,0
0,0,0,0,0,0
0,0,0,0,0,0
0,0,0,0,0,0
0,0,0,0,0,0
0,0,0,1,1,0
0,0,0,0,0,0
0,0,0,0,0,0
0,0,0,0,0,0
0,0,0,0,0,0
0,0,0,0,0,0
0,0,0,0,0,0
0,0,0,0,0,0
0,0,0,0,0,0
0,0,0,0,0,0
0,0,0,0,0,0
0,0,0,0,0,0
0,0,0,0,0,0
0,0,0,0,0,0
0,0,0,0,0,0
0,0,0,0,0,0
0,0,0,0,0,0
0,0,0,0,0,0
0,0,0,0,0,0
0,0,0,0,0,0
0,0,0,0,0,0
0,0,0,0,0,0
0,0,0,0,0,0
0,0,0,0,0,0
0,0,0,0,0,0
0,0,0,0,0,0
0,0,0,0,0,0
0,0,0,0,0,0
0,0,0,0,0,0
0,0,0,0,0,0
0,0,0,0,0,0
0,0,0,0,0,0
0,0,0,0,0,0
0,0,0,0,0,0
0,0,0,1,1,0
0,0,0,0,0,0
0,0,0,0,0,0
0,0,0,0,0,0
0,0,0,0,0,0
0,0,0,0,0,0
0,0,0,0,0,0
0,0,0,0,0,0
0,0,0,0,0,0
0,0,0,1,1,0
0,0,0,0,0,0
0,0,0,0,0,0
0,0,0,0,0,0
0,0,0,0,0,0
0,0,0,0,0,0
0,0,0,0,0,0
0,0,0,0,0,0
0,0,0,0,0,0
0,0,0,0,0,0
0,0,0,0,0,0
0,0,0,0,0,0
0,0,0,0,0,0
0,0,0,0,0,0
0,0,0,0,0,0
0,0,0,0,0,0
0,0,0,0,0,0
0,0,0,0,0,0
0,0,0,0,0,0
0,0,0,0,0,0
0,0,0,0,0,0
0,0,0,0,0,0
0,0,0,0,0,0
0,0,0,1,1,0
0,0,0,0,0,0
0,0,0,0,0,0
0,0,0,0,0,0
0,0,0,0,0,0
0,0,0,0,0,0
0,0,0,0,0,0
0,0,0,0,0,0
0,0,0,0,0,0
0,0,0,0,0,0
0,0,0,0,0,0
0,0,0,0,0,0
0,0,0,0,0,0
0,0,0,0,0,0
0,0,0,0,0,0
0,0,0,0,0,0
0,0,0,0,0,0
0,0,0,0,0,0
=== Summary ===

Correctly Classified Instances          94              100      %
Incorrectly Classified Instances         0                0      %
Kappa statistic                          1     
K&B Relative Info Score               7812.1625 %
K&B Information Score                   24.7899 bits      0.2637 bits/instance
Class complexity | order 0              24.7899 bits      0.2637 bits/instance
Class complexity | scheme                0      bits      0      bits/instance
Complexity improvement     (Sf)         24.7899 bits      0.2637 bits/instance
Mean absolute error                      0     
Root mean squared error                  0     
Relative absolute error                  0      %
Root relative squared error              0      %
Coverage of cases (0.95 level)         100      %
Mean rel. region size (0.95 level)      50      %
Total Number of Instances               94     

Operation took 50ms
Computing linear combination...
@relation rel

@attribute C_0 numeric
@attribute C_1 numeric
@attribute C_2 numeric
@attribute C_3 numeric
@attribute C_4 numeric
@attribute t {0,1}

@data
1,1,1,1,1,1
1,1,1,1,1,1
1,1,1,1,1,1
1,1,1,1,1,1
0,0,0,0,0,0
0,0,0,0,0,0
0,0,0,0,0,0
0,0,0,0,0,0
0,0,0,0,0,0
0,0,0,0,0,0
0,0,0,0,0,0
0,0,0,0,0,0
0,0,0,0,0,0
0,0,0,0,0,0
0,0,0,0,0,0
0,0,0,0,0,0
0,0,0,0,0,0
0,0,0,0,0,0
0,0,0,0,0,0
0,0,0,0,0,0
0,0,0,0,0,0
0,0,0,0,0,0
0,0,0,0,0,0
0,0,0,0,0,0
0,0,0,0,0,0
0,0,0,0,0,0
0,0,0,0,0,0
0,0,0,0,0,0
0,0,0,0,0,0
0,0,0,0,0,0
0,0,0,0,0,0
0,0,0,0,0,0
0,0,0,0,0,0
0,0,0,0,0,0
0,0,0,0,0,0
0,0,0,0,0,0
0,0,0,0,0,0
0,0,0,0,0,0
0,0,0,0,0,0
0,0,0,0,0,0
0,0,0,0,0,0
0,0,0,0,0,0
0,0,0,0,0,0
0,0,0,0,0,0
0,0,0,0,0,0
0,0,0,0,0,0
0,0,0,0,0,0
0,0,0,0,0,0
0,0,0,0,0,0
0,0,0,0,0,0
0,0,0,0,0,0
0,0,0,0,0,0
0,0,0,0,0,0
0,0,0,0,0,0
0,0,0,0,0,0
0,0,0,0,0,0
0,0,0,0,0,0
0,0,0,0,0,0
0,0,0,0,0,0
0,0,0,0,0,0
0,0,0,0,0,0
0,0,0,0,0,0
0,0,0,0,0,0
0,0,0,0,0,0
0,0,0,0,0,0
0,0,0,0,0,0
0,0,0,0,0,0
0,0,0,0,0,0
0,0,0,0,0,0
0,0,0,0,0,0
0,0,0,0,0,0
0,0,0,0,0,0
0,0,0,0,0,0
0,0,0,0,0,0
0,0,0,0,0,0
0,0,0,0,0,0
0,0,0,0,0,0
0,0,0,0,0,0
0,0,0,0,0,0
0,0,0,0,0,0
0,0,0,0,0,0
0,0,0,0,0,0
0,0,0,0,0,0
0,0,0,0,0,0
0,0,0,0,0,0
0,0,0,0,0,0
0,0,0,0,0,0
0,0,0,0,0,0
0,0,0,0,0,0
0,0,0,0,0,0
0,0,0,0,0,0
0,0,0,0,0,0
0,0,0,0,0,0
0,0,0,0,0,0
=== Summary ===

Correctly Classified Instances          90               95.7447 %
Incorrectly Classified Instances         4                4.2553 %
Kappa statistic                          0     
K&B Relative Info Score                433.5572 %
K&B Information Score                    1.3758 bits      0.0146 bits/instance
Class complexity | order 0              24.7899 bits      0.2637 bits/instance
Class complexity | scheme               24.8735 bits      0.2646 bits/instance
Complexity improvement     (Sf)         -0.0836 bits     -0.0009 bits/instance
Mean absolute error                      0.0817
Root mean squared error                  0.2033
Relative absolute error                 89.4343 %
Root relative squared error             99.8984 %
Coverage of cases (0.95 level)          95.7447 %
Mean rel. region size (0.95 level)      50      %
Total Number of Instances               94     

Operation took 35ms
Computing linear combination...
@relation rel

@attribute C_0 numeric
@attribute C_1 numeric
@attribute C_2 numeric
@attribute C_3 numeric
@attribute C_4 numeric
@attribute t {0,1}

@data
1,1,1,1,1,1
1,1,1,1,1,1
1,1,1,1,1,1
1,1,1,1,1,1
0,0,0,0,0,0
0,0,0,0,0,0
0,0,0,0,0,0
0,0,0,0,0,0
0,0,0,0,0,0
0,0,0,0,0,0
0,0,0,0,0,0
0,0,0,0,0,0
0,0,0,0,0,0
0,0,0,0,0,0
0,0,0,0,0,0
0,0,0,0,0,0
0,0,0,0,0,0
0,0,0,0,0,0
0,0,0,0,0,0
0,0,0,0,0,0
0,0,0,0,0,0
0,0,0,0,0,0
0,0,0,0,0,0
0,0,0,0,0,0
0,0,0,0,0,0
0,0,0,0,0,0
0,0,0,0,0,0
0,0,0,0,0,0
0,0,0,0,0,0
0,0,0,0,0,0
0,0,0,0,0,0
0,0,0,0,0,0
0,0,0,0,0,0
0,0,0,0,0,0
0,0,0,0,0,0
0,0,0,0,0,0
0,0,0,0,0,0
0,0,0,0,0,0
0,0,0,0,0,0
0,0,0,0,0,0
0,0,0,0,0,0
0,0,0,0,0,0
0,0,0,0,0,0
0,0,0,0,0,0
0,0,0,0,0,0
0,0,0,0,0,0
0,0,0,0,0,0
0,0,0,0,0,0
0,0,0,0,0,0
0,0,0,0,0,0
0,0,0,0,0,0
0,0,0,0,0,0
0,0,0,0,0,0
0,0,0,0,0,0
0,0,0,0,0,0
0,0,0,0,0,0
0,0,0,0,0,0
0,0,0,0,0,0
0,0,0,0,0,0
0,0,0,0,0,0
0,0,0,0,0,0
0,0,0,0,0,0
0,0,0,0,0,0
0,0,0,0,0,0
0,0,0,0,0,0
0,0,0,0,0,0
0,0,0,0,0,0
0,0,0,0,0,0
0,0,0,0,0,0
0,0,0,0,0,0
0,0,0,0,0,0
0,0,0,0,0,0
0,0,0,0,0,0
0,0,0,0,0,0
0,0,0,0,0,0
0,0,0,0,0,0
0,0,0,0,0,0
0,0,0,0,0,0
0,0,0,0,0,0
0,0,0,0,0,0
0,0,0,0,0,0
0,0,0,0,0,0
0,0,0,0,0,0
0,0,0,0,0,0
0,0,0,0,0,0
0,0,0,0,0,0
0,0,0,0,0,0
0,0,0,0,0,0
0,0,0,0,0,0
0,0,0,0,0,0
0,0,0,0,0,0
0,0,0,0,0,0
0,0,0,0,0,0
0,0,0,0,0,0
=== Summary ===

Correctly Classified Instances          90               95.7447 %
Incorrectly Classified Instances         4                4.2553 %
Kappa statistic                          0     
K&B Relative Info Score                433.5572 %
K&B Information Score                    1.3758 bits      0.0146 bits/instance
Class complexity | order 0              24.7899 bits      0.2637 bits/instance
Class complexity | scheme               24.8735 bits      0.2646 bits/instance
Complexity improvement     (Sf)         -0.0836 bits     -0.0009 bits/instance
Mean absolute error                      0.0817
Root mean squared error                  0.2033
Relative absolute error                 89.4343 %
Root relative squared error             99.8984 %
Coverage of cases (0.95 level)          95.7447 %
Mean rel. region size (0.95 level)      50      %
Total Number of Instances               94     

Operation took 44ms
Computing linear combination...
@relation rel

@attribute C_0 numeric
@attribute C_1 numeric
@attribute C_2 numeric
@attribute C_3 numeric
@attribute C_4 numeric
@attribute t {0,1}

@data
1,1,1,1,1,1
1,1,1,1,1,1
1,1,1,1,1,1
1,1,1,1,1,1
0,0,0,0,0,0
0,0,0,0,0,0
0,0,0,0,0,0
0,0,0,0,0,0
0,0,0,0,0,0
0,0,0,0,0,0
0,0,0,0,0,0
0,0,0,0,0,0
0,0,0,0,0,0
0,0,0,0,0,0
0,0,0,0,0,0
0,0,0,0,0,0
0,0,0,0,0,0
0,0,0,0,0,0
0,0,0,0,0,0
0,0,0,0,0,0
0,0,0,0,0,0
0,0,0,0,0,0
0,0,0,0,0,0
0,0,0,0,0,0
0,0,0,0,0,0
0,0,0,0,0,0
0,0,0,0,0,0
0,0,0,0,0,0
0,0,0,0,0,0
0,0,0,0,0,0
0,0,0,0,0,0
0,0,0,0,0,0
0,0,0,0,0,0
0,0,0,0,0,0
0,0,0,0,0,0
0,0,0,0,0,0
0,0,0,0,0,0
0,0,0,0,0,0
0,0,0,0,0,0
0,0,0,0,0,0
0,0,0,0,0,0
0,0,0,0,0,0
0,0,0,0,0,0
0,0,0,0,0,0
0,0,0,0,0,0
0,0,0,0,0,0
0,0,0,0,0,0
0,0,0,0,0,0
0,0,0,0,0,0
0,0,0,0,0,0
0,0,0,0,0,0
0,0,0,0,0,0
0,0,0,0,0,0
0,0,0,0,0,0
0,0,0,0,0,0
0,0,0,0,0,0
0,0,0,0,0,0
0,0,0,0,0,0
0,0,0,0,0,0
0,0,0,0,0,0
0,0,0,0,0,0
0,0,0,0,0,0
0,0,0,0,0,0
0,0,0,0,0,0
0,0,0,0,0,0
0,0,0,0,0,0
0,0,0,0,0,0
0,0,0,0,0,0
0,0,0,0,0,0
0,0,0,0,0,0
0,0,0,0,0,0
0,0,0,0,0,0
0,0,0,0,0,0
0,0,0,0,0,0
0,0,0,0,0,0
0,0,0,0,0,0
0,0,0,0,0,0
0,0,0,0,0,0
0,0,0,0,0,0
0,0,0,0,0,0
0,0,0,0,0,0
0,0,0,0,0,0
0,0,0,0,0,0
0,0,0,0,0,0
0,0,0,0,0,0
0,0,0,0,0,0
0,0,0,0,0,0
0,0,0,0,0,0
0,0,0,0,0,0
0,0,0,0,0,0
0,0,0,0,0,0
0,0,0,0,0,0
0,0,0,0,0,0
0,0,0,0,0,0
=== Summary ===

Correctly Classified Instances          90               95.7447 %
Incorrectly Classified Instances         4                4.2553 %
Kappa statistic                          0     
K&B Relative Info Score                433.5572 %
K&B Information Score                    1.3758 bits      0.0146 bits/instance
Class complexity | order 0              24.7899 bits      0.2637 bits/instance
Class complexity | scheme               24.8735 bits      0.2646 bits/instance
Complexity improvement     (Sf)         -0.0836 bits     -0.0009 bits/instance
Mean absolute error                      0.0817
Root mean squared error                  0.2033
Relative absolute error                 89.4343 %
Root relative squared error             99.8984 %
Coverage of cases (0.95 level)          95.7447 %
Mean rel. region size (0.95 level)      50      %
Total Number of Instances               94     

Operation took 27ms
Computing linear combination...
@relation rel

@attribute C_0 numeric
@attribute C_1 numeric
@attribute C_2 numeric
@attribute C_3 numeric
@attribute C_4 numeric
@attribute t {0,1}

@data
1,1,1,1,1,1
1,1,1,1,1,1
1,1,1,1,1,1
1,1,1,1,1,1
0,0,0,0,0,0
0,0,0,0,0,0
0,0,0,0,0,0
0,0,0,0,0,0
0,0,0,0,0,0
0,0,0,0,0,0
0,0,0,0,0,0
0,0,0,0,0,0
0,0,0,0,0,0
0,0,0,0,0,0
0,0,0,0,0,0
0,0,0,0,0,0
0,0,0,0,0,0
0,0,0,0,0,0
0,0,0,0,0,0
0,0,0,0,0,0
0,0,0,0,0,0
0,0,0,0,0,0
0,0,0,0,0,0
0,0,0,0,0,0
0,0,0,0,0,0
0,0,0,0,0,0
0,0,0,0,0,0
0,0,0,0,0,0
0,0,0,0,0,0
0,0,0,0,0,0
0,0,0,0,0,0
0,0,0,0,0,0
0,0,0,0,0,0
0,0,0,0,0,0
0,0,0,0,0,0
0,0,0,0,0,0
0,0,0,0,0,0
0,0,0,0,0,0
0,0,0,0,0,0
0,0,0,0,0,0
0,0,0,0,0,0
0,0,0,0,0,0
0,0,0,0,0,0
0,0,0,0,0,0
0,0,0,0,0,0
0,0,0,0,0,0
0,0,0,0,0,0
0,0,0,0,0,0
0,0,0,0,0,0
0,0,0,0,0,0
0,0,0,0,0,0
0,0,0,0,0,0
0,0,0,0,0,0
0,0,0,0,0,0
0,0,0,0,0,0
0,0,0,0,0,0
0,0,0,0,0,0
0,0,0,0,0,0
0,0,0,0,0,0
0,0,0,0,0,0
0,0,0,0,0,0
0,0,0,0,0,0
0,0,0,0,0,0
0,0,0,0,0,0
0,0,0,0,0,0
0,0,0,0,0,0
0,0,0,0,0,0
0,0,0,0,0,0
0,0,0,0,0,0
0,0,0,0,0,0
0,0,0,0,0,0
0,0,0,0,0,0
0,0,0,0,0,0
0,0,0,0,0,0
0,0,0,0,0,0
0,0,0,0,0,0
0,0,0,0,0,0
0,0,0,0,0,0
0,0,0,0,0,0
0,0,0,0,0,0
0,0,0,0,0,0
0,0,0,0,0,0
0,0,0,0,0,0
0,0,0,0,0,0
0,0,0,0,0,0
0,0,0,0,0,0
0,0,0,0,0,0
0,0,0,0,0,0
0,0,0,0,0,0
0,0,0,0,0,0
0,0,0,0,0,0
0,0,0,0,0,0
0,0,0,0,0,0
0,0,0,0,0,0
=== Summary ===

Correctly Classified Instances          90               95.7447 %
Incorrectly Classified Instances         4                4.2553 %
Kappa statistic                          0     
K&B Relative Info Score                433.5572 %
K&B Information Score                    1.3758 bits      0.0146 bits/instance
Class complexity | order 0              24.7899 bits      0.2637 bits/instance
Class complexity | scheme               24.8735 bits      0.2646 bits/instance
Complexity improvement     (Sf)         -0.0836 bits     -0.0009 bits/instance
Mean absolute error                      0.0817
Root mean squared error                  0.2033
Relative absolute error                 89.4343 %
Root relative squared error             99.8984 %
Coverage of cases (0.95 level)          95.7447 %
Mean rel. region size (0.95 level)      50      %
Total Number of Instances               94     

Operation took 29ms
Computing linear combination...
@relation rel

@attribute C_0 numeric
@attribute C_1 numeric
@attribute C_2 numeric
@attribute C_3 numeric
@attribute C_4 numeric
@attribute t {0,1}

@data
1,1,1,1,1,1
1,1,1,1,1,1
1,1,1,1,1,1
1,1,1,1,1,1
0,0,0,0,0,0
0,0,0,0,0,0
0,0,0,0,0,0
0,0,0,0,0,0
0,0,0,0,0,0
0,0,0,0,0,0
0,0,0,0,0,0
0,0,0,0,0,0
0,0,0,0,0,0
0,0,0,0,0,0
0,0,0,0,0,0
0,0,0,0,0,0
0,0,0,0,0,0
0,0,0,0,0,0
0,0,0,0,0,0
0,0,0,0,0,0
0,0,0,0,0,0
0,0,0,0,0,0
0,0,0,0,0,0
0,0,0,0,0,0
0,0,0,0,0,0
0,0,0,0,0,0
0,0,0,0,0,0
0,0,0,0,0,0
0,0,0,0,0,0
0,0,0,0,0,0
0,0,0,0,0,0
0,0,0,0,0,0
0,0,0,0,0,0
0,0,0,0,0,0
0,0,0,0,0,0
0,0,0,0,0,0
0,0,0,0,0,0
0,0,0,0,0,0
0,0,0,0,0,0
0,0,0,0,0,0
0,0,0,0,0,0
0,0,0,0,0,0
0,0,0,0,0,0
0,0,0,0,0,0
0,0,0,0,0,0
0,0,0,0,0,0
0,0,0,0,0,0
0,0,0,0,0,0
0,0,0,0,0,0
0,0,0,0,0,0
0,0,0,0,0,0
0,0,0,0,0,0
0,0,0,0,0,0
0,0,0,0,0,0
0,0,0,0,0,0
0,0,0,0,0,0
0,0,0,0,0,0
0,0,0,0,0,0
0,0,0,0,0,0
0,0,0,0,0,0
0,0,0,0,0,0
0,0,0,0,0,0
0,0,0,0,0,0
0,0,0,0,0,0
0,0,0,0,0,0
0,0,0,0,0,0
0,0,0,0,0,0
0,0,0,0,0,0
0,0,0,0,0,0
0,0,0,0,0,0
0,0,0,0,0,0
0,0,0,0,0,0
0,0,0,0,0,0
0,0,0,0,0,0
0,0,0,0,0,0
0,0,0,0,0,0
0,0,0,0,0,0
0,0,0,0,0,0
0,0,0,0,0,0
0,0,0,0,0,0
0,0,0,0,0,0
0,0,0,0,0,0
0,0,0,0,0,0
0,0,0,0,0,0
0,0,0,0,0,0
0,0,0,0,0,0
0,0,0,0,0,0
0,0,0,0,0,0
0,0,0,0,0,0
0,0,0,0,0,0
0,0,0,0,0,0
0,0,0,0,0,0
0,0,0,0,0,0
0,0,0,0,0,0
=== Summary ===

Correctly Classified Instances          90               95.7447 %
Incorrectly Classified Instances         4                4.2553 %
Kappa statistic                          0     
K&B Relative Info Score                433.5572 %
K&B Information Score                    1.3758 bits      0.0146 bits/instance
Class complexity | order 0              24.7899 bits      0.2637 bits/instance
Class complexity | scheme               24.8735 bits      0.2646 bits/instance
Complexity improvement     (Sf)         -0.0836 bits     -0.0009 bits/instance
Mean absolute error                      0.0817
Root mean squared error                  0.2033
Relative absolute error                 89.4343 %
Root relative squared error             99.8984 %
Coverage of cases (0.95 level)          95.7447 %
Mean rel. region size (0.95 level)      50      %
Total Number of Instances               94     

Operation took 31ms
Computing linear combination...
@relation rel

@attribute C_0 numeric
@attribute C_1 numeric
@attribute C_2 numeric
@attribute C_3 numeric
@attribute C_4 numeric
@attribute t {0,1}

@data
1,1,1,1,1,1
1,1,1,1,1,1
1,1,1,1,1,1
1,1,1,1,1,1
0,0,0,0,0,0
0,0,0,0,0,0
0,0,0,0,0,0
0,0,0,0,0,0
0,0,0,0,0,0
0,0,0,0,0,0
0,0,0,0,0,0
0,0,0,0,0,0
0,0,0,0,0,0
0,0,0,0,0,0
0,0,0,0,0,0
0,0,0,0,0,0
0,0,0,0,0,0
0,0,0,0,0,0
0,0,0,0,0,0
0,0,0,0,0,0
0,0,0,0,0,0
0,0,0,0,0,0
0,0,0,0,0,0
0,0,0,0,0,0
0,0,0,0,0,0
0,0,0,0,0,0
0,0,0,0,0,0
0,0,0,0,0,0
0,0,0,0,0,0
0,0,0,0,0,0
0,0,0,0,0,0
0,0,0,0,0,0
0,0,0,0,0,0
0,0,0,0,0,0
0,0,0,0,0,0
0,0,0,0,0,0
0,0,0,0,0,0
0,0,0,0,0,0
0,0,0,0,0,0
0,0,0,0,0,0
0,0,0,0,0,0
0,0,0,0,0,0
0,0,0,0,0,0
0,0,0,0,0,0
0,0,0,0,0,0
0,0,0,0,0,0
0,0,0,0,0,0
0,0,0,0,0,0
0,0,0,0,0,0
0,0,0,0,0,0
0,0,0,0,0,0
0,0,0,0,0,0
0,0,0,0,0,0
0,0,0,0,0,0
0,0,0,0,0,0
0,0,0,0,0,0
0,0,0,0,0,0
0,0,0,0,0,0
0,0,0,0,0,0
0,0,0,0,0,0
0,0,0,0,0,0
0,0,0,0,0,0
0,0,0,0,0,0
0,0,0,0,0,0
0,0,0,0,0,0
0,0,0,0,0,0
0,0,0,0,0,0
0,0,0,0,0,0
0,0,0,0,0,0
0,0,0,0,0,0
0,0,0,0,0,0
0,0,0,0,0,0
0,0,0,0,0,0
0,0,0,0,0,0
0,0,0,0,0,0
0,0,0,0,0,0
0,0,0,0,0,0
0,0,0,0,0,0
0,0,0,0,0,0
0,0,0,0,0,0
0,0,0,0,0,0
0,0,0,0,0,0
0,0,0,0,0,0
0,0,0,0,0,0
0,0,0,0,0,0
0,0,0,0,0,0
0,0,0,0,0,0
0,0,0,0,0,0
0,0,0,0,0,0
0,0,0,0,0,0
0,0,0,0,0,0
0,0,0,0,0,0
0,0,0,0,0,0
0,0,0,0,0,0
=== Summary ===

Correctly Classified Instances          90               95.7447 %
Incorrectly Classified Instances         4                4.2553 %
Kappa statistic                          0     
K&B Relative Info Score                433.5572 %
K&B Information Score                    1.3758 bits      0.0146 bits/instance
Class complexity | order 0              24.7899 bits      0.2637 bits/instance
Class complexity | scheme               24.8735 bits      0.2646 bits/instance
Complexity improvement     (Sf)         -0.0836 bits     -0.0009 bits/instance
Mean absolute error                      0.0817
Root mean squared error                  0.2033
Relative absolute error                 89.4343 %
Root relative squared error             99.8984 %
Coverage of cases (0.95 level)          95.7447 %
Mean rel. region size (0.95 level)      50      %
Total Number of Instances               94     

Operation took 18ms
Computing linear combination...
@relation rel

@attribute C_0 numeric
@attribute C_1 numeric
@attribute C_2 numeric
@attribute C_3 numeric
@attribute C_4 numeric
@attribute t {0,1}

@data
1,1,1,1,1,1
1,1,1,1,1,1
1,1,1,1,1,1
1,1,1,1,1,1
0,0,0,0,0,0
0,0,0,0,0,0
0,0,0,0,0,0
0,0,0,0,0,0
0,0,0,0,0,0
0,0,0,0,0,0
0,0,0,0,0,0
0,0,0,0,0,0
0,0,0,0,0,0
0,0,0,0,0,0
0,0,0,0,0,0
0,0,0,0,0,0
0,0,0,0,0,0
0,0,0,0,0,0
0,0,0,0,0,0
0,0,0,0,0,0
0,0,0,0,0,0
0,0,0,0,0,0
0,0,0,0,0,0
0,0,0,0,0,0
0,0,0,0,0,0
0,0,0,0,0,0
0,0,0,0,0,0
0,0,0,0,0,0
0,0,0,0,0,0
0,0,0,0,0,0
0,0,0,0,0,0
0,0,0,0,0,0
0,0,0,0,0,0
0,0,0,0,0,0
0,0,0,0,0,0
0,0,0,0,0,0
0,0,0,0,0,0
0,0,0,0,0,0
0,0,0,0,0,0
0,0,0,0,0,0
0,0,0,0,0,0
0,0,0,0,0,0
0,0,0,0,0,0
0,0,0,0,0,0
0,0,0,0,0,0
0,0,0,0,0,0
0,0,0,0,0,0
0,0,0,0,0,0
0,0,0,0,0,0
0,0,0,0,0,0
0,0,0,0,0,0
0,0,0,0,0,0
0,0,0,0,0,0
0,0,0,0,0,0
0,0,0,0,0,0
0,0,0,0,0,0
0,0,0,0,0,0
0,0,0,0,0,0
0,0,0,0,0,0
0,0,0,0,0,0
0,0,0,0,0,0
0,0,0,0,0,0
0,0,0,0,0,0
0,0,0,0,0,0
0,0,0,0,0,0
0,0,0,0,0,0
0,0,0,0,0,0
0,0,0,0,0,0
0,0,0,0,0,0
0,0,0,0,0,0
0,0,0,0,0,0
0,0,0,0,0,0
0,0,0,0,0,0
0,0,0,0,0,0
0,0,0,0,0,0
0,0,0,0,0,0
0,0,0,0,0,0
0,0,0,0,0,0
0,0,0,0,0,0
0,0,0,0,0,0
0,0,0,0,0,0
0,0,0,0,0,0
0,0,0,0,0,0
0,0,0,0,0,0
0,0,0,0,0,0
0,0,0,0,0,0
0,0,0,0,0,0
0,0,0,0,0,0
0,0,0,0,0,0
0,0,0,0,0,0
0,0,0,0,0,0
0,0,0,0,0,0
0,0,0,0,0,0
0,0,0,0,0,0
=== Summary ===

Correctly Classified Instances          90               95.7447 %
Incorrectly Classified Instances         4                4.2553 %
Kappa statistic                          0     
K&B Relative Info Score                433.5572 %
K&B Information Score                    1.3758 bits      0.0146 bits/instance
Class complexity | order 0              24.7899 bits      0.2637 bits/instance
Class complexity | scheme               24.8735 bits      0.2646 bits/instance
Complexity improvement     (Sf)         -0.0836 bits     -0.0009 bits/instance
Mean absolute error                      0.0817
Root mean squared error                  0.2033
Relative absolute error                 89.4343 %
Root relative squared error             99.8984 %
Coverage of cases (0.95 level)          95.7447 %
Mean rel. region size (0.95 level)      50      %
Total Number of Instances               94     

Operation took 15ms
Computing linear combination...
@relation rel

@attribute C_0 numeric
@attribute C_1 numeric
@attribute C_2 numeric
@attribute C_3 numeric
@attribute C_4 numeric
@attribute t {0,1}

@data
1,1,1,1,1,1
1,1,1,1,1,1
1,1,1,1,1,1
1,1,1,1,1,1
0,0,0,0,0,0
0,0,0,0,0,0
0,0,0,0,0,0
0,0,0,0,0,0
0,0,0,0,0,0
0,0,0,0,0,0
0,0,0,0,0,0
0,0,0,0,0,0
0,0,0,0,0,0
0,0,0,0,0,0
0,0,0,0,0,0
0,0,0,0,0,0
0,0,0,0,0,0
0,0,0,0,0,0
0,0,0,0,0,0
0,0,0,0,0,0
0,0,0,0,0,0
0,0,0,0,0,0
0,0,0,0,0,0
0,0,0,0,0,0
0,0,0,0,0,0
0,0,0,0,0,0
0,0,0,0,0,0
0,0,0,0,0,0
0,0,0,0,0,0
0,0,0,0,0,0
0,0,0,0,0,0
0,0,0,0,0,0
0,0,0,0,0,0
0,0,0,0,0,0
0,0,0,0,0,0
0,0,0,0,0,0
0,0,0,0,0,0
0,0,0,0,0,0
0,0,0,0,0,0
0,0,0,0,0,0
0,0,0,0,0,0
0,0,0,0,0,0
0,0,0,0,0,0
0,0,0,0,0,0
0,0,0,0,0,0
0,0,0,0,0,0
0,0,0,0,0,0
0,0,0,0,0,0
0,0,0,0,0,0
0,0,0,0,0,0
0,0,0,0,0,0
0,0,0,0,0,0
0,0,0,0,0,0
0,0,0,0,0,0
0,0,0,0,0,0
0,0,0,0,0,0
0,0,0,0,0,0
0,0,0,0,0,0
0,0,0,0,0,0
0,0,0,0,0,0
0,0,0,0,0,0
0,0,0,0,0,0
0,0,0,0,0,0
0,0,0,0,0,0
0,0,0,0,0,0
0,0,0,0,0,0
0,0,0,0,0,0
0,0,0,0,0,0
0,0,0,0,0,0
0,0,0,0,0,0
0,0,0,0,0,0
0,0,0,0,0,0
0,0,0,0,0,0
0,0,0,0,0,0
0,0,0,0,0,0
0,0,0,0,0,0
0,0,0,0,0,0
0,0,0,0,0,0
0,0,0,0,0,0
0,0,0,0,0,0
0,0,0,0,0,0
0,0,0,0,0,0
0,0,0,0,0,0
0,0,0,0,0,0
0,0,0,0,0,0
0,0,0,0,0,0
0,0,0,0,0,0
0,0,0,0,0,0
0,0,0,0,0,0
0,0,0,0,0,0
0,0,0,0,0,0
0,0,0,0,0,0
0,0,0,0,0,0
0,0,0,0,0,0
=== Summary ===

Correctly Classified Instances          90               95.7447 %
Incorrectly Classified Instances         4                4.2553 %
Kappa statistic                          0     
K&B Relative Info Score                433.5572 %
K&B Information Score                    1.3758 bits      0.0146 bits/instance
Class complexity | order 0              24.7899 bits      0.2637 bits/instance
Class complexity | scheme               24.8735 bits      0.2646 bits/instance
Complexity improvement     (Sf)         -0.0836 bits     -0.0009 bits/instance
Mean absolute error                      0.0817
Root mean squared error                  0.2033
Relative absolute error                 89.4343 %
Root relative squared error             99.8984 %
Coverage of cases (0.95 level)          95.7447 %
Mean rel. region size (0.95 level)      50      %
Total Number of Instances               94     

Operation took 21ms
Computing linear combination...
@relation rel

@attribute C_0 numeric
@attribute C_1 numeric
@attribute C_2 numeric
@attribute C_3 numeric
@attribute C_4 numeric
@attribute t {0,1}

@data
1,1,1,1,1,1
1,1,1,1,1,1
1,1,1,1,1,1
1,1,1,1,1,1
0,0,0,0,0,0
0,0,0,0,0,0
0,0,0,0,0,0
0,0,0,0,0,0
0,0,0,0,0,0
0,0,0,0,0,0
0,0,0,0,0,0
0,0,0,0,0,0
0,0,0,0,0,0
0,0,0,0,0,0
0,0,0,0,0,0
0,0,0,0,0,0
0,0,0,0,0,0
0,0,0,0,0,0
0,0,0,0,0,0
0,0,0,0,0,0
0,0,0,0,0,0
0,0,0,0,0,0
0,0,0,0,0,0
0,0,0,0,0,0
0,0,0,0,0,0
0,0,0,0,0,0
0,0,0,0,0,0
0,0,0,0,0,0
0,0,0,0,0,0
0,0,0,0,0,0
0,0,0,0,0,0
0,0,0,0,0,0
0,0,0,0,0,0
0,0,0,0,0,0
0,0,0,0,0,0
0,0,0,0,0,0
0,0,0,0,0,0
0,0,0,0,0,0
0,0,0,0,0,0
0,0,0,0,0,0
0,0,0,0,0,0
0,0,0,0,0,0
0,0,0,0,0,0
0,0,0,0,0,0
0,0,0,0,0,0
0,0,0,0,0,0
0,0,0,0,0,0
0,0,0,0,0,0
0,0,0,0,0,0
0,0,0,0,0,0
0,0,0,0,0,0
0,0,0,0,0,0
0,0,0,0,0,0
0,0,0,0,0,0
0,0,0,0,0,0
0,0,0,0,0,0
0,0,0,0,0,0
0,0,0,0,0,0
0,0,0,0,0,0
0,0,0,0,0,0
0,0,0,0,0,0
0,0,0,0,0,0
0,0,0,0,0,0
0,0,0,0,0,0
0,0,0,0,0,0
0,0,0,0,0,0
0,0,0,0,0,0
0,0,0,0,0,0
0,0,0,0,0,0
0,0,0,0,0,0
0,0,0,0,0,0
0,0,0,0,0,0
0,0,0,0,0,0
0,0,0,0,0,0
0,0,0,0,0,0
0,0,0,0,0,0
0,0,0,0,0,0
0,0,0,0,0,0
0,0,0,0,0,0
0,0,0,0,0,0
0,0,0,0,0,0
0,0,0,0,0,0
0,0,0,0,0,0
0,0,0,0,0,0
0,0,0,0,0,0
0,0,0,0,0,0
0,0,0,0,0,0
0,0,0,0,0,0
0,0,0,0,0,0
0,0,0,0,0,0
0,0,0,0,0,0
0,0,0,0,0,0
0,0,0,0,0,0
0,0,0,0,0,0
=== Summary ===

Correctly Classified Instances          90               95.7447 %
Incorrectly Classified Instances         4                4.2553 %
Kappa statistic                          0     
K&B Relative Info Score                433.5572 %
K&B Information Score                    1.3758 bits      0.0146 bits/instance
Class complexity | order 0              24.7899 bits      0.2637 bits/instance
Class complexity | scheme               24.8735 bits      0.2646 bits/instance
Complexity improvement     (Sf)         -0.0836 bits     -0.0009 bits/instance
Mean absolute error                      0.0817
Root mean squared error                  0.2033
Relative absolute error                 89.4343 %
Root relative squared error             99.8984 %
Coverage of cases (0.95 level)          95.7447 %
Mean rel. region size (0.95 level)      50      %
Total Number of Instances               94     

Operation took 40ms
Computing linear combination...
@relation rel

@attribute C_0 numeric
@attribute C_1 numeric
@attribute C_2 numeric
@attribute C_3 numeric
@attribute C_4 numeric
@attribute t {0,1}

@data
1,1,1,1,1,1
1,1,1,1,1,1
1,1,1,1,1,1
1,1,1,1,1,1
0,0,0,0,0,0
0,0,0,0,0,0
0,0,0,0,0,0
0,0,0,0,0,0
0,0,0,0,0,0
0,0,0,0,0,0
0,0,0,0,0,0
0,0,0,0,0,0
0,0,0,0,0,0
0,0,0,0,0,0
0,0,0,0,0,0
0,0,0,0,0,0
0,0,0,0,0,0
0,0,0,0,0,0
0,0,0,0,0,0
0,0,0,0,0,0
0,0,0,0,0,0
0,0,0,0,0,0
0,0,0,0,0,0
0,0,0,0,0,0
0,0,0,0,0,0
0,0,0,0,0,0
0,0,0,0,0,0
0,0,0,0,0,0
0,0,0,0,0,0
0,0,0,0,0,0
0,0,0,0,0,0
0,0,0,0,0,0
0,0,0,0,0,0
0,0,0,0,0,0
0,0,0,0,0,0
0,0,0,0,0,0
0,0,0,0,0,0
0,0,0,0,0,0
0,0,0,0,0,0
0,0,0,0,0,0
0,0,0,0,0,0
0,0,0,0,0,0
0,0,0,0,0,0
0,0,0,0,0,0
0,0,0,0,0,0
0,0,0,0,0,0
0,0,0,0,0,0
0,0,0,0,0,0
0,0,0,0,0,0
0,0,0,0,0,0
0,0,0,0,0,0
0,0,0,0,0,0
0,0,0,0,0,0
0,0,0,0,0,0
0,0,0,0,0,0
0,0,0,0,0,0
0,0,0,0,0,0
0,0,0,0,0,0
0,0,0,0,0,0
0,0,0,0,0,0
0,0,0,0,0,0
0,0,0,0,0,0
0,0,0,0,0,0
0,0,0,0,0,0
0,0,0,0,0,0
0,0,0,0,0,0
0,0,0,0,0,0
0,0,0,0,0,0
0,0,0,0,0,0
0,0,0,0,0,0
0,0,0,0,0,0
0,0,0,0,0,0
0,0,0,0,0,0
0,0,0,0,0,0
0,0,0,0,0,0
0,0,0,0,0,0
0,0,0,0,0,0
0,0,0,0,0,0
0,0,0,0,0,0
0,0,0,0,0,0
0,0,0,0,0,0
0,0,0,0,0,0
0,0,0,0,0,0
0,0,0,0,0,0
0,0,0,0,0,0
0,0,0,0,0,0
0,0,0,0,0,0
0,0,0,0,0,0
0,0,0,0,0,0
0,0,0,0,0,0
0,0,0,0,0,0
0,0,0,0,0,0
0,0,0,0,0,0
0,0,0,0,0,0
=== Summary ===

Correctly Classified Instances          90               95.7447 %
Incorrectly Classified Instances         4                4.2553 %
Kappa statistic                          0     
K&B Relative Info Score                433.5572 %
K&B Information Score                    1.3758 bits      0.0146 bits/instance
Class complexity | order 0              24.7899 bits      0.2637 bits/instance
Class complexity | scheme               24.8735 bits      0.2646 bits/instance
Complexity improvement     (Sf)         -0.0836 bits     -0.0009 bits/instance
Mean absolute error                      0.0817
Root mean squared error                  0.2033
Relative absolute error                 89.4343 %
Root relative squared error             99.8984 %
Coverage of cases (0.95 level)          95.7447 %
Mean rel. region size (0.95 level)      50      %
Total Number of Instances               94     

Operation took 14ms
Computing linear combination...
@relation rel

@attribute C_0 numeric
@attribute C_1 numeric
@attribute C_2 numeric
@attribute C_3 numeric
@attribute C_4 numeric
@attribute t {0,1}

@data
1,1,1,1,1,1
1,1,1,1,1,1
1,1,1,1,1,1
1,1,1,1,1,1
0,0,0,0,0,0
0,0,0,0,0,0
0,0,0,0,0,0
0,0,0,0,0,0
0,0,0,0,0,0
0,0,0,0,0,0
0,0,0,0,0,0
0,0,0,0,0,0
0,0,0,0,0,0
0,0,0,0,0,0
0,0,0,0,0,0
0,0,0,0,0,0
0,0,0,0,0,0
0,0,0,0,0,0
0,0,0,0,0,0
0,0,0,0,0,0
0,0,0,0,0,0
0,0,0,0,0,0
0,0,0,0,0,0
0,0,0,0,0,0
0,0,0,0,0,0
0,0,0,0,0,0
0,0,0,0,0,0
0,0,0,0,0,0
0,0,0,0,0,0
0,0,0,0,0,0
0,0,0,0,0,0
0,0,0,0,0,0
0,0,0,0,0,0
0,0,0,0,0,0
0,0,0,0,0,0
0,0,0,0,0,0
0,0,0,0,0,0
0,0,0,0,0,0
0,0,0,0,0,0
0,0,0,0,0,0
0,0,0,0,0,0
0,0,0,0,0,0
0,0,0,0,0,0
0,0,0,0,0,0
0,0,0,0,0,0
0,0,0,0,0,0
0,0,0,0,0,0
0,0,0,0,0,0
0,0,0,0,0,0
0,0,0,0,0,0
0,0,0,0,0,0
0,0,0,0,0,0
0,0,0,0,0,0
0,0,0,0,0,0
0,0,0,0,0,0
0,0,0,0,0,0
0,0,0,0,0,0
0,0,0,0,0,0
0,0,0,0,0,0
0,0,0,0,0,0
0,0,0,0,0,0
0,0,0,0,0,0
0,0,0,0,0,0
0,0,0,0,0,0
0,0,0,0,0,0
0,0,0,0,0,0
0,0,0,0,0,0
0,0,0,0,0,0
0,0,0,0,0,0
0,0,0,0,0,0
0,0,0,0,0,0
0,0,0,0,0,0
0,0,0,0,0,0
0,0,0,0,0,0
0,0,0,0,0,0
0,0,0,0,0,0
0,0,0,0,0,0
0,0,0,0,0,0
0,0,0,0,0,0
0,0,0,0,0,0
0,0,0,0,0,0
0,0,0,0,0,0
0,0,0,0,0,0
0,0,0,0,0,0
0,0,0,0,0,0
0,0,0,0,0,0
0,0,0,0,0,0
0,0,0,0,0,0
0,0,0,0,0,0
0,0,0,0,0,0
0,0,0,0,0,0
0,0,0,0,0,0
0,0,0,0,0,0
0,0,0,0,0,0
=== Summary ===

Correctly Classified Instances          90               95.7447 %
Incorrectly Classified Instances         4                4.2553 %
Kappa statistic                          0     
K&B Relative Info Score                433.5572 %
K&B Information Score                    1.3758 bits      0.0146 bits/instance
Class complexity | order 0              24.7899 bits      0.2637 bits/instance
Class complexity | scheme               24.8735 bits      0.2646 bits/instance
Complexity improvement     (Sf)         -0.0836 bits     -0.0009 bits/instance
Mean absolute error                      0.0817
Root mean squared error                  0.2033
Relative absolute error                 89.4343 %
Root relative squared error             99.8984 %
Coverage of cases (0.95 level)          95.7447 %
Mean rel. region size (0.95 level)      50      %
Total Number of Instances               94     

Operation took 13ms
Computing linear combination...
@relation rel

@attribute C_0 numeric
@attribute C_1 numeric
@attribute C_2 numeric
@attribute C_3 numeric
@attribute C_4 numeric
@attribute t {0,1}

@data
1,1,1,1,1,1
1,1,1,1,1,1
1,1,1,1,1,1
1,1,1,1,1,1
0,0,0,0,0,0
0,0,0,0,0,0
0,0,0,0,0,0
0,0,0,0,0,0
0,0,0,0,0,0
0,0,0,0,0,0
0,0,0,0,0,0
0,0,0,0,0,0
0,0,0,0,0,0
0,0,0,0,0,0
0,0,0,0,0,0
0,0,0,0,0,0
0,0,0,0,0,0
0,0,0,0,0,0
0,0,0,0,0,0
0,0,0,0,0,0
0,0,0,0,0,0
0,0,0,0,0,0
0,0,0,0,0,0
0,0,0,0,0,0
0,0,0,0,0,0
0,0,0,0,0,0
0,0,0,0,0,0
0,0,0,0,0,0
0,0,0,0,0,0
0,0,0,0,0,0
0,0,0,0,0,0
0,0,0,0,0,0
0,0,0,0,0,0
0,0,0,0,0,0
0,0,0,0,0,0
0,0,0,0,0,0
0,0,0,0,0,0
0,0,0,0,0,0
0,0,0,0,0,0
0,0,0,0,0,0
0,0,0,0,0,0
0,0,0,0,0,0
0,0,0,0,0,0
0,0,0,0,0,0
0,0,0,0,0,0
0,0,0,0,0,0
0,0,0,0,0,0
0,0,0,0,0,0
0,0,0,0,0,0
0,0,0,0,0,0
0,0,0,0,0,0
0,0,0,0,0,0
0,0,0,0,0,0
0,0,0,0,0,0
0,0,0,0,0,0
0,0,0,0,0,0
0,0,0,0,0,0
0,0,0,0,0,0
0,0,0,0,0,0
0,0,0,0,0,0
0,0,0,0,0,0
0,0,0,0,0,0
0,0,0,0,0,0
0,0,0,0,0,0
0,0,0,0,0,0
0,0,0,0,0,0
0,0,0,0,0,0
0,0,0,0,0,0
0,0,0,0,0,0
0,0,0,0,0,0
0,0,0,0,0,0
0,0,0,0,0,0
0,0,0,0,0,0
0,0,0,0,0,0
0,0,0,0,0,0
0,0,0,0,0,0
0,0,0,0,0,0
0,0,0,0,0,0
0,0,0,0,0,0
0,0,0,0,0,0
0,0,0,0,0,0
0,0,0,0,0,0
0,0,0,0,0,0
0,0,0,0,0,0
0,0,0,0,0,0
0,0,0,0,0,0
0,0,0,0,0,0
0,0,0,0,0,0
0,0,0,0,0,0
0,0,0,0,0,0
0,0,0,0,0,0
0,0,0,0,0,0
0,0,0,0,0,0
0,0,0,0,0,0
=== Summary ===

Correctly Classified Instances          90               95.7447 %
Incorrectly Classified Instances         4                4.2553 %
Kappa statistic                          0     
K&B Relative Info Score                433.5572 %
K&B Information Score                    1.3758 bits      0.0146 bits/instance
Class complexity | order 0              24.7899 bits      0.2637 bits/instance
Class complexity | scheme               24.8735 bits      0.2646 bits/instance
Complexity improvement     (Sf)         -0.0836 bits     -0.0009 bits/instance
Mean absolute error                      0.0817
Root mean squared error                  0.2033
Relative absolute error                 89.4343 %
Root relative squared error             99.8984 %
Coverage of cases (0.95 level)          95.7447 %
Mean rel. region size (0.95 level)      50      %
Total Number of Instances               94     

Operation took 13ms
Computing linear combination...
@relation rel

@attribute C_0 numeric
@attribute C_1 numeric
@attribute C_2 numeric
@attribute C_3 numeric
@attribute C_4 numeric
@attribute t {0,1}

@data
1,1,1,1,1,1
1,1,1,1,1,1
1,1,1,1,1,1
1,1,1,1,1,1
0,0,0,0,0,0
0,0,0,0,0,0
0,0,0,0,0,0
0,0,0,0,0,0
0,0,0,0,0,0
0,0,0,0,0,0
0,0,0,0,0,0
0,0,0,0,0,0
0,0,0,0,0,0
0,0,0,0,0,0
0,0,0,0,0,0
0,0,0,0,0,0
0,0,0,0,0,0
0,0,0,0,0,0
0,0,0,0,0,0
0,0,0,0,0,0
0,0,0,0,0,0
0,0,0,0,0,0
0,0,0,0,0,0
0,0,0,0,0,0
0,0,0,0,0,0
0,0,0,0,0,0
0,0,0,0,0,0
0,0,0,0,0,0
0,0,0,0,0,0
0,0,0,0,0,0
0,0,0,0,0,0
0,0,0,0,0,0
0,0,0,0,0,0
0,0,0,0,0,0
0,0,0,0,0,0
0,0,0,0,0,0
0,0,0,0,0,0
0,0,0,0,0,0
0,0,0,0,0,0
0,0,0,0,0,0
0,0,0,0,0,0
0,0,0,0,0,0
0,0,0,0,0,0
0,0,0,0,0,0
0,0,0,0,0,0
0,0,0,0,0,0
0,0,0,0,0,0
0,0,0,0,0,0
0,0,0,0,0,0
0,0,0,0,0,0
0,0,0,0,0,0
0,0,0,0,0,0
0,0,0,0,0,0
0,0,0,0,0,0
0,0,0,0,0,0
0,0,0,0,0,0
0,0,0,0,0,0
0,0,0,0,0,0
0,0,0,0,0,0
0,0,0,0,0,0
0,0,0,0,0,0
0,0,0,0,0,0
0,0,0,0,0,0
0,0,0,0,0,0
0,0,0,0,0,0
0,0,0,0,0,0
0,0,0,0,0,0
0,0,0,0,0,0
0,0,0,0,0,0
0,0,0,0,0,0
0,0,0,0,0,0
0,0,0,0,0,0
0,0,0,0,0,0
0,0,0,0,0,0
0,0,0,0,0,0
0,0,0,0,0,0
0,0,0,0,0,0
0,0,0,0,0,0
0,0,0,0,0,0
0,0,0,0,0,0
0,0,0,0,0,0
0,0,0,0,0,0
0,0,0,0,0,0
0,0,0,0,0,0
0,0,0,0,0,0
0,0,0,0,0,0
0,0,0,0,0,0
0,0,0,0,0,0
0,0,0,0,0,0
0,0,0,0,0,0
0,0,0,0,0,0
0,0,0,0,0,0
0,0,0,0,0,0
0,0,0,0,0,0
=== Summary ===

Correctly Classified Instances          90               95.7447 %
Incorrectly Classified Instances         4                4.2553 %
Kappa statistic                          0     
K&B Relative Info Score                433.5572 %
K&B Information Score                    1.3758 bits      0.0146 bits/instance
Class complexity | order 0              24.7899 bits      0.2637 bits/instance
Class complexity | scheme               24.8735 bits      0.2646 bits/instance
Complexity improvement     (Sf)         -0.0836 bits     -0.0009 bits/instance
Mean absolute error                      0.0817
Root mean squared error                  0.2033
Relative absolute error                 89.4343 %
Root relative squared error             99.8984 %
Coverage of cases (0.95 level)          95.7447 %
Mean rel. region size (0.95 level)      50      %
Total Number of Instances               94     

Operation took 12ms
Computing linear combination...
@relation rel

@attribute C_0 numeric
@attribute C_1 numeric
@attribute C_2 numeric
@attribute C_3 numeric
@attribute C_4 numeric
@attribute t {0,1}

@data
1,1,1,1,1,1
1,1,1,1,1,1
1,1,1,1,1,1
1,1,1,1,1,1
0,0,0,0,0,0
0,0,0,0,0,0
0,0,0,0,0,0
0,0,0,0,0,0
0,0,0,0,0,0
0,0,0,0,0,0
0,0,0,0,0,0
0,0,0,0,0,0
0,0,0,0,0,0
0,0,0,0,0,0
0,0,0,0,0,0
0,0,0,0,0,0
0,0,0,0,0,0
0,0,0,0,0,0
0,0,0,0,0,0
0,0,0,0,0,0
0,0,0,0,0,0
0,0,0,0,0,0
0,0,0,0,0,0
0,0,0,0,0,0
0,0,0,0,0,0
0,0,0,0,0,0
0,0,0,0,0,0
0,0,0,0,0,0
0,0,0,0,0,0
0,0,0,0,0,0
0,0,0,0,0,0
0,0,0,0,0,0
0,0,0,0,0,0
0,0,0,0,0,0
0,0,0,0,0,0
0,0,0,0,0,0
0,0,0,0,0,0
0,0,0,0,0,0
0,0,0,0,0,0
0,0,0,0,0,0
0,0,0,0,0,0
0,0,0,0,0,0
0,0,0,0,0,0
0,0,0,0,0,0
0,0,0,0,0,0
0,0,0,0,0,0
0,0,0,0,0,0
0,0,0,0,0,0
0,0,0,0,0,0
0,0,0,0,0,0
0,0,0,0,0,0
0,0,0,0,0,0
0,0,0,0,0,0
0,0,0,0,0,0
0,0,0,0,0,0
0,0,0,0,0,0
0,0,0,0,0,0
0,0,0,0,0,0
0,0,0,0,0,0
0,0,0,0,0,0
0,0,0,0,0,0
0,0,0,0,0,0
0,0,0,0,0,0
0,0,0,0,0,0
0,0,0,0,0,0
0,0,0,0,0,0
0,0,0,0,0,0
0,0,0,0,0,0
0,0,0,0,0,0
0,0,0,0,0,0
0,0,0,0,0,0
0,0,0,0,0,0
0,0,0,0,0,0
0,0,0,0,0,0
0,0,0,0,0,0
0,0,0,0,0,0
0,0,0,0,0,0
0,0,0,0,0,0
0,0,0,0,0,0
0,0,0,0,0,0
0,0,0,0,0,0
0,0,0,0,0,0
0,0,0,0,0,0
0,0,0,0,0,0
0,0,0,0,0,0
0,0,0,0,0,0
0,0,0,0,0,0
0,0,0,0,0,0
0,0,0,0,0,0
0,0,0,0,0,0
0,0,0,0,0,0
0,0,0,0,0,0
0,0,0,0,0,0
0,0,0,0,0,0
=== Summary ===

Correctly Classified Instances          90               95.7447 %
Incorrectly Classified Instances         4                4.2553 %
Kappa statistic                          0     
K&B Relative Info Score                433.5572 %
K&B Information Score                    1.3758 bits      0.0146 bits/instance
Class complexity | order 0              24.7899 bits      0.2637 bits/instance
Class complexity | scheme               24.8735 bits      0.2646 bits/instance
Complexity improvement     (Sf)         -0.0836 bits     -0.0009 bits/instance
Mean absolute error                      0.0817
Root mean squared error                  0.2033
Relative absolute error                 89.4343 %
Root relative squared error             99.8984 %
Coverage of cases (0.95 level)          95.7447 %
Mean rel. region size (0.95 level)      50      %
Total Number of Instances               94     

Operation took 12ms
Computing linear combination...
@relation rel

@attribute C_0 numeric
@attribute C_1 numeric
@attribute C_2 numeric
@attribute C_3 numeric
@attribute C_4 numeric
@attribute t {0,1}

@data
1,1,1,1,1,1
1,1,1,1,1,1
1,1,1,1,1,1
1,1,1,1,1,1
0,0,0,0,0,0
0,0,0,0,0,0
0,0,0,0,0,0
0,0,0,0,0,0
0,0,0,0,0,0
0,0,0,0,0,0
0,0,0,0,0,0
0,0,0,0,0,0
0,0,0,0,0,0
0,0,0,0,0,0
0,0,0,0,0,0
0,0,0,0,0,0
0,0,0,0,0,0
0,0,0,0,0,0
0,0,0,0,0,0
0,0,0,0,0,0
0,0,0,0,0,0
0,0,0,0,0,0
0,0,0,0,0,0
0,0,0,0,0,0
0,0,0,0,0,0
0,0,0,0,0,0
0,0,0,0,0,0
0,0,0,0,0,0
0,0,0,0,0,0
0,0,0,0,0,0
0,0,0,0,0,0
0,0,0,0,0,0
0,0,0,0,0,0
0,0,0,0,0,0
0,0,0,0,0,0
0,0,0,0,0,0
0,0,0,0,0,0
0,0,0,0,0,0
0,0,0,0,0,0
0,0,0,0,0,0
0,0,0,0,0,0
0,0,0,0,0,0
0,0,0,0,0,0
0,0,0,0,0,0
0,0,0,0,0,0
0,0,0,0,0,0
0,0,0,0,0,0
0,0,0,0,0,0
0,0,0,0,0,0
0,0,0,0,0,0
0,0,0,0,0,0
0,0,0,0,0,0
0,0,0,0,0,0
0,0,0,0,0,0
0,0,0,0,0,0
0,0,0,0,0,0
0,0,0,0,0,0
0,0,0,0,0,0
0,0,0,0,0,0
0,0,0,0,0,0
0,0,0,0,0,0
0,0,0,0,0,0
0,0,0,0,0,0
0,0,0,0,0,0
0,0,0,0,0,0
0,0,0,0,0,0
0,0,0,0,0,0
0,0,0,0,0,0
0,0,0,0,0,0
0,0,0,0,0,0
0,0,0,0,0,0
0,0,0,0,0,0
0,0,0,0,0,0
0,0,0,0,0,0
0,0,0,0,0,0
0,0,0,0,0,0
0,0,0,0,0,0
0,0,0,0,0,0
0,0,0,0,0,0
0,0,0,0,0,0
0,0,0,0,0,0
0,0,0,0,0,0
0,0,0,0,0,0
0,0,0,0,0,0
0,0,0,0,0,0
0,0,0,0,0,0
0,0,0,0,0,0
0,0,0,0,0,0
0,0,0,0,0,0
0,0,0,0,0,0
0,0,0,0,0,0
0,0,0,0,0,0
0,0,0,0,0,0
0,0,0,0,0,0
=== Summary ===

Correctly Classified Instances          90               95.7447 %
Incorrectly Classified Instances         4                4.2553 %
Kappa statistic                          0     
K&B Relative Info Score                433.5572 %
K&B Information Score                    1.3758 bits      0.0146 bits/instance
Class complexity | order 0              24.7899 bits      0.2637 bits/instance
Class complexity | scheme               24.8735 bits      0.2646 bits/instance
Complexity improvement     (Sf)         -0.0836 bits     -0.0009 bits/instance
Mean absolute error                      0.0817
Root mean squared error                  0.2033
Relative absolute error                 89.4343 %
Root relative squared error             99.8984 %
Coverage of cases (0.95 level)          95.7447 %
Mean rel. region size (0.95 level)      50      %
Total Number of Instances               94     

Operation took 14ms
Computing linear combination...
@relation rel

@attribute C_0 numeric
@attribute C_1 numeric
@attribute C_2 numeric
@attribute C_3 numeric
@attribute C_4 numeric
@attribute t {0,1}

@data
1,1,1,1,1,1
1,1,1,1,1,1
1,1,1,1,1,1
1,1,1,1,1,1
0,0,0,0,0,0
0,0,0,0,0,0
0,0,0,0,0,0
0,0,0,0,0,0
0,0,0,0,0,0
0,0,0,0,0,0
0,0,0,0,0,0
0,0,0,0,0,0
0,0,0,0,0,0
0,0,0,0,0,0
0,0,0,0,0,0
0,0,0,0,0,0
0,0,0,0,0,0
0,0,0,0,0,0
0,0,0,0,0,0
0,0,0,0,0,0
0,0,0,0,0,0
0,0,0,0,0,0
0,0,0,0,0,0
0,0,0,0,0,0
0,0,0,0,0,0
0,0,0,0,0,0
0,0,0,0,0,0
0,0,0,0,0,0
0,0,0,0,0,0
0,0,0,0,0,0
0,0,0,0,0,0
0,0,0,0,0,0
0,0,0,0,0,0
0,0,0,0,0,0
0,0,0,0,0,0
0,0,0,0,0,0
0,0,0,0,0,0
0,0,0,0,0,0
0,0,0,0,0,0
0,0,0,0,0,0
0,0,0,0,0,0
0,0,0,0,0,0
0,0,0,0,0,0
0,0,0,0,0,0
0,0,0,0,0,0
0,0,0,0,0,0
0,0,0,0,0,0
0,0,0,0,0,0
0,0,0,0,0,0
0,0,0,0,0,0
0,0,0,0,0,0
0,0,0,0,0,0
0,0,0,0,0,0
0,0,0,0,0,0
0,0,0,0,0,0
0,0,0,0,0,0
0,0,0,0,0,0
0,0,0,0,0,0
0,0,0,0,0,0
0,0,0,0,0,0
0,0,0,0,0,0
0,0,0,0,0,0
0,0,0,0,0,0
0,0,0,0,0,0
0,0,0,0,0,0
0,0,0,0,0,0
0,0,0,0,0,0
0,0,0,0,0,0
0,0,0,0,0,0
0,0,0,0,0,0
0,0,0,0,0,0
0,0,0,0,0,0
0,0,0,0,0,0
0,0,0,0,0,0
0,0,0,0,0,0
0,0,0,0,0,0
0,0,0,0,0,0
0,0,0,0,0,0
0,0,0,0,0,0
0,0,0,0,0,0
0,0,0,0,0,0
0,0,0,0,0,0
0,0,0,0,0,0
0,0,0,0,0,0
0,0,0,0,0,0
0,0,0,0,0,0
0,0,0,0,0,0
0,0,0,0,0,0
0,0,0,0,0,0
0,0,0,0,0,0
0,0,0,0,0,0
0,0,0,0,0,0
0,0,0,0,0,0
0,0,0,0,0,0
=== Summary ===

Correctly Classified Instances          90               95.7447 %
Incorrectly Classified Instances         4                4.2553 %
Kappa statistic                          0     
K&B Relative Info Score                433.5572 %
K&B Information Score                    1.3758 bits      0.0146 bits/instance
Class complexity | order 0              24.7899 bits      0.2637 bits/instance
Class complexity | scheme               24.8735 bits      0.2646 bits/instance
Complexity improvement     (Sf)         -0.0836 bits     -0.0009 bits/instance
Mean absolute error                      0.0817
Root mean squared error                  0.2033
Relative absolute error                 89.4343 %
Root relative squared error             99.8984 %
Coverage of cases (0.95 level)          95.7447 %
Mean rel. region size (0.95 level)      50      %
Total Number of Instances               94     

Operation took 25ms
Algorithm terminated successfully (time: 20s 0ms, 46398 descriptions tested, 10617 nodes in the search tree).

number of retrievals: 48366
retrieval reasoning time: 1s 811ms ( 0ms per retrieval)
number of instance checks: 356 (0 multiple)
instance check reasoning time: 2ms ( 0ms per instance check)
(complex) subsumption checks: 367 (0 multiple)
subsumption reasoning time: 2s 85ms ( 5ms per subsumption check)
overall reasoning time: 4s 952ms

solutions:
1: isCreatedBy some Customer 100.00%
2: isCreatedBy some (Customer or Document) 100.00%
3: isCreatedBy some (Customer or Concept) 100.00%
4: isCreatedBy some (Customer or Image) 100.00%
5: isCreatedBy some (Customer or TradeUnion) 100.00%
6: isCreatedBy some (Customer or SystemRequirement) 100.00%
7: isCreatedBy some (Customer or SeniorManagementStaff) 100.00%
8: isCreatedBy some (Customer or Document) 100.00%
9: isCreatedBy some (Creditor or Customer) 100.00%
10: Requirement and (isCreatedBy some Customer) 100.00%

Computing linear combination...
@relation rel

@attribute C_0 numeric
@attribute C_1 numeric
@attribute C_2 numeric
@attribute C_3 numeric
@attribute C_4 numeric
@attribute t {0,1}

@data
1,1,1,1,1,1
1,1,1,1,1,1
1,1,1,1,1,1
1,1,1,1,1,1
0,0,0,0,0,0
0,0,0,0,0,0
0,0,0,0,0,0
0,0,0,0,0,0
0,0,0,0,0,0
0,0,0,0,0,0
0,0,0,0,0,0
0,0,0,0,0,0
0,0,0,0,0,0
0,0,0,0,0,0
0,0,0,0,0,0
0,0,0,0,0,0
0,0,0,0,0,0
0,0,0,0,0,0
0,0,0,0,0,0
0,0,0,0,0,0
0,0,0,0,0,0
0,0,0,0,0,0
0,0,0,0,0,0
0,0,0,0,0,0
0,0,0,0,0,0
0,0,0,0,0,0
0,0,0,0,0,0
0,0,0,0,0,0
0,0,0,0,0,0
0,0,0,0,0,0
0,0,0,0,0,0
0,0,0,0,0,0
0,0,0,0,0,0
0,0,0,0,0,0
0,0,0,0,0,0
0,0,0,0,0,0
0,0,0,0,0,0
0,0,0,0,0,0
0,0,0,0,0,0
0,0,0,0,0,0
0,0,0,0,0,0
0,0,0,0,0,0
0,0,0,0,0,0
0,0,0,0,0,0
0,0,0,0,0,0
0,0,0,0,0,0
0,0,0,0,0,0
0,0,0,0,0,0
0,0,0,0,0,0
0,0,0,0,0,0
0,0,0,0,0,0
0,0,0,0,0,0
0,0,0,0,0,0
0,0,0,0,0,0
0,0,0,0,0,0
0,0,0,0,0,0
0,0,0,0,0,0
0,0,0,0,0,0
0,0,0,0,0,0
0,0,0,0,0,0
0,0,0,0,0,0
0,0,0,0,0,0
0,0,0,0,0,0
0,0,0,0,0,0
0,0,0,0,0,0
0,0,0,0,0,0
0,0,0,0,0,0
0,0,0,0,0,0
0,0,0,0,0,0
0,0,0,0,0,0
0,0,0,0,0,0
0,0,0,0,0,0
0,0,0,0,0,0
0,0,0,0,0,0
0,0,0,0,0,0
0,0,0,0,0,0
0,0,0,0,0,0
0,0,0,0,0,0
0,0,0,0,0,0
0,0,0,0,0,0
0,0,0,0,0,0
0,0,0,0,0,0
0,0,0,0,0,0
0,0,0,0,0,0
0,0,0,0,0,0
0,0,0,0,0,0
0,0,0,0,0,0
0,0,0,0,0,0
0,0,0,0,0,0
0,0,0,0,0,0
0,0,0,0,0,0
0,0,0,0,0,0
0,0,0,0,0,0
0,0,0,0,0,0
=== Summary ===

Correctly Classified Instances          90               95.7447 %
Incorrectly Classified Instances         4                4.2553 %
Kappa statistic                          0     
K&B Relative Info Score                433.5572 %
K&B Information Score                    1.3758 bits      0.0146 bits/instance
Class complexity | order 0              24.7899 bits      0.2637 bits/instance
Class complexity | scheme               24.8735 bits      0.2646 bits/instance
Complexity improvement     (Sf)         -0.0836 bits     -0.0009 bits/instance
Mean absolute error                      0.0817
Root mean squared error                  0.2033
Relative absolute error                 89.4343 %
Root relative squared error             99.8984 %
Coverage of cases (0.95 level)          95.7447 %
Mean rel. region size (0.95 level)      50      %
Total Number of Instances               94     

Operation took 14ms
Tests run: 1, Failures: 0, Errors: 0, Skipped: 0, Time elapsed: 25.728 sec - in org.dllearner.algorithms.miles.MILESTest
Running org.dllearner.unife.algorithms.probabilistic.structure.distributed.leap.AppTest
Tests run: 1, Failures: 0, Errors: 0, Skipped: 0, Time elapsed: 0 sec - in org.dllearner.unife.algorithms.probabilistic.structure.distributed.leap.AppTest
Running org.dllearner.unife.algorithms.probabilistic.structure.leap.LEAPTest
Current dir: /usr/share/tomcat6/.jenkins/jobs/DL-Learner Merge-M/branches/leap-alternative/workspace/components-ext
Test case 1 - Equivalent axioms
http://www.oracle.com/xml/jaxp/properties/entityExpansionLimit not supported by parser type org.apache.xerces.jaxp.SAXParserImpl
entityExpansionLimit not supported by parser type org.apache.xerces.jaxp.SAXParserImpl
Total number of triples: 27
Loaded OntologyID(OntologyIRI(<http://example.com/father>) VersionIRI(<null>))
dumping remaining triples
done dumping remaining triples
Loaded reasoner: Pellet (com.clarkparsia.pellet.owlapiv3.PelletReasoner)
Materializing TBox...
materialising concepts
materialising object properties ...
finished materialising object properties.
materialising datatype properties
finished materialising data properties.
...TBox materialised in 2 ms.
Initializing EDGE
Numeric Splits: {}
Debug logger: true
getting the individuals
convert the individuals into assertional axioms
Starting structure learner LEAP
start class:Thing
more accurate (75.00%) class expression found after 2ms: Thing
computeM
BOOL DPs:[]
Numeric DPs:[]
most general properties:
`hasChild=1
m: {1=[person], 2=[not (father), not (female)], 3=[hasChild some Thing, hasChild only Thing], 4=[hasChild max 0 Thing]}
more accurate (100.00%) class expression found after 11ms: hasChild some person
Algorithm terminated successfully (time: 10s 2ms, 9018 descriptions tested, 6322 nodes in the search tree).

number of retrievals: 9163
retrieval reasoning time: 95ms ( 0ms per retrieval)
number of instance checks: 56 (0 multiple)
instance check reasoning time: 0ms ( 0ms per instance check)
(complex) subsumption checks: 299 (0 multiple)
subsumption reasoning time: 38ms ( 0ms per subsumption check)
overall reasoning time: 133ms

solutions:
1: hasChild some person 100.00%
2: female or (hasChild some person) 100.00%
3: male and (hasChild some person) 100.00%
4: (not (male)) or (hasChild some person) 100.00%
5: (not (female)) and (hasChild some person) 100.00%
6: (hasChild some female) or (hasChild some male) 100.00%
7: male and (father or (hasChild some person)) 100.00%
8: male and (father or (hasChild some male)) 100.00%
9: male and (father or (hasChild some female)) 100.00%
10: male and (father or (hasChild some father)) 100.00%

Start greedy search
Initial Log-likelihood: -34.53879
 INFO (EDGE.java:373) - Creation of the learned ontology...
Creation of the learned ontology...
 INFO (EDGE.java:468) - Successful creation of the learned ontology
Successful creation of the learned ontology
 INFO (EDGE.java:469) - Ontology created in 1.0 (ms)
Ontology created in 1.0 (ms)
Type of axiom to learn: equivalentClasses axioms
number of axiom chunks: 10
Adding axiom: learnedClass EquivalentTo hasChild some person
Running parameter learner
 INFO (BundleUtilities.java:292) - Created 22 probabilistic axiom
Created 22 probabilistic axiom
 INFO (BundleUtilities.java:297) - Probability Map computed. Size: 22
Probability Map computed. Size: 22
 INFO (BundleUtilities.java:297) - Probability Map computed. Size: 1
Probability Map computed. Size: 1
 INFO (EDGE.java:205) - Start finding explanations for every example (Computing BDDs)...
Start finding explanations for every example (Computing BDDs)...
 INFO (EDGE.java:210) - Query 1 of 4 (25%)
Query 1 of 4 (25%)
Test case 2 - SubClassOf axioms
http://www.oracle.com/xml/jaxp/properties/entityExpansionLimit not supported by parser type org.apache.xerces.jaxp.SAXParserImpl
entityExpansionLimit not supported by parser type org.apache.xerces.jaxp.SAXParserImpl
Total number of triples: 27
Loaded OntologyID(OntologyIRI(<http://example.com/father>) VersionIRI(<null>))
dumping remaining triples
done dumping remaining triples
Loaded reasoner: Pellet (com.clarkparsia.pellet.owlapiv3.PelletReasoner)
Materializing TBox...
materialising concepts
materialising object properties ...
finished materialising object properties.
materialising datatype properties
finished materialising data properties.
...TBox materialised in 1 ms.
Initializing EDGE
Numeric Splits: {}
Debug logger: true
getting the individuals
convert the individuals into assertional axioms
Starting structure learner LEAP
start class:Thing
more accurate (75.00%) class expression found after 0ms: Thing
computeM
BOOL DPs:[]
Numeric DPs:[]
most general properties:
`hasChild=1
m: {1=[person], 2=[not (father), not (female)], 3=[hasChild some Thing, hasChild only Thing], 4=[hasChild max 0 Thing]}
more accurate (100.00%) class expression found after 7ms: hasChild some person
Algorithm terminated successfully (time: 10s 2ms, 9009 descriptions tested, 6319 nodes in the search tree).

number of retrievals: 9154
retrieval reasoning time: 66ms ( 0ms per retrieval)
number of instance checks: 56 (0 multiple)
instance check reasoning time: 0ms ( 0ms per instance check)
(complex) subsumption checks: 299 (0 multiple)
subsumption reasoning time: 26ms ( 0ms per subsumption check)
overall reasoning time: 93ms

solutions:
1: hasChild some person 100.00%
2: female or (hasChild some person) 100.00%
3: male and (hasChild some person) 100.00%
4: (not (male)) or (hasChild some person) 100.00%
5: (not (female)) and (hasChild some person) 100.00%
6: (hasChild some female) or (hasChild some male) 100.00%
7: male and (father or (hasChild some person)) 100.00%
8: male and (father or (hasChild some male)) 100.00%
9: male and (father or (hasChild some female)) 100.00%
10: male and (father or (hasChild some father)) 100.00%

Start greedy search
Initial Log-likelihood: -34.53879
 INFO (EDGE.java:373) - Creation of the learned ontology...
Creation of the learned ontology...
 INFO (EDGE.java:468) - Successful creation of the learned ontology
Successful creation of the learned ontology
 INFO (EDGE.java:469) - Ontology created in 0.0 (ms)
Ontology created in 0.0 (ms)
Type of axiom to learn: subClassOf axioms
number of axiom chunks: 10
Adding axiom: hasChild some person SubClassOf learnedClass
Running parameter learner
 INFO (BundleUtilities.java:292) - Created 22 probabilistic axiom
Created 22 probabilistic axiom
 INFO (BundleUtilities.java:297) - Probability Map computed. Size: 22
Probability Map computed. Size: 22
 INFO (BundleUtilities.java:270) - hasChild some person SubClassOf learnedClass => 1.0
hasChild some person SubClassOf learnedClass => 1.0
 INFO (BundleUtilities.java:297) - Probability Map computed. Size: 1
Probability Map computed. Size: 1
 INFO (EDGE.java:205) - Start finding explanations for every example (Computing BDDs)...
Start finding explanations for every example (Computing BDDs)...
 INFO (EDGE.java:210) - Query 1 of 4 (25%)
Query 1 of 4 (25%)
Test case 3 - Dummy parameter learner
http://www.oracle.com/xml/jaxp/properties/entityExpansionLimit not supported by parser type org.apache.xerces.jaxp.SAXParserImpl
entityExpansionLimit not supported by parser type org.apache.xerces.jaxp.SAXParserImpl
Total number of triples: 27
Loaded OntologyID(OntologyIRI(<http://example.com/father>) VersionIRI(<null>))
dumping remaining triples
done dumping remaining triples
Loaded reasoner: Pellet (com.clarkparsia.pellet.owlapiv3.PelletReasoner)
Materializing TBox...
materialising concepts
materialising object properties ...
finished materialising object properties.
materialising datatype properties
finished materialising data properties.
...TBox materialised in 1 ms.
Numeric Splits: {}
Debug logger: true
getting the individuals
convert the individuals into assertional axioms
Starting structure learner LEAP
start class:Thing
more accurate (75.00%) class expression found after 0ms: Thing
computeM
BOOL DPs:[]
Numeric DPs:[]
most general properties:
`hasChild=1
m: {1=[person], 2=[not (father), not (female)], 3=[hasChild some Thing, hasChild only Thing], 4=[hasChild max 0 Thing]}
more accurate (100.00%) class expression found after 8ms: hasChild some person
Algorithm terminated successfully (time: 10s 0ms, 9019 descriptions tested, 6322 nodes in the search tree).

number of retrievals: 9164
retrieval reasoning time: 62ms ( 0ms per retrieval)
number of instance checks: 56 (0 multiple)
instance check reasoning time: 0ms ( 0ms per instance check)
(complex) subsumption checks: 299 (0 multiple)
subsumption reasoning time: 26ms ( 0ms per subsumption check)
overall reasoning time: 89ms

solutions:
1: hasChild some person 100.00%
2: female or (hasChild some person) 100.00%
3: male and (hasChild some person) 100.00%
4: (not (male)) or (hasChild some person) 100.00%
5: (not (female)) and (hasChild some person) 100.00%
6: (hasChild some female) or (hasChild some male) 100.00%
7: male and (father or (hasChild some person)) 100.00%
8: male and (father or (hasChild some male)) 100.00%
9: male and (father or (hasChild some female)) 100.00%
10: male and (father or (hasChild some father)) 100.00%

Start greedy search
Initial Log-likelihood: -41.44653
Successful creation of the learned ontology
Ontology created in 1.0 (ms)
Type of axiom to learn: subClassOf axioms
number of axiom chunks: 10
Adding axiom: hasChild some person SubClassOf learnedClass
Running parameter learner
Created 22 probabilistic axiom
Probability Map computed. Size: 22
Current Log-Likelihood: 0.0
Log-Likelihood enhanced. Updating ontologies...
Updating ontology
Successful creation of the learned ontology
Ontology created in 3.0 (ms)
Ontology Updated
Adding axiom: female or (hasChild some person) SubClassOf learnedClass
Running parameter learner
Probability Map computed. Size: 23
Current Log-Likelihood: 0.0
Log-Likelihood worsened. Removing Last Axioms...
Adding axiom: male and (hasChild some person) SubClassOf learnedClass
Running parameter learner
Probability Map computed. Size: 23
Current Log-Likelihood: 0.0
Log-Likelihood worsened. Removing Last Axioms...
Adding axiom: (not (male)) or (hasChild some person) SubClassOf learnedClass
Running parameter learner
Probability Map computed. Size: 23
Current Log-Likelihood: 0.0
Log-Likelihood worsened. Removing Last Axioms...
Adding axiom: (not (female)) and (hasChild some person) SubClassOf learnedClass
Running parameter learner
Probability Map computed. Size: 23
Current Log-Likelihood: 0.0
Log-Likelihood worsened. Removing Last Axioms...
Adding axiom: (hasChild some female) or (hasChild some male) SubClassOf learnedClass
Running parameter learner
Probability Map computed. Size: 23
Current Log-Likelihood: 0.0
Log-Likelihood worsened. Removing Last Axioms...
Adding axiom: male and (father or (hasChild some person)) SubClassOf learnedClass
Running parameter learner
Probability Map computed. Size: 23
Current Log-Likelihood: 0.0
Log-Likelihood worsened. Removing Last Axioms...
Adding axiom: male and (father or (hasChild some male)) SubClassOf learnedClass
Running parameter learner
Probability Map computed. Size: 23
Current Log-Likelihood: 0.0
Log-Likelihood worsened. Removing Last Axioms...
Adding axiom: male and (father or (hasChild some female)) SubClassOf learnedClass
Running parameter learner
Probability Map computed. Size: 23
Current Log-Likelihood: 0.0
Log-Likelihood worsened. Removing Last Axioms...
Adding axiom: male and (father or (hasChild some father)) SubClassOf learnedClass
Running parameter learner
Probability Map computed. Size: 23
Current Log-Likelihood: 0.0
Log-Likelihood worsened. Removing Last Axioms...
Greedy search finished
Replacing super class "dummyClass" with "classToDescribe"
Learned Axiom: hasChild some person SubClassOf father
Replaced all the super classes
Saving the learned ontology
Main: 10090 ms
CELOE: 10002 ms
DummyParameterLearner: 0 ms
Other: 88 ms
Program client: execution successfully terminated
Tests run: 3, Failures: 0, Errors: 2, Skipped: 0, Time elapsed: 30.968 sec <<< FAILURE! - in org.dllearner.unife.algorithms.probabilistic.structure.leap.LEAPTest
testCase1(org.dllearner.unife.algorithms.probabilistic.structure.leap.LEAPTest)  Time elapsed: 10.437 sec  <<< ERROR!
java.lang.NoSuchMethodError: unife.bundle.Bundle.setpMap(Ljava/util/Map;)V
	at unife.edge.EDGE.computeExamples(EDGE.java:223)
	at unife.edge.EDGE.computeExamples(EDGE.java:199)
	at unife.edge.EDGE.computeLearning(EDGE.java:168)
	at org.dllearner.unife.algorithms.probabilistic.parameter.edge.EDGE.start(EDGE.java:98)
	at org.dllearner.unife.algorithms.probabilistic.structure.leap.LEAP.greedySearch(LEAP.java:204)
	at org.dllearner.unife.algorithms.probabilistic.structure.leap.LEAP.start(LEAP.java:99)
	at org.dllearner.unife.algorithms.probabilistic.structure.leap.LEAPTest.testCase1(LEAPTest.java:96)

testCase2(org.dllearner.unife.algorithms.probabilistic.structure.leap.LEAPTest)  Time elapsed: 10.238 sec  <<< ERROR!
java.lang.NoSuchMethodError: unife.bundle.Bundle.setpMap(Ljava/util/Map;)V
	at unife.edge.EDGE.computeExamples(EDGE.java:223)
	at unife.edge.EDGE.computeExamples(EDGE.java:199)
	at unife.edge.EDGE.computeLearning(EDGE.java:168)
	at org.dllearner.unife.algorithms.probabilistic.parameter.edge.EDGE.start(EDGE.java:98)
	at org.dllearner.unife.algorithms.probabilistic.structure.leap.LEAP.greedySearch(LEAP.java:204)
	at org.dllearner.unife.algorithms.probabilistic.structure.leap.LEAP.start(LEAP.java:99)
	at org.dllearner.unife.algorithms.probabilistic.structure.leap.LEAPTest.testCase2(LEAPTest.java:130)


Results :

Tests in error: 
  LEAPTest.testCase1:96 » NoSuchMethod unife.bundle.Bundle.setpMap(Ljava/util/Ma...
  LEAPTest.testCase2:130 » NoSuchMethod unife.bundle.Bundle.setpMap(Ljava/util/M...

Tests run: 5, Failures: 0, Errors: 2, Skipped: 0

[ERROR] There are test failures.

Please refer to /usr/share/tomcat6/.jenkins/jobs/DL-Learner Merge-M/branches/leap-alternative/workspace/components-ext/target/surefire-reports for the individual test results.
[JENKINS] Recording test results
[INFO] 
[INFO] --- maven-jar-plugin:3.0.2:jar (default-jar) @ components-ext ---
[INFO] Building jar: /usr/share/tomcat6/.jenkins/jobs/DL-Learner Merge-M/branches/leap-alternative/workspace/components-ext/target/components-ext-1.3.1-SNAPSHOT.jar
[INFO] 
[INFO] --- maven-install-plugin:2.4:install (default-install) @ components-ext ---
[INFO] Installing /usr/share/tomcat6/.jenkins/jobs/DL-Learner Merge-M/branches/leap-alternative/workspace/components-ext/target/components-ext-1.3.1-SNAPSHOT.jar to /usr/share/tomcat6/.m2/repository/org/dllearner/components-ext/1.3.1-SNAPSHOT/components-ext-1.3.1-SNAPSHOT.jar
[INFO] Installing /usr/share/tomcat6/.jenkins/jobs/DL-Learner Merge-M/branches/leap-alternative/workspace/components-ext/pom.xml to /usr/share/tomcat6/.m2/repository/org/dllearner/components-ext/1.3.1-SNAPSHOT/components-ext-1.3.1-SNAPSHOT.pom
[INFO]                                                                         
[INFO] ------------------------------------------------------------------------
[INFO] Building dllearner-interfaces 1.3.1-SNAPSHOT
[INFO] ------------------------------------------------------------------------
[INFO] 
[INFO] --- maven-clean-plugin:2.5:clean (default-clean) @ interfaces ---
[INFO] 
[INFO] --- xmlbeans-maven-plugin:2.3.3:xmlbeans (default) @ interfaces ---
[INFO] 
[INFO] --- javacc-maven-plugin:2.6:javacc (javacc) @ interfaces ---
[INFO] Skipping non-existing source directory: /usr/share/tomcat6/.jenkins/jobs/DL-Learner Merge-M/branches/leap-alternative/workspace/interfaces/src/main/javacc
[INFO] 
[INFO] --- maven-resources-plugin:3.0.1:resources (default-resources) @ interfaces ---
[INFO] Using 'UTF-8' encoding to copy filtered resources.
[INFO] Copying 5 resources
[INFO] Copying 391 resources
[INFO] 
[INFO] --- maven-compiler-plugin:3.5.1:compile (default-compile) @ interfaces ---
[INFO] Changes detected - recompiling the module!
[INFO] Compiling 127 source files to /usr/share/tomcat6/.jenkins/jobs/DL-Learner Merge-M/branches/leap-alternative/workspace/interfaces/target/classes
[INFO] /usr/share/tomcat6/.jenkins/jobs/DL-Learner Merge-M/branches/leap-alternative/workspace/interfaces/src/main/java/org/dllearner/cli/Enrichment.java: Some input files use or override a deprecated API.
[INFO] /usr/share/tomcat6/.jenkins/jobs/DL-Learner Merge-M/branches/leap-alternative/workspace/interfaces/src/main/java/org/dllearner/cli/Enrichment.java: Recompile with -Xlint:deprecation for details.
[INFO] /usr/share/tomcat6/.jenkins/jobs/DL-Learner Merge-M/branches/leap-alternative/workspace/interfaces/src/main/java/org/dllearner/configuration/spring/editors/AbstractPropertyEditor.java: Some input files use unchecked or unsafe operations.
[INFO] /usr/share/tomcat6/.jenkins/jobs/DL-Learner Merge-M/branches/leap-alternative/workspace/interfaces/src/main/java/org/dllearner/configuration/spring/editors/AbstractPropertyEditor.java: Recompile with -Xlint:unchecked for details.
[INFO] 
[INFO] --- maven-resources-plugin:3.0.1:testResources (default-testResources) @ interfaces ---
[INFO] Using 'UTF-8' encoding to copy filtered resources.
[INFO] Copying 2 resources
[INFO] 
[INFO] --- maven-compiler-plugin:3.5.1:testCompile (default-testCompile) @ interfaces ---
[INFO] Changes detected - recompiling the module!
[INFO] Compiling 7 source files to /usr/share/tomcat6/.jenkins/jobs/DL-Learner Merge-M/branches/leap-alternative/workspace/interfaces/target/test-classes
[INFO] /usr/share/tomcat6/.jenkins/jobs/DL-Learner Merge-M/branches/leap-alternative/workspace/interfaces/src/test/java/org/dllearner/test/junit/LearningProblemTest.java: /usr/share/tomcat6/.jenkins/jobs/DL-Learner Merge-M/branches/leap-alternative/workspace/interfaces/src/test/java/org/dllearner/test/junit/LearningProblemTest.java uses unchecked or unsafe operations.
[INFO] /usr/share/tomcat6/.jenkins/jobs/DL-Learner Merge-M/branches/leap-alternative/workspace/interfaces/src/test/java/org/dllearner/test/junit/LearningProblemTest.java: Recompile with -Xlint:unchecked for details.
[INFO] 
[INFO] --- maven-surefire-plugin:2.19.1:test (default-test) @ interfaces ---
[INFO] Surefire report directory: /usr/share/tomcat6/.jenkins/jobs/DL-Learner Merge-M/branches/leap-alternative/workspace/interfaces/target/surefire-reports

-------------------------------------------------------
 T E S T S
-------------------------------------------------------
Running org.dllearner.cli.FatherCLITest
Initializing component 'ks' of type KB File ...
... initialized component 'ks' in 1s 314ms. Status: OK
Initializing component 'embeddedReasoner' of type OWL API Reasoner ...
Loaded reasoner: Pellet (com.clarkparsia.pellet.owlapiv3.PelletReasoner)
... initialized component 'embeddedReasoner' in 806ms. Status: OK
Initializing component 'reasoner' of type closed world reasoner ...
Materializing TBox...
...TBox materialised in 619 ms.
... initialized component 'reasoner' in 623ms. Status: OK
Initializing component 'op' of type rho refinement operator ...
... initialized component 'op' in 34ms. Status: OK
Initializing component 'lp' of type PosNegLPStandard ...
... initialized component 'lp' in 0ms. Status: OK
Initializing component 'h' of type multiple criteria heuristic ...
... initialized component 'h' in 0ms. Status: OK
Initializing component 'alg' of type OWL Class Expression Learner ...
... initialized component 'alg' in 4ms. Status: OK
starting top down refinement with: Thing (42.857% accuracy)
more accurate (85.71%) class expression found: male
more accurate (100.00%) class expression found: male and (hasChild some Thing)
Maximum time (15 seconds) reached, stopping now...
solutions (at most 20 are shown):
1: male and (hasChild some Thing) (accuracy 100%, length 5, depth 1)
2: (not (female)) and (hasChild some Thing) (accuracy 100%, length 6, depth 1)
3: hasChild some (female or (hasChild some Thing)) (accuracy 100%, length 7, depth 2)
4: hasChild some (female or (hasChild some female)) (accuracy 100%, length 7, depth 2)
5: hasChild some (female or (hasChild some (not (male)))) (accuracy 100%, length 8, depth 2)
6: hasChild some (female or (hasChild some (hasChild some Thing))) (accuracy 100%, length 9, depth 3)
7: male and (hasChild some (female or male)) (accuracy 100%, length 7, depth 1)
8: male and (hasChild some (hasChild only Thing)) (accuracy 100%, length 7, depth 2)
9: (male or male) and (hasChild some Thing) (accuracy 100%, length 7, depth 1)
10: hasChild some ((not (male)) or (hasChild some Thing)) (accuracy 100%, length 8, depth 2)
11: hasChild some ((not (male)) or (hasChild some female)) (accuracy 100%, length 8, depth 2)
12: hasChild some (female or (hasChild some (hasChild some male))) (accuracy 100%, length 9, depth 3)
13: hasChild some ((not (male)) or (hasChild some (not (male)))) (accuracy 100%, length 9, depth 2)
14: hasChild some ((not (male)) or (hasChild some (hasChild some Thing))) (accuracy 100%, length 10, depth 3)
15: male and (female or (hasChild some Thing)) (accuracy 100%, length 7, depth 1)
16: male and (hasChild some (female or (hasChild some Thing))) (accuracy 100%, length 9, depth 2)
17: hasChild some (female or (male and (hasChild some Thing))) (accuracy 100%, length 9, depth 2)
18: hasChild some (female or (hasChild some (female or female))) (accuracy 100%, length 9, depth 2)
19: hasChild some (female or (hasChild some (female or male))) (accuracy 100%, length 9, depth 2)
20: hasChild some (female or (hasChild some (hasChild only Thing))) (accuracy 100%, length 9, depth 3)
Algorithm stopped (27901 descriptions tested).

Initializing component 'ks' of type KB File ...
... initialized component 'ks' in 85ms. Status: OK
Initializing component 'reasoner' of type closed world reasoner ...
Loaded reasoner: Pellet (com.clarkparsia.pellet.owlapiv3.PelletReasoner)
Materializing TBox...
...TBox materialised in 2 ms.
... initialized component 'reasoner' in 81ms. Status: OK
Initializing component 'op' of type rho refinement operator ...
... initialized component 'op' in 5ms. Status: OK
Initializing component 'lp' of type PosNegLPStandard ...
... initialized component 'lp' in 0ms. Status: OK
Initializing component 'h' of type multiple criteria heuristic ...
... initialized component 'h' in 0ms. Status: OK
Initializing component 'alg' of type OWL Class Expression Learner ...
... initialized component 'alg' in 1ms. Status: OK
starting top down refinement with: Thing (42.857% accuracy)
more accurate (85.71%) class expression found: male
more accurate (100.00%) class expression found: male and (hasChild some Thing)
Maximum time (15 seconds) reached, stopping now...
solutions (at most 20 are shown):
1: male and (hasChild some Thing) (accuracy 100%, length 5, depth 1)
2: (not (female)) and (hasChild some Thing) (accuracy 100%, length 6, depth 1)
3: hasChild some (female or (hasChild some Thing)) (accuracy 100%, length 7, depth 2)
4: hasChild some (female or (hasChild some female)) (accuracy 100%, length 7, depth 2)
5: hasChild some (female or (hasChild some (not (male)))) (accuracy 100%, length 8, depth 2)
6: hasChild some (female or (hasChild some (hasChild some Thing))) (accuracy 100%, length 9, depth 3)
7: male and (hasChild some (female or male)) (accuracy 100%, length 7, depth 1)
8: male and (hasChild some (hasChild only Thing)) (accuracy 100%, length 7, depth 2)
9: (male or male) and (hasChild some Thing) (accuracy 100%, length 7, depth 1)
10: hasChild some ((not (male)) or (hasChild some Thing)) (accuracy 100%, length 8, depth 2)
11: hasChild some ((not (male)) or (hasChild some female)) (accuracy 100%, length 8, depth 2)
12: hasChild some (female or (hasChild some (hasChild some male))) (accuracy 100%, length 9, depth 3)
13: hasChild some ((not (male)) or (hasChild some (not (male)))) (accuracy 100%, length 9, depth 2)
14: hasChild some ((not (male)) or (hasChild some (hasChild some Thing))) (accuracy 100%, length 10, depth 3)
15: male and (female or (hasChild some Thing)) (accuracy 100%, length 7, depth 1)
16: male and (hasChild some (female or (hasChild some Thing))) (accuracy 100%, length 9, depth 2)
17: hasChild some (female or (male and (hasChild some Thing))) (accuracy 100%, length 9, depth 2)
18: hasChild some (female or (hasChild some (female or female))) (accuracy 100%, length 9, depth 2)
19: hasChild some (female or (hasChild some (female or male))) (accuracy 100%, length 9, depth 2)
20: hasChild some (female or (hasChild some (hasChild only Thing))) (accuracy 100%, length 9, depth 3)
Algorithm stopped (29347 descriptions tested).

Tests run: 2, Failures: 0, Errors: 0, Skipped: 0, Time elapsed: 37.823 sec - in org.dllearner.cli.FatherCLITest
Running org.dllearner.configuration.spring.ConfigurationBasedPropertyOverrideConfigurerTest
Initializing component 'fourthBean' of type TestBean Component ...
... initialized component 'fourthBean' in 0ms. Status: OK
Initializing component 'thirdBean' of type TestBean Component ...
... initialized component 'thirdBean' in 0ms. Status: OK
Initializing component 'secondBean' of type TestBean Component ...
... initialized component 'secondBean' in 0ms. Status: OK
Initializing component 'testBean' of type TestBean Component ...
... initialized component 'testBean' in 0ms. Status: OK
Initializing component 'fifthBean' of type TestBean Component ...
... initialized component 'fifthBean' in 0ms. Status: OK
Tests run: 1, Failures: 0, Errors: 0, Skipped: 0, Time elapsed: 0.148 sec - in org.dllearner.configuration.spring.ConfigurationBasedPropertyOverrideConfigurerTest
Running org.dllearner.confparser3.ParseTest
ks.type = KB File
ks.fileName = father.kb
reasoner.type = cwr
reasoner.reasonerComponent = embeddedReasoner    (bean reference)
embeddedReasoner.type = OWL API Reasoner
embeddedReasoner.sources = [ks]
lp.type = posNegStandard
lp.positiveExamples = [http://localhost/foo#markus, http://localhost/foo#stefan, http://localhost/foo#bernd]
lp.negativeExamples = [http://localhost/foo#gabi, http://localhost/foo#anna, http://localhost/foo#michelle, http://localhost/foo#heinz]
lp.reasoner = reasoner    (bean reference)
op.type = rho
op.useCardinalityRestrictions = true
op.reasoner = reasoner    (bean reference)
h.type = multiheuristic
h.expansionPenaltyFactor = 0.2
alg.type = ocel
alg.reasoner = reasoner    (bean reference)
alg.operator = op    (bean reference)
alg.heuristic = h    (bean reference)
alg.maxExecutionTimeInSeconds = 15
Tests run: 1, Failures: 0, Errors: 0, Skipped: 0, Time elapsed: 0.008 sec - in org.dllearner.confparser3.ParseTest
Running org.dllearner.test.junit.LearningProblemTest
Initializing component 'acc' of type Predictive Accuracy without Weak elimination ...
... initialized component 'acc' in 0ms. Status: OK
Initializing component 'ks' of type OWL File ...
... initialized component 'ks' in 1ms. Status: OK
Initializing component 'reasoner' of type closed world reasoner ...
Loaded reasoner: Pellet (com.clarkparsia.pellet.owlapiv3.PelletReasoner)
Materializing TBox...
Property cytogen_ca has more than one value [false, true] for individual d135. We ignore the value.
Property cytogen_ca has value [false, true]. Cannot determine whether it is false.
...TBox materialised in 15111 ms.
... initialized component 'reasoner' in 23s 621ms. Status: OK
Initializing component 'op' of type rho refinement operator ...
... initialized component 'op' in 142ms. Status: OK
Initializing component 'lp' of type PosNegLPStandard ...
... initialized component 'lp' in 1ms. Status: OK
Initializing component 'alg' of type OWL Class Expression Learner ...
... initialized component 'alg' in 5ms. Status: OK
concept: Compound and ((hasStructure some Ar_halide) or (amesTestPositive some {true})) and (hasAtom only (not (Nitrogen-35))) {12}
Tests run: 1, Failures: 0, Errors: 0, Skipped: 0, Time elapsed: 24.069 sec - in org.dllearner.test.junit.LearningProblemTest

Results :

Tests run: 5, Failures: 0, Errors: 0, Skipped: 0

[JENKINS] Recording test results
[INFO] 
[INFO] --- maven-jar-plugin:3.0.2:jar (default-jar) @ interfaces ---
[INFO] Building jar: /usr/share/tomcat6/.jenkins/jobs/DL-Learner Merge-M/branches/leap-alternative/workspace/interfaces/target/dl-learner.jar
[INFO] 
[INFO] --- maven-install-plugin:2.4:install (default-install) @ interfaces ---
[INFO] Installing /usr/share/tomcat6/.jenkins/jobs/DL-Learner Merge-M/branches/leap-alternative/workspace/interfaces/target/dl-learner.jar to /usr/share/tomcat6/.m2/repository/org/dllearner/interfaces/1.3.1-SNAPSHOT/interfaces-1.3.1-SNAPSHOT.jar
[INFO] Installing /usr/share/tomcat6/.jenkins/jobs/DL-Learner Merge-M/branches/leap-alternative/workspace/interfaces/pom.xml to /usr/share/tomcat6/.m2/repository/org/dllearner/interfaces/1.3.1-SNAPSHOT/interfaces-1.3.1-SNAPSHOT.pom
[INFO]                                                                         
[INFO] ------------------------------------------------------------------------
[INFO] Building interfaces-ext 1.3.1-SNAPSHOT
[INFO] ------------------------------------------------------------------------
[INFO] 
[INFO] --- maven-clean-plugin:2.5:clean (default-clean) @ interfaces-ext ---
[INFO] 
[INFO] --- xmlbeans-maven-plugin:2.3.3:xmlbeans (default) @ interfaces-ext ---
[INFO] 
[INFO] --- javacc-maven-plugin:2.6:javacc (javacc) @ interfaces-ext ---
[INFO] Skipping non-existing source directory: /usr/share/tomcat6/.jenkins/jobs/DL-Learner Merge-M/branches/leap-alternative/workspace/interfaces-ext/src/main/javacc
[INFO] 
[INFO] --- maven-resources-plugin:3.0.1:resources (default-resources) @ interfaces-ext ---
[INFO] Using 'UTF-8' encoding to copy filtered resources.
[INFO] Copying 5 resources
[INFO] Copying 391 resources
[INFO] 
[INFO] --- maven-compiler-plugin:3.5.1:compile (default-compile) @ interfaces-ext ---
[INFO] Changes detected - recompiling the module!
[INFO] Compiling 73 source files to /usr/share/tomcat6/.jenkins/jobs/DL-Learner Merge-M/branches/leap-alternative/workspace/interfaces-ext/target/classes
[INFO] /usr/share/tomcat6/.jenkins/jobs/DL-Learner Merge-M/branches/leap-alternative/workspace/interfaces-ext/target/generated-sources/xmlbeans/org/springframework/schema/beans/impl/ListOrSetTypeImpl.java: Some input files use unchecked or unsafe operations.
[INFO] /usr/share/tomcat6/.jenkins/jobs/DL-Learner Merge-M/branches/leap-alternative/workspace/interfaces-ext/target/generated-sources/xmlbeans/org/springframework/schema/beans/impl/ListOrSetTypeImpl.java: Recompile with -Xlint:unchecked for details.
[INFO] 
[INFO] --- maven-resources-plugin:3.0.1:testResources (default-testResources) @ interfaces-ext ---
[INFO] Using 'UTF-8' encoding to copy filtered resources.
[INFO] skip non existing resourceDirectory /usr/share/tomcat6/.jenkins/jobs/DL-Learner Merge-M/branches/leap-alternative/workspace/interfaces-ext/src/test/resources
[INFO] 
[INFO] --- maven-compiler-plugin:3.5.1:testCompile (default-testCompile) @ interfaces-ext ---
[INFO] Changes detected - recompiling the module!
[INFO] Compiling 3 source files to /usr/share/tomcat6/.jenkins/jobs/DL-Learner Merge-M/branches/leap-alternative/workspace/interfaces-ext/target/test-classes
[INFO] 
[INFO] --- maven-surefire-plugin:2.18.1:test (default-test) @ interfaces-ext ---
[INFO] Surefire report directory: /usr/share/tomcat6/.jenkins/jobs/DL-Learner Merge-M/branches/leap-alternative/workspace/interfaces-ext/target/surefire-reports

-------------------------------------------------------
 T E S T S
-------------------------------------------------------
Running org.dllearner.unife.cli.OntologyValidationTest
run
Number of sources: 1
creating ontology through merging of the sources
Merging the ontologies...
Ontologies merged. Complete ontology created
Preparing Probability Map...
Probability Map computed. Size: 30
Tests run: 1, Failures: 0, Errors: 0, Skipped: 0, Time elapsed: 17.067 sec - in org.dllearner.unife.cli.OntologyValidationTest
Running org.dllearner.unife.cli.CLILEAPTest
main
DL-Learner command line interface
Initializing component 'measure' of type Generalised FMeasure ...
... initialized component 'measure' in 0ms. Status: OK
Initializing component 'ks1' of type OWL File ...
... initialized component 'ks1' in 2ms. Status: OK
Initializing component 'reasoner' of type closed world reasoner ...
Loaded reasoner: Pellet (com.clarkparsia.pellet.owlapiv3.PelletReasoner)
Materializing TBox...
Property cytogen_ca has more than one value [false, true] for individual d135. We ignore the value.
Property cytogen_ca has value [false, true]. Cannot determine whether it is false.
...TBox materialised in 16624 ms.
... initialized component 'reasoner' in 23s 502ms. Status: OK
Initializing component 'learningproblem' of type PosNegLPStandard ...
... initialized component 'learningproblem' in 10ms. Status: OK
Initializing component 'algorithm' of type CELOE ...
... initialized component 'algorithm' in 201ms. Status: OK
Initializing component 'learningparameter' of type EDGE ...
... initialized component 'learningparameter' in 0ms. Status: OK
Initializing component 'structurelearner' of type LEAP ...
... initialized component 'structurelearner' in 108ms. Status: OK
CLI LEAP
CLI LEAP
Running algorithm instance "structurelearner" (LEAP)
start class:Thing
more accurate (54.36%) class expression found after 57ms: Thing
more accurate (55.70%) class expression found after 10s126ms: hasAtom some Carbon
Algorithm terminated successfully (time: 20s 1ms, 714 descriptions tested, 582 nodes in the search tree).

number of retrievals: 3550
retrieval reasoning time: 12s 511ms ( 3ms per retrieval)
number of instance checks: 152 (0 multiple)
instance check reasoning time: 0ms ( 0ms per instance check)
overall reasoning time: 12s 512ms

solutions:
1: hasAtom some Carbon (pred. acc.: 55.70%, F-measure: 71.05%)
2: Thing (pred. acc.: 54.36%, F-measure: 70.43%)
3: Compound (pred. acc.: 54.36%, F-measure: 70.43%)
4: not (Bond-1) (pred. acc.: 54.36%, F-measure: 70.43%)
5: not (Barium-115) (pred. acc.: 54.36%, F-measure: 70.43%)
6: not (Arsenic-101) (pred. acc.: 54.36%, F-measure: 70.43%)
7: not (Ar_halide) (pred. acc.: 54.36%, F-measure: 70.43%)
8: not (Amino) (pred. acc.: 54.36%, F-measure: 70.43%)
9: not (Amine) (pred. acc.: 54.36%, F-measure: 70.43%)
10: not (Alkyl_halide) (pred. acc.: 54.36%, F-measure: 70.43%)

Start greedy search
Creation of the learned ontology...
Successful creation of the learned ontology
Ontology created in 54.0 (ms)
Type of axiom to learn: subClassOf axioms
number of axiom chunks: 10
Adding axiom: hasAtom some Carbon SubClassOf learnedClass
Running parameter learner
# examples: 81
# positive examples: 81
# examples: 149
# negative examples: 68
Initializing...
Preparing Probability map...
Preparing Probability Map...
Random Seed set to: 0
Created 74407 probabilistic axiom
Probability Map computed. Size: 74407
Tests run: 1, Failures: 0, Errors: 1, Skipped: 0, Time elapsed: 49.137 sec <<< FAILURE! - in org.dllearner.unife.cli.CLILEAPTest
testMain2(org.dllearner.unife.cli.CLILEAPTest)  Time elapsed: 49.133 sec  <<< ERROR!
java.lang.InternalError: Error: BDDFactory already initialized.
	at net.sf.javabdd.BuDDyFactory.initialize(BuDDyFactory.java:190)
	at net.sf.javabdd.BuDDyFactory.init(BuDDyFactory.java:47)
	at net.sf.javabdd.BDDFactory.init(BDDFactory.java:72)
	at unife.bundle.bdd.BDDFactory2.init(BDDFactory2.java:106)
	at unife.edge.EDGE.init(EDGE.java:888)
	at org.dllearner.unife.algorithms.probabilistic.parameter.edge.EDGE.start(EDGE.java:95)
	at org.dllearner.unife.algorithms.probabilistic.structure.leap.LEAP.greedySearch(LEAP.java:204)
	at org.dllearner.unife.algorithms.probabilistic.structure.leap.LEAP.start(LEAP.java:99)
	at org.dllearner.unife.cli.CLILEAP.run(CLILEAP.java:70)
	at org.dllearner.cli.CLI.main(CLI.java:227)
	at org.dllearner.unife.cli.CLILEAP.main(CLILEAP.java:78)
	at org.dllearner.unife.cli.CLILEAPTest.testMain2(CLILEAPTest.java:64)


Results :

Tests in error: 
  CLILEAPTest.testMain2:64 » Internal Error: BDDFactory already initialized.

Tests run: 2, Failures: 0, Errors: 1, Skipped: 0

[ERROR] There are test failures.

Please refer to /usr/share/tomcat6/.jenkins/jobs/DL-Learner Merge-M/branches/leap-alternative/workspace/interfaces-ext/target/surefire-reports for the individual test results.
[JENKINS] Recording test results
[INFO] 
[INFO] --- maven-jar-plugin:3.0.2:jar (default-jar) @ interfaces-ext ---
[INFO] Building jar: /usr/share/tomcat6/.jenkins/jobs/DL-Learner Merge-M/branches/leap-alternative/workspace/interfaces-ext/target/dl-learner.jar
[INFO] 
[INFO] --- maven-install-plugin:2.4:install (default-install) @ interfaces-ext ---
[INFO] Installing /usr/share/tomcat6/.jenkins/jobs/DL-Learner Merge-M/branches/leap-alternative/workspace/interfaces-ext/target/dl-learner.jar to /usr/share/tomcat6/.m2/repository/org/dllearner/interfaces-ext/1.3.1-SNAPSHOT/interfaces-ext-1.3.1-SNAPSHOT.jar
[INFO] Installing /usr/share/tomcat6/.jenkins/jobs/DL-Learner Merge-M/branches/leap-alternative/workspace/interfaces-ext/pom.xml to /usr/share/tomcat6/.m2/repository/org/dllearner/interfaces-ext/1.3.1-SNAPSHOT/interfaces-ext-1.3.1-SNAPSHOT.pom
[INFO]                                                                         
[INFO] ------------------------------------------------------------------------
[INFO] Building Executable scripts 1.3.1-SNAPSHOT
[INFO] ------------------------------------------------------------------------
[WARNING] The POM for org.codehaus.woodstox:wstx-asl:jar:3.2.9 is invalid, transitive dependencies (if any) will not be available, enable debug logging for more details
[INFO] 
[INFO] --- maven-clean-plugin:2.5:clean (default-clean) @ scripts ---
[INFO] 
[INFO] --- maven-resources-plugin:3.0.1:resources (default-resources) @ scripts ---
[INFO] Using 'UTF-8' encoding to copy filtered resources.
[INFO] skip non existing resourceDirectory /usr/share/tomcat6/.jenkins/jobs/DL-Learner Merge-M/branches/leap-alternative/workspace/scripts/src/main/resources
[INFO] 
[INFO] --- maven-compiler-plugin:3.5.1:compile (default-compile) @ scripts ---
[INFO] Changes detected - recompiling the module!
[INFO] Compiling 25 source files to /usr/share/tomcat6/.jenkins/jobs/DL-Learner Merge-M/branches/leap-alternative/workspace/scripts/target/classes
[ERROR] error reading /usr/share/tomcat6/.m2/repository/org/codehaus/woodstox/wstx-asl/3.2.9/wstx-asl-3.2.9.jar; error in opening zip file
[ERROR] error reading /usr/share/tomcat6/.m2/repository/org/codehaus/woodstox/wstx-asl/3.2.9/wstx-asl-3.2.9.jar; error in opening zip file
[INFO] /usr/share/tomcat6/.jenkins/jobs/DL-Learner Merge-M/branches/leap-alternative/workspace/scripts/src/main/java/org/dllearner/experiments/MyMonKey.java: /usr/share/tomcat6/.jenkins/jobs/DL-Learner Merge-M/branches/leap-alternative/workspace/scripts/src/main/java/org/dllearner/experiments/MyMonKey.java uses unchecked or unsafe operations.
[INFO] /usr/share/tomcat6/.jenkins/jobs/DL-Learner Merge-M/branches/leap-alternative/workspace/scripts/src/main/java/org/dllearner/experiments/MyMonKey.java: Recompile with -Xlint:unchecked for details.
[INFO] 
[INFO] --- maven-resources-plugin:3.0.1:testResources (default-testResources) @ scripts ---
[INFO] Using 'UTF-8' encoding to copy filtered resources.
[INFO] skip non existing resourceDirectory /usr/share/tomcat6/.jenkins/jobs/DL-Learner Merge-M/branches/leap-alternative/workspace/scripts/src/test/resources
[INFO] 
[INFO] --- maven-compiler-plugin:3.5.1:testCompile (default-testCompile) @ scripts ---
[INFO] No sources to compile
[INFO] 
[INFO] --- maven-surefire-plugin:2.19.1:test (default-test) @ scripts ---
[INFO] No tests to run.
[JENKINS] Recording test results
[INFO] 
[INFO] --- maven-jar-plugin:3.0.2:jar (default-jar) @ scripts ---
[INFO] Building jar: /usr/share/tomcat6/.jenkins/jobs/DL-Learner Merge-M/branches/leap-alternative/workspace/scripts/target/scripts-1.3.1-SNAPSHOT.jar
[INFO] 
[INFO] --- maven-install-plugin:2.4:install (default-install) @ scripts ---
[INFO] Installing /usr/share/tomcat6/.jenkins/jobs/DL-Learner Merge-M/branches/leap-alternative/workspace/scripts/target/scripts-1.3.1-SNAPSHOT.jar to /usr/share/tomcat6/.m2/repository/org/dllearner/scripts/1.3.1-SNAPSHOT/scripts-1.3.1-SNAPSHOT.jar
[INFO] Installing /usr/share/tomcat6/.jenkins/jobs/DL-Learner Merge-M/branches/leap-alternative/workspace/scripts/pom.xml to /usr/share/tomcat6/.m2/repository/org/dllearner/scripts/1.3.1-SNAPSHOT/scripts-1.3.1-SNAPSHOT.pom
[INFO] ------------------------------------------------------------------------
[INFO] Reactor Summary:
[INFO] 
[INFO] DL Learner Parent Pom ............................. SUCCESS [  0.824 s]
[INFO] DL Learner Core Components ........................ SUCCESS [03:33 min]
[INFO] components-ext .................................... SUCCESS [01:07 min]
[INFO] dllearner-interfaces .............................. SUCCESS [01:14 min]
[INFO] interfaces-ext .................................... SUCCESS [01:17 min]
[INFO] Executable scripts ................................ SUCCESS [  2.665 s]
[INFO] ------------------------------------------------------------------------
[INFO] BUILD SUCCESS
[INFO] ------------------------------------------------------------------------
[INFO] Total time: 07:19 min
[INFO] Finished at: 2017-01-31T14:22:12+01:00
[INFO] Final Memory: 73M/168M
[JENKINS] Archiving /usr/share/tomcat6/.jenkins/jobs/DL-Learner Merge-M/branches/leap-alternative/workspace/interfaces/pom.xml to org.dllearner/interfaces/1.3.1-SNAPSHOT/interfaces-1.3.1-SNAPSHOT.pom
[INFO] ------------------------------------------------------------------------
[JENKINS] Archiving /usr/share/tomcat6/.jenkins/jobs/DL-Learner Merge-M/branches/leap-alternative/workspace/interfaces/target/dl-learner.jar to org.dllearner/interfaces/1.3.1-SNAPSHOT/interfaces-1.3.1-SNAPSHOT.jar
[JENKINS] Archiving /usr/share/tomcat6/.jenkins/jobs/DL-Learner Merge-M/branches/leap-alternative/workspace/components-ext/pom.xml to org.dllearner/components-ext/1.3.1-SNAPSHOT/components-ext-1.3.1-SNAPSHOT.pom
[JENKINS] Archiving /usr/share/tomcat6/.jenkins/jobs/DL-Learner Merge-M/branches/leap-alternative/workspace/components-ext/target/components-ext-1.3.1-SNAPSHOT.jar to org.dllearner/components-ext/1.3.1-SNAPSHOT/components-ext-1.3.1-SNAPSHOT.jar
[JENKINS] Archiving /usr/share/tomcat6/.jenkins/jobs/DL-Learner Merge-M/branches/leap-alternative/workspace/scripts/pom.xml to org.dllearner/scripts/1.3.1-SNAPSHOT/scripts-1.3.1-SNAPSHOT.pom
[JENKINS] Archiving /usr/share/tomcat6/.jenkins/jobs/DL-Learner Merge-M/branches/leap-alternative/workspace/scripts/target/scripts-1.3.1-SNAPSHOT.jar to org.dllearner/scripts/1.3.1-SNAPSHOT/scripts-1.3.1-SNAPSHOT.jar
[JENKINS] Archiving /usr/share/tomcat6/.jenkins/jobs/DL-Learner Merge-M/branches/leap-alternative/workspace/pom.xml to org.dllearner/dllearner-parent/1.3.1-SNAPSHOT/dllearner-parent-1.3.1-SNAPSHOT.pom
[JENKINS] Archiving /usr/share/tomcat6/.jenkins/jobs/DL-Learner Merge-M/branches/leap-alternative/workspace/interfaces-ext/pom.xml to org.dllearner/interfaces-ext/1.3.1-SNAPSHOT/interfaces-ext-1.3.1-SNAPSHOT.pom
[JENKINS] Archiving /usr/share/tomcat6/.jenkins/jobs/DL-Learner Merge-M/branches/leap-alternative/workspace/interfaces-ext/target/dl-learner.jar to org.dllearner/interfaces-ext/1.3.1-SNAPSHOT/interfaces-ext-1.3.1-SNAPSHOT.jar
[JENKINS] Archiving /usr/share/tomcat6/.jenkins/jobs/DL-Learner Merge-M/branches/leap-alternative/workspace/components-core/pom.xml to org.dllearner/components-core/1.3.1-SNAPSHOT/components-core-1.3.1-SNAPSHOT.pom
[JENKINS] Archiving /usr/share/tomcat6/.jenkins/jobs/DL-Learner Merge-M/branches/leap-alternative/workspace/components-core/target/components-core-1.3.1-SNAPSHOT.jar to org.dllearner/components-core/1.3.1-SNAPSHOT/components-core-1.3.1-SNAPSHOT.jar
[JENKINS] Archiving /usr/share/tomcat6/.jenkins/jobs/DL-Learner Merge-M/branches/leap-alternative/workspace/components-core/target/components-core-1.3.1-SNAPSHOT-tests.jar to org.dllearner/components-core/1.3.1-SNAPSHOT/components-core-1.3.1-SNAPSHOT-tests.jar
channel stopped
[File exists] check if file exists [.git/MERGE_MODE]
Run condition [Not] enabling perform for step [[Set GitHub commit status (universal)]]
[Set GitHub commit status (universal)] FAILURE on repos [GHRepository@42e72cef[description=A tool for supervised Machine Learning in OWL and Description Logics,homepage=http://dl-learner.org,name=DL-Learner,license=<null>,fork=false,size=253481,milestones={},language=Web Ontology Language,commits={},source=<null>,parent=<null>,url=https://api.github.com/repos/AKSW/DL-Learner,id=22693515]] (sha:ebaf6a7) with context:jenkins-merge
Setting commit status on GitHub for https://github.com/AKSW/DL-Learner/commit/ebaf6a77310312523acf92d1a5407f19995a7353
Finished: UNSTABLE