FailedConsole Output

Push event to branch spotbugs-fixes
Running as SYSTEM
Building on master in workspace /usr/share/tomcat8/.jenkins/jobs/DL-Learner Merge-M/branches/spotbugs-fixes/workspace
using credential github-api
Cloning the remote Git repository
Cloning with configured refspecs honoured and without tags
Cloning repository https://github.com/SmartDataAnalytics/DL-Learner.git
 > git init /usr/share/tomcat8/.jenkins/jobs/DL-Learner Merge-M/branches/spotbugs-fixes/workspace # timeout=10
Fetching upstream changes from https://github.com/SmartDataAnalytics/DL-Learner.git
 > git --version # timeout=10
using GIT_ASKPASS to set credentials 
 > git fetch --no-tags --progress https://github.com/SmartDataAnalytics/DL-Learner.git +refs/heads/spotbugs-fixes:refs/remotes/origin/spotbugs-fixes # timeout=10
 > git config remote.origin.url https://github.com/SmartDataAnalytics/DL-Learner.git # timeout=10
 > git config --add remote.origin.fetch +refs/heads/spotbugs-fixes:refs/remotes/origin/spotbugs-fixes # timeout=10
 > git config remote.origin.url https://github.com/SmartDataAnalytics/DL-Learner.git # timeout=10
Fetching without tags
Fetching upstream changes from https://github.com/SmartDataAnalytics/DL-Learner.git
using GIT_ASKPASS to set credentials 
 > git fetch --no-tags --progress https://github.com/SmartDataAnalytics/DL-Learner.git +refs/heads/spotbugs-fixes:refs/remotes/origin/spotbugs-fixes # timeout=10
 > git rev-parse origin/spotbugs-fixes^{commit} # timeout=10
Checking out Revision 3e001de7746f4f3d280757be1ebc0aea04d6156a (origin/spotbugs-fixes)
 > git config core.sparsecheckout # timeout=10
 > git checkout -f 3e001de7746f4f3d280757be1ebc0aea04d6156a # timeout=10
Commit message: "Spotbugs fixes round 1"
First time build. Skipping changelog.
Run condition [Not] preventing prebuild for step [[Set GitHub commit status (universal)]]
[workspace] $ /bin/sh -xe /tmp/tomcat8-tomcat8-tmp/jenkins8932500906015775906.sh
+ MASTER=develop
+ remote=origin
+ git name-rev --name-only --always HEAD
+ current_branch=remotes/origin/spotbugs-fixes
+ merge_branch=jenkins/integration/remotes/origin/spotbugs-fixes
+ git branch -D jenkins/integration/remotes/origin/spotbugs-fixes
error: branch 'jenkins/integration/remotes/origin/spotbugs-fixes' not found.
+ true
+ git fetch -q origin +refs/heads/develop:origin/develop
+ git checkout origin/develop
Previous HEAD position was 3e001de... Spotbugs fixes round 1
Switched to branch 'origin/develop'
+ git checkout -b jenkins/integration/remotes/origin/spotbugs-fixes
Switched to a new branch 'jenkins/integration/remotes/origin/spotbugs-fixes'
+ git clean -fdx
+ git merge --ff --no-edit --log --stat remotes/origin/spotbugs-fixes
Updating 42e7d00..3e001de
Fast-forward
 .../org/dllearner/algorithms/celoe/PCELOE.java     | 2061 ++++++++++----------
 .../DLTreesRefinementOperator.java                 |   12 +-
 .../decisiontrees/tdt/AbstractTDTClassifier.java   |   15 -
 .../dllearner/algorithms/ocel/MultiHeuristic.java  |   14 +-
 .../pattern/IndividualBasedFragmentExtractor.java  |   27 +-
 .../dllearner/algorithms/qtl/QueryTreeUtils.java   |    2 +-
 .../dllearner/core/AbstractReasonerComponent.java  |    6 +-
 .../src/main/java/org/dllearner/core/owl/NNF.java  |    2 +-
 .../core/owl/fuzzydll/FuzzyIndividual.java         |   14 +-
 .../kb/dataset/AbstractOWLOntologyDataset.java     |   30 +-
 .../kb/repository/tones/TONESRepository.java       |   25 +-
 .../kb/sparql/AbstractSampleGenerator.java         |    3 +-
 .../sparql/ConciseBoundedDescriptionGenerator.java |    2 +-
 ...reeBasedConciseBoundedDescriptionGenerator.java |   12 +-
 .../datastructures/DescriptionSubsumptionTree.java |    7 +-
 .../utilities/datastructures/RDFNodeTuple.java     |   16 +-
 16 files changed, 1130 insertions(+), 1118 deletions(-)
[Set GitHub commit status (universal)] PENDING on repos [GHRepository@823b8c8[nodeId=MDEwOlJlcG9zaXRvcnkyMjY5MzUxNQ==,description=A tool for supervised Machine Learning in OWL and Description Logics,homepage=http://dl-learner.org,name=DL-Learner,fork=false,archived=false,size=255560,milestones={},language=Java,commits={},source=<null>,parent=<null>,url=https://api.github.com/repos/SmartDataAnalytics/DL-Learner,id=22693515,nodeId=<null>,createdAt=2014-08-06T18:29:54Z,updatedAt=2020-10-15T08:32:07Z]] (sha:3e001de) with context:jenkins-merge
Setting commit status on GitHub for https://github.com/SmartDataAnalytics/DL-Learner/commit/3e001de7746f4f3d280757be1ebc0aea04d6156a
Parsing POMs
using global settings config with name MyGlobalSettings
Replacing all maven server entries not found in credentials list is true
Discovered a new module org.dllearner:dllearner-parent DL Learner Parent Pom
Discovered a new module org.dllearner:components-core DL Learner Core Components
Discovered a new module org.dllearner:components-ext components-ext
Discovered a new module org.dllearner:interfaces dllearner-interfaces
Discovered a new module org.dllearner:interfaces-ext interfaces-ext
Discovered a new module org.dllearner:scripts Executable scripts
Modules changed, recalculating dependency graph
Established TCP socket on 37635
[workspace] $ /usr/lib/jvm/java-8-openjdk-amd64//bin/java -Xmx2048m -Xss512m -cp /usr/share/tomcat8/.jenkins/plugins/maven-plugin/WEB-INF/lib/maven35-agent-1.13.jar:/usr/share/maven3/boot/plexus-classworlds-2.5.2.jar:/usr/share/maven3/conf/logging jenkins.maven3.agent.Maven35Main /usr/share/maven3 /var/lib/tomcat8/webapps/jenkins/WEB-INF/lib/remoting-4.3.jar /usr/share/tomcat8/.jenkins/plugins/maven-plugin/WEB-INF/lib/maven35-interceptor-1.13.jar /usr/share/tomcat8/.jenkins/plugins/maven-plugin/WEB-INF/lib/maven3-interceptor-commons-1.13.jar 37635
<===[JENKINS REMOTING CAPACITY]===>channel started
using global settings config with name MyGlobalSettings
Replacing all maven server entries not found in credentials list is true
Executing Maven:  -B -f /usr/share/tomcat8/.jenkins/jobs/DL-Learner Merge-M/branches/spotbugs-fixes/workspace/pom.xml -gs /tmp/tomcat8-tomcat8-tmp/global-settings8562711079128291516.xml -U -B -e clean install
[INFO] Error stacktraces are turned on.
[INFO] Scanning for projects...
[WARNING] The project org.dllearner:dllearner-parent:pom:1.4.1-SNAPSHOT uses prerequisites which is only intended for maven-plugin projects but not for non maven-plugin projects. For such purposes you should use the maven-enforcer-plugin. See https://maven.apache.org/enforcer/enforcer-rules/requireMavenVersion.html
[INFO] ------------------------------------------------------------------------
[INFO] Reactor Build Order:
[INFO] 
[INFO] DL Learner Parent Pom                                              [pom]
[INFO] DL Learner Core Components                                         [jar]
[INFO] components-ext                                                     [jar]
[INFO] dllearner-interfaces                                               [jar]
[INFO] interfaces-ext                                                     [jar]
[INFO] Executable scripts                                                 [jar]
[INFO] 
[INFO] -------------------< org.dllearner:dllearner-parent >-------------------
[INFO] Building DL Learner Parent Pom 1.4.1-SNAPSHOT                      [1/6]
[INFO] --------------------------------[ pom ]---------------------------------
[INFO] 
[INFO] --- maven-clean-plugin:2.5:clean (default-clean) @ dllearner-parent ---
[INFO] 
[INFO] --- maven-install-plugin:2.4:install (default-install) @ dllearner-parent ---
[INFO] Installing /usr/share/tomcat8/.jenkins/jobs/DL-Learner Merge-M/branches/spotbugs-fixes/workspace/pom.xml to /usr/share/tomcat8/.m2/repository/org/dllearner/dllearner-parent/1.4.1-SNAPSHOT/dllearner-parent-1.4.1-SNAPSHOT.pom
[INFO] 
[INFO] -------------------< org.dllearner:components-core >--------------------
[INFO] Building DL Learner Core Components 1.4.1-SNAPSHOT                 [2/6]
[INFO] --------------------------------[ jar ]---------------------------------
[INFO] 
[INFO] --- maven-clean-plugin:2.5:clean (default-clean) @ components-core ---
[INFO] 
[INFO] --- jacoco-maven-plugin:0.8.4:prepare-agent (default) @ components-core ---
[INFO] argLine set to "-javaagent:/usr/share/tomcat8/.m2/repository/org/jacoco/org.jacoco.agent/0.8.4/org.jacoco.agent-0.8.4-runtime.jar=destfile=/usr/share/tomcat8/.jenkins/jobs/DL-Learner Merge-M/branches/spotbugs-fixes/workspace/components-core/target/jacoco.exec"
[INFO] 
[INFO] --- maven-resources-plugin:3.1.0:resources (default-resources) @ components-core ---
[INFO] Using 'UTF-8' encoding to copy filtered resources.
[INFO] Copying 7 resources
[INFO] 
[INFO] --- maven-compiler-plugin:3.8.1:compile (default-compile) @ components-core ---
[INFO] Changes detected - recompiling the module!
[INFO] Compiling 572 source files to /usr/share/tomcat8/.jenkins/jobs/DL-Learner Merge-M/branches/spotbugs-fixes/workspace/components-core/target/classes
[INFO] /usr/share/tomcat8/.jenkins/jobs/DL-Learner Merge-M/branches/spotbugs-fixes/workspace/components-core/src/main/java/org/dllearner/kb/dataset/TONESDataset.java: /usr/share/tomcat8/.jenkins/jobs/DL-Learner Merge-M/branches/spotbugs-fixes/workspace/components-core/src/main/java/org/dllearner/kb/dataset/TONESDataset.java uses or overrides a deprecated API.
[INFO] /usr/share/tomcat8/.jenkins/jobs/DL-Learner Merge-M/branches/spotbugs-fixes/workspace/components-core/src/main/java/org/dllearner/kb/dataset/TONESDataset.java: Recompile with -Xlint:deprecation for details.
[INFO] /usr/share/tomcat8/.jenkins/jobs/DL-Learner Merge-M/branches/spotbugs-fixes/workspace/components-core/src/main/java/org/dllearner/algorithms/qtl/datastructures/impl/GenericTree.java: Some input files use unchecked or unsafe operations.
[INFO] /usr/share/tomcat8/.jenkins/jobs/DL-Learner Merge-M/branches/spotbugs-fixes/workspace/components-core/src/main/java/org/dllearner/algorithms/qtl/datastructures/impl/GenericTree.java: Recompile with -Xlint:unchecked for details.
[INFO] -------------------------------------------------------------
[ERROR] COMPILATION ERROR : 
[INFO] -------------------------------------------------------------
[ERROR] /usr/share/tomcat8/.jenkins/jobs/DL-Learner Merge-M/branches/spotbugs-fixes/workspace/components-core/src/main/java/org/dllearner/utilities/owl/OWL2SPARULConverter.java:[52,17] constructor AbstractTranslator in class org.semanticweb.owlapi.rdf.model.AbstractTranslator<N,R,P,L> cannot be applied to given types;
  required: org.semanticweb.owlapi.model.OWLOntologyManager,org.semanticweb.owlapi.model.OWLOntology,org.semanticweb.owlapi.model.OWLDocumentFormat,boolean,org.semanticweb.owlapi.util.IndividualAppearance,org.semanticweb.owlapi.util.AxiomAppearance,java.util.concurrent.atomic.AtomicInteger,java.util.Map<java.lang.Object,java.lang.Integer>,java.util.Set<org.semanticweb.owlapi.model.OWLAxiom>
  found: org.semanticweb.owlapi.model.OWLOntologyManager,org.semanticweb.owlapi.model.OWLOntology,boolean,org.semanticweb.owlapi.util.IndividualAppearance,org.semanticweb.owlapi.util.AxiomAppearance,java.util.concurrent.atomic.AtomicInteger,java.util.Map<java.lang.Object,java.lang.Integer>
  reason: actual and formal argument lists differ in length
[INFO] 1 error
[INFO] -------------------------------------------------------------
[INFO] ------------------------------------------------------------------------
[INFO] Reactor Summary:
[INFO] 
[INFO] DL Learner Parent Pom 1.4.1-SNAPSHOT ............... SUCCESS [  1.134 s]
[INFO] DL Learner Core Components ......................... FAILURE [ 30.660 s]
[INFO] components-ext ..................................... SKIPPED
[INFO] dllearner-interfaces ............................... SKIPPED
[INFO] interfaces-ext ..................................... SKIPPED
[INFO] Executable scripts 1.4.1-SNAPSHOT .................. SKIPPED
[INFO] ------------------------------------------------------------------------
[INFO] BUILD FAILURE
[INFO] ------------------------------------------------------------------------
[INFO] Total time: 33.709 s
[INFO] Finished at: 2020-10-15T11:45:27+02:00
[INFO] ------------------------------------------------------------------------
Waiting for Jenkins to finish collecting data
[ERROR] Failed to execute goal org.apache.maven.plugins:maven-compiler-plugin:3.8.1:compile (default-compile) on project components-core: Compilation failure
[ERROR] /usr/share/tomcat8/.jenkins/jobs/DL-Learner Merge-M/branches/spotbugs-fixes/workspace/components-core/src/main/java/org/dllearner/utilities/owl/OWL2SPARULConverter.java:[52,17] constructor AbstractTranslator in class org.semanticweb.owlapi.rdf.model.AbstractTranslator<N,R,P,L> cannot be applied to given types;
[ERROR] required: org.semanticweb.owlapi.model.OWLOntologyManager,org.semanticweb.owlapi.model.OWLOntology,org.semanticweb.owlapi.model.OWLDocumentFormat,boolean,org.semanticweb.owlapi.util.IndividualAppearance,org.semanticweb.owlapi.util.AxiomAppearance,java.util.concurrent.atomic.AtomicInteger,java.util.Map<java.lang.Object,java.lang.Integer>,java.util.Set<org.semanticweb.owlapi.model.OWLAxiom>
[ERROR] found: org.semanticweb.owlapi.model.OWLOntologyManager,org.semanticweb.owlapi.model.OWLOntology,boolean,org.semanticweb.owlapi.util.IndividualAppearance,org.semanticweb.owlapi.util.AxiomAppearance,java.util.concurrent.atomic.AtomicInteger,java.util.Map<java.lang.Object,java.lang.Integer>
[ERROR] reason: actual and formal argument lists differ in length
[ERROR] -> [Help 1]
org.apache.maven.lifecycle.LifecycleExecutionException: Failed to execute goal org.apache.maven.plugins:maven-compiler-plugin:3.8.1:compile (default-compile) on project components-core: Compilation failure
/usr/share/tomcat8/.jenkins/jobs/DL-Learner Merge-M/branches/spotbugs-fixes/workspace/components-core/src/main/java/org/dllearner/utilities/owl/OWL2SPARULConverter.java:[52,17] constructor AbstractTranslator in class org.semanticweb.owlapi.rdf.model.AbstractTranslator<N,R,P,L> cannot be applied to given types;
  required: org.semanticweb.owlapi.model.OWLOntologyManager,org.semanticweb.owlapi.model.OWLOntology,org.semanticweb.owlapi.model.OWLDocumentFormat,boolean,org.semanticweb.owlapi.util.IndividualAppearance,org.semanticweb.owlapi.util.AxiomAppearance,java.util.concurrent.atomic.AtomicInteger,java.util.Map<java.lang.Object,java.lang.Integer>,java.util.Set<org.semanticweb.owlapi.model.OWLAxiom>
  found: org.semanticweb.owlapi.model.OWLOntologyManager,org.semanticweb.owlapi.model.OWLOntology,boolean,org.semanticweb.owlapi.util.IndividualAppearance,org.semanticweb.owlapi.util.AxiomAppearance,java.util.concurrent.atomic.AtomicInteger,java.util.Map<java.lang.Object,java.lang.Integer>
  reason: actual and formal argument lists differ in length

    at org.apache.maven.lifecycle.internal.MojoExecutor.execute (MojoExecutor.java:213)
    at org.apache.maven.lifecycle.internal.MojoExecutor.execute (MojoExecutor.java:154)
    at org.apache.maven.lifecycle.internal.MojoExecutor.execute (MojoExecutor.java:146)
    at org.apache.maven.lifecycle.internal.LifecycleModuleBuilder.buildProject (LifecycleModuleBuilder.java:117)
    at org.apache.maven.lifecycle.internal.LifecycleModuleBuilder.buildProject (LifecycleModuleBuilder.java:81)
    at org.apache.maven.lifecycle.internal.builder.singlethreaded.SingleThreadedBuilder.build (SingleThreadedBuilder.java:56)
    at org.apache.maven.lifecycle.internal.LifecycleStarter.execute (LifecycleStarter.java:128)
    at org.apache.maven.DefaultMaven.doExecute (DefaultMaven.java:305)
    at org.apache.maven.DefaultMaven.doExecute (DefaultMaven.java:192)
    at org.apache.maven.DefaultMaven.execute (DefaultMaven.java:105)
    at org.jvnet.hudson.maven3.launcher.Maven35Launcher.main (Maven35Launcher.java:130)
    at sun.reflect.NativeMethodAccessorImpl.invoke0 (Native Method)
    at sun.reflect.NativeMethodAccessorImpl.invoke (NativeMethodAccessorImpl.java:62)
    at sun.reflect.DelegatingMethodAccessorImpl.invoke (DelegatingMethodAccessorImpl.java:43)
    at java.lang.reflect.Method.invoke (Method.java:498)
    at org.codehaus.plexus.classworlds.launcher.Launcher.launchEnhanced (Launcher.java:289)
    at org.codehaus.plexus.classworlds.launcher.Launcher.launch (Launcher.java:229)
    at jenkins.maven3.agent.Maven35Main.launch (Maven35Main.java:178)
    at sun.reflect.NativeMethodAccessorImpl.invoke0 (Native Method)
    at sun.reflect.NativeMethodAccessorImpl.invoke (NativeMethodAccessorImpl.java:62)
    at sun.reflect.DelegatingMethodAccessorImpl.invoke (DelegatingMethodAccessorImpl.java:43)
    at java.lang.reflect.Method.invoke (Method.java:498)
    at hudson.maven.Maven3Builder.call (Maven3Builder.java:139)
    at hudson.maven.Maven3Builder.call (Maven3Builder.java:70)
    at hudson.remoting.UserRequest.perform (UserRequest.java:211)
    at hudson.remoting.UserRequest.perform (UserRequest.java:54)
    at hudson.remoting.Request$2.run (Request.java:369)
    at hudson.remoting.InterceptingExecutorService$1.call (InterceptingExecutorService.java:72)
    at java.util.concurrent.FutureTask.run (FutureTask.java:266)
    at java.util.concurrent.ThreadPoolExecutor.runWorker (ThreadPoolExecutor.java:1149)
    at java.util.concurrent.ThreadPoolExecutor$Worker.run (ThreadPoolExecutor.java:624)
    at java.lang.Thread.run (Thread.java:748)
Caused by: org.apache.maven.plugin.compiler.CompilationFailureException: Compilation failure
/usr/share/tomcat8/.jenkins/jobs/DL-Learner Merge-M/branches/spotbugs-fixes/workspace/components-core/src/main/java/org/dllearner/utilities/owl/OWL2SPARULConverter.java:[52,17] constructor AbstractTranslator in class org.semanticweb.owlapi.rdf.model.AbstractTranslator<N,R,P,L> cannot be applied to given types;
  required: org.semanticweb.owlapi.model.OWLOntologyManager,org.semanticweb.owlapi.model.OWLOntology,org.semanticweb.owlapi.model.OWLDocumentFormat,boolean,org.semanticweb.owlapi.util.IndividualAppearance,org.semanticweb.owlapi.util.AxiomAppearance,java.util.concurrent.atomic.AtomicInteger,java.util.Map<java.lang.Object,java.lang.Integer>,java.util.Set<org.semanticweb.owlapi.model.OWLAxiom>
  found: org.semanticweb.owlapi.model.OWLOntologyManager,org.semanticweb.owlapi.model.OWLOntology,boolean,org.semanticweb.owlapi.util.IndividualAppearance,org.semanticweb.owlapi.util.AxiomAppearance,java.util.concurrent.atomic.AtomicInteger,java.util.Map<java.lang.Object,java.lang.Integer>
  reason: actual and formal argument lists differ in length

    at org.apache.maven.plugin.compiler.AbstractCompilerMojo.execute (AbstractCompilerMojo.java:1220)
    at org.apache.maven.plugin.compiler.CompilerMojo.execute (CompilerMojo.java:187)
    at org.apache.maven.plugin.DefaultBuildPluginManager.executeMojo (DefaultBuildPluginManager.java:137)
    at org.apache.maven.lifecycle.internal.MojoExecutor.execute (MojoExecutor.java:208)
    at org.apache.maven.lifecycle.internal.MojoExecutor.execute (MojoExecutor.java:154)
    at org.apache.maven.lifecycle.internal.MojoExecutor.execute (MojoExecutor.java:146)
    at org.apache.maven.lifecycle.internal.LifecycleModuleBuilder.buildProject (LifecycleModuleBuilder.java:117)
    at org.apache.maven.lifecycle.internal.LifecycleModuleBuilder.buildProject (LifecycleModuleBuilder.java:81)
    at org.apache.maven.lifecycle.internal.builder.singlethreaded.SingleThreadedBuilder.build (SingleThreadedBuilder.java:56)
    at org.apache.maven.lifecycle.internal.LifecycleStarter.execute (LifecycleStarter.java:128)
    at org.apache.maven.DefaultMaven.doExecute (DefaultMaven.java:305)
    at org.apache.maven.DefaultMaven.doExecute (DefaultMaven.java:192)
    at org.apache.maven.DefaultMaven.execute (DefaultMaven.java:105)
    at org.jvnet.hudson.maven3.launcher.Maven35Launcher.main (Maven35Launcher.java:130)
    at sun.reflect.NativeMethodAccessorImpl.invoke0 (Native Method)
    at sun.reflect.NativeMethodAccessorImpl.invoke (NativeMethodAccessorImpl.java:62)
    at sun.reflect.DelegatingMethodAccessorImpl.invoke (DelegatingMethodAccessorImpl.java:43)
    at java.lang.reflect.Method.invoke (Method.java:498)
    at org.codehaus.plexus.classworlds.launcher.Launcher.launchEnhanced (Launcher.java:289)
    at org.codehaus.plexus.classworlds.launcher.Launcher.launch (Launcher.java:229)
    at jenkins.maven3.agent.Maven35Main.launch (Maven35Main.java:178)
    at sun.reflect.NativeMethodAccessorImpl.invoke0 (Native Method)
    at sun.reflect.NativeMethodAccessorImpl.invoke (NativeMethodAccessorImpl.java:62)
    at sun.reflect.DelegatingMethodAccessorImpl.invoke (DelegatingMethodAccessorImpl.java:43)
    at java.lang.reflect.Method.invoke (Method.java:498)
    at hudson.maven.Maven3Builder.call (Maven3Builder.java:139)
    at hudson.maven.Maven3Builder.call (Maven3Builder.java:70)
    at hudson.remoting.UserRequest.perform (UserRequest.java:211)
    at hudson.remoting.UserRequest.perform (UserRequest.java:54)
    at hudson.remoting.Request$2.run (Request.java:369)
    at hudson.remoting.InterceptingExecutorService$1.call (InterceptingExecutorService.java:72)
    at java.util.concurrent.FutureTask.run (FutureTask.java:266)
    at java.util.concurrent.ThreadPoolExecutor.runWorker (ThreadPoolExecutor.java:1149)
    at java.util.concurrent.ThreadPoolExecutor$Worker.run (ThreadPoolExecutor.java:624)
    at java.lang.Thread.run (Thread.java:748)
[ERROR] 
[ERROR] Re-run Maven using the -X switch to enable full debug logging.
[ERROR] 
[ERROR] For more information about the errors and possible solutions, please read the following articles:
[ERROR] [Help 1] http://cwiki.apache.org/confluence/display/MAVEN/MojoFailureException
[ERROR] 
[ERROR] After correcting the problems, you can resume the build with the command
[ERROR]   mvn <goals> -rf :components-core
[JENKINS] Archiving /usr/share/tomcat8/.jenkins/jobs/DL-Learner Merge-M/branches/spotbugs-fixes/workspace/interfaces-ext/pom.xml to org.dllearner/interfaces-ext/1.4.1-SNAPSHOT/interfaces-ext-1.4.1-SNAPSHOT.pom
[JENKINS] Archiving /usr/share/tomcat8/.jenkins/jobs/DL-Learner Merge-M/branches/spotbugs-fixes/workspace/components-ext/pom.xml to org.dllearner/components-ext/1.4.1-SNAPSHOT/components-ext-1.4.1-SNAPSHOT.pom
[JENKINS] Archiving /usr/share/tomcat8/.jenkins/jobs/DL-Learner Merge-M/branches/spotbugs-fixes/workspace/scripts/pom.xml to org.dllearner/scripts/1.4.1-SNAPSHOT/scripts-1.4.1-SNAPSHOT.pom
[JENKINS] Archiving /usr/share/tomcat8/.jenkins/jobs/DL-Learner Merge-M/branches/spotbugs-fixes/workspace/components-core/pom.xml to org.dllearner/components-core/1.4.1-SNAPSHOT/components-core-1.4.1-SNAPSHOT.pom
[JENKINS] Archiving /usr/share/tomcat8/.jenkins/jobs/DL-Learner Merge-M/branches/spotbugs-fixes/workspace/pom.xml to org.dllearner/dllearner-parent/1.4.1-SNAPSHOT/dllearner-parent-1.4.1-SNAPSHOT.pom
[JENKINS] Archiving /usr/share/tomcat8/.jenkins/jobs/DL-Learner Merge-M/branches/spotbugs-fixes/workspace/interfaces/pom.xml to org.dllearner/interfaces/1.4.1-SNAPSHOT/interfaces-1.4.1-SNAPSHOT.pom
channel stopped
[File exists] check if file exists [.git/MERGE_MODE]
Run condition [Not] enabling perform for step [[Set GitHub commit status (universal)]]
[Set GitHub commit status (universal)] ERROR on repos [GHRepository@5cb5c7b4[nodeId=MDEwOlJlcG9zaXRvcnkyMjY5MzUxNQ==,description=A tool for supervised Machine Learning in OWL and Description Logics,homepage=http://dl-learner.org,name=DL-Learner,fork=false,archived=false,size=255560,milestones={},language=Java,commits={},source=<null>,parent=<null>,url=https://api.github.com/repos/SmartDataAnalytics/DL-Learner,id=22693515,nodeId=<null>,createdAt=2014-08-06T18:29:54Z,updatedAt=2020-10-15T08:32:07Z]] (sha:3e001de) with context:jenkins-merge
Setting commit status on GitHub for https://github.com/SmartDataAnalytics/DL-Learner/commit/3e001de7746f4f3d280757be1ebc0aea04d6156a
Finished: FAILURE