FailedConsole Output

Skipping 137 KB.. Full Log
-1-20220516.205809-1.jar
[INFO] Downloaded from maven.aksw.snapshots: https://maven.aksw.org/repository/snapshots/org/aksw/jenax/jenax-rx-ops-syscall/4.6.0-1-SNAPSHOT/jenax-rx-ops-syscall-4.6.0-1-20220516.210309-1.jar (15 kB at 54 kB/s)
[INFO] Downloading from maven.aksw.snapshots: https://maven.aksw.org/repository/snapshots/org/aksw/jenax/jenax-arq-datasets-orderaware/4.6.0-1-SNAPSHOT/jenax-arq-datasets-orderaware-4.6.0-1-20220516.205826-1.jar
[INFO] Downloaded from maven.aksw.snapshots: https://maven.aksw.org/repository/snapshots/org/aksw/jenax/jenax-arq-rx/4.6.0-1-SNAPSHOT/jenax-arq-rx-4.6.0-1-20220516.205853-1.jar (208 kB at 722 kB/s)
[INFO] Downloading from maven.aksw.snapshots: https://maven.aksw.org/repository/snapshots/org/aksw/jenax/jenax-arq-datasets-oneng/4.6.0-1-SNAPSHOT/jenax-arq-datasets-oneng-4.6.0-1-20220516.205834-1.jar
[INFO] Downloaded from maven.aksw.snapshots: https://maven.aksw.org/repository/snapshots/org/aksw/jenax/jenax-arq-aggregators/4.6.0-1-SNAPSHOT/jenax-arq-aggregators-4.6.0-1-20220516.205816-1.jar (65 kB at 225 kB/s)
[INFO] Downloaded from maven.aksw.snapshots: https://maven.aksw.org/repository/snapshots/org/aksw/jenax/jenax-arq-datasets-orderaware/4.6.0-1-SNAPSHOT/jenax-arq-datasets-orderaware-4.6.0-1-20220516.205826-1.jar (32 kB at 111 kB/s)
[INFO] Downloading from maven.aksw.snapshots: https://maven.aksw.org/repository/snapshots/org/aksw/commons/aksw-commons-rx/0.9.4-SNAPSHOT/aksw-commons-rx-0.9.4-20220514.143359-7.jar
[INFO] Downloaded from maven.aksw.snapshots: https://maven.aksw.org/repository/snapshots/org/aksw/jenax/jenax-arq-functions/4.6.0-1-SNAPSHOT/jenax-arq-functions-4.6.0-1-20220516.205809-1.jar (3.4 kB at 12 kB/s)
[INFO] Downloading from maven.aksw.snapshots: https://maven.aksw.org/repository/snapshots/org/aksw/commons/aksw-commons-claimingcache/0.9.4-SNAPSHOT/aksw-commons-claimingcache-0.9.4-20220514.143116-8.jar
[INFO] Downloading from maven.aksw.snapshots: https://maven.aksw.org/repository/snapshots/org/aksw/commons/aksw-commons-io-buffers/0.9.4-SNAPSHOT/aksw-commons-io-buffers-0.9.4-20220514.143200-8.jar
[INFO] Downloaded from maven.aksw.snapshots: https://maven.aksw.org/repository/snapshots/org/aksw/jenax/jenax-arq-rdfterm/4.6.0-1-SNAPSHOT/jenax-arq-rdfterm-4.6.0-1-20220516.205802-1.jar (9.5 kB at 32 kB/s)
[INFO] Downloading from maven.aksw.snapshots: https://maven.aksw.org/repository/snapshots/org/aksw/commons/aksw-commons-objectstore/0.9.4-SNAPSHOT/aksw-commons-objectstore-0.9.4-20220514.143150-8.jar
[INFO] Downloaded from maven.aksw.snapshots: https://maven.aksw.org/repository/snapshots/org/aksw/jenax/jenax-arq-datasets-oneng/4.6.0-1-SNAPSHOT/jenax-arq-datasets-oneng-4.6.0-1-20220516.205834-1.jar (8.1 kB at 27 kB/s)
[INFO] Downloading from maven.aksw.snapshots: https://maven.aksw.org/repository/snapshots/org/aksw/commons/aksw-commons-paths/0.9.4-SNAPSHOT/aksw-commons-paths-0.9.4-20220514.143124-8.jar
[INFO] Downloaded from maven.aksw.snapshots: https://maven.aksw.org/repository/snapshots/org/aksw/commons/aksw-commons-claimingcache/0.9.4-SNAPSHOT/aksw-commons-claimingcache-0.9.4-20220514.143116-8.jar (34 kB at 108 kB/s)
[INFO] Downloading from maven.aksw.snapshots: https://maven.aksw.org/repository/snapshots/org/aksw/commons/aksw-commons-txn/0.9.4-SNAPSHOT/aksw-commons-txn-0.9.4-20220514.143142-8.jar
[INFO] Downloaded from maven.aksw.snapshots: https://maven.aksw.org/repository/snapshots/org/aksw/commons/aksw-commons-rx/0.9.4-SNAPSHOT/aksw-commons-rx-0.9.4-20220514.143359-7.jar (67 kB at 216 kB/s)
[INFO] Downloading from maven.aksw.snapshots: https://maven.aksw.org/repository/snapshots/org/aksw/commons/aksw-commons-rx-ex/0.9.4-SNAPSHOT/aksw-commons-rx-ex-0.9.4-20220514.143322-7.jar
[INFO] Downloaded from maven.aksw.snapshots: https://maven.aksw.org/repository/snapshots/org/aksw/commons/aksw-commons-io-buffers/0.9.4-SNAPSHOT/aksw-commons-io-buffers-0.9.4-20220514.143200-8.jar (113 kB at 359 kB/s)
[INFO] Downloading from maven.aksw.snapshots: https://maven.aksw.org/repository/snapshots/org/aksw/jenax/jenax-arq-rdfnode-in-dataset/4.6.0-1-SNAPSHOT/jenax-arq-rdfnode-in-dataset-4.6.0-1-20220516.205842-1.jar
[INFO] Downloaded from maven.aksw.snapshots: https://maven.aksw.org/repository/snapshots/org/aksw/commons/aksw-commons-objectstore/0.9.4-SNAPSHOT/aksw-commons-objectstore-0.9.4-20220514.143150-8.jar (32 kB at 101 kB/s)
[INFO] Downloading from maven.aksw.snapshots: https://maven.aksw.org/repository/snapshots/org/aksw/jenax/jenax-arq-relations/4.6.0-1-SNAPSHOT/jenax-arq-relations-4.6.0-1-20220516.205624-1.jar
[INFO] Downloaded from maven.aksw.snapshots: https://maven.aksw.org/repository/snapshots/org/aksw/commons/aksw-commons-paths/0.9.4-SNAPSHOT/aksw-commons-paths-0.9.4-20220514.143124-8.jar (53 kB at 162 kB/s)
[INFO] Downloading from maven.aksw.snapshots: https://maven.aksw.org/repository/snapshots/org/aksw/commons/aksw-commons-io-syscalls/0.9.4-SNAPSHOT/aksw-commons-io-syscalls-0.9.4-20220514.143207-8.jar
[INFO] Downloaded from maven.aksw.snapshots: https://maven.aksw.org/repository/snapshots/org/aksw/commons/aksw-commons-rx-ex/0.9.4-SNAPSHOT/aksw-commons-rx-ex-0.9.4-20220514.143322-7.jar (42 kB at 124 kB/s)
[INFO] Downloading from maven.aksw.snapshots: https://maven.aksw.org/repository/snapshots/org/aksw/commons/aksw-commons-collectors/0.9.4-SNAPSHOT/aksw-commons-collectors-0.9.4-20220514.143108-8.jar
[INFO] Downloaded from maven.aksw.snapshots: https://maven.aksw.org/repository/snapshots/org/aksw/jenax/jenax-arq-relations/4.6.0-1-SNAPSHOT/jenax-arq-relations-4.6.0-1-20220516.205624-1.jar (110 kB at 325 kB/s)
[INFO] Downloading from maven.aksw.snapshots: https://maven.aksw.org/repository/snapshots/org/aksw/commons/aksw-commons-lambdas-serializable/0.9.4-SNAPSHOT/aksw-commons-lambdas-serializable-0.9.4-20220514.142952-8.jar
[INFO] Downloaded from maven.aksw.snapshots: https://maven.aksw.org/repository/snapshots/org/aksw/commons/aksw-commons-txn/0.9.4-SNAPSHOT/aksw-commons-txn-0.9.4-20220514.143142-8.jar (70 kB at 208 kB/s)
[INFO] Downloading from maven.aksw.snapshots: https://maven.aksw.org/repository/snapshots/org/aksw/commons/aksw-commons-io-utils/0.9.4-SNAPSHOT/aksw-commons-io-utils-0.9.4-20220514.143135-8.jar
[INFO] Downloaded from maven.aksw.snapshots: https://maven.aksw.org/repository/snapshots/org/aksw/commons/aksw-commons-io-syscalls/0.9.4-SNAPSHOT/aksw-commons-io-syscalls-0.9.4-20220514.143207-8.jar (4.1 kB at 12 kB/s)
[INFO] Downloading from maven.aksw.snapshots: https://maven.aksw.org/repository/snapshots/org/aksw/commons/aksw-commons-lambdas-throwing/0.9.4-SNAPSHOT/aksw-commons-lambdas-throwing-0.9.4-20220514.143056-8.jar
[INFO] Downloaded from maven.aksw.snapshots: https://maven.aksw.org/repository/snapshots/org/aksw/jenax/jenax-arq-rdfnode-in-dataset/4.6.0-1-SNAPSHOT/jenax-arq-rdfnode-in-dataset-4.6.0-1-20220516.205842-1.jar (14 kB at 40 kB/s)
[INFO] Downloading from maven.aksw.snapshots: https://maven.aksw.org/repository/snapshots/org/aksw/commons/aksw-commons-io-process-pipes/0.9.4-SNAPSHOT/aksw-commons-io-process-pipes-0.9.4-20220514.143220-8.jar
[INFO] Downloaded from maven.aksw.snapshots: https://maven.aksw.org/repository/snapshots/org/aksw/commons/aksw-commons-collectors/0.9.4-SNAPSHOT/aksw-commons-collectors-0.9.4-20220514.143108-8.jar (74 kB at 200 kB/s)
[INFO] Downloading from maven.aksw.snapshots: https://maven.aksw.org/repository/snapshots/org/aksw/jenax/jenax-arq-algebra/4.6.0-1-SNAPSHOT/jenax-arq-algebra-4.6.0-1-20220516.210147-1.jar
[INFO] Downloaded from maven.aksw.snapshots: https://maven.aksw.org/repository/snapshots/org/aksw/commons/aksw-commons-lambdas-throwing/0.9.4-SNAPSHOT/aksw-commons-lambdas-throwing-0.9.4-20220514.143056-8.jar (6.4 kB at 17 kB/s)
[INFO] Downloading from maven.aksw.snapshots: https://maven.aksw.org/repository/snapshots/org/aksw/jenax/jenax-arq-propertypaths/4.6.0-1-SNAPSHOT/jenax-arq-propertypaths-4.6.0-1-20220516.205607-1.jar
[INFO] Downloaded from maven.aksw.snapshots: https://maven.aksw.org/repository/snapshots/org/aksw/commons/aksw-commons-lambdas-serializable/0.9.4-SNAPSHOT/aksw-commons-lambdas-serializable-0.9.4-20220514.142952-8.jar (9.8 kB at 27 kB/s)
[INFO] Downloading from maven.aksw.snapshots: https://maven.aksw.org/repository/snapshots/org/aksw/jenax/jenax-arq-utils/4.6.0-1-SNAPSHOT/jenax-arq-utils-4.6.0-1-20220516.205426-1.jar
[INFO] Downloaded from maven.aksw.snapshots: https://maven.aksw.org/repository/snapshots/org/aksw/commons/aksw-commons-io-process-pipes/0.9.4-SNAPSHOT/aksw-commons-io-process-pipes-0.9.4-20220514.143220-8.jar (39 kB at 103 kB/s)
[INFO] Downloading from maven.aksw.snapshots: https://maven.aksw.org/repository/snapshots/org/aksw/jenax/jenax-arq-udf/4.6.0-1-SNAPSHOT/jenax-arq-udf-4.6.0-1-20220516.210139-1.jar
[INFO] Downloaded from maven.aksw.snapshots: https://maven.aksw.org/repository/snapshots/org/aksw/commons/aksw-commons-io-utils/0.9.4-SNAPSHOT/aksw-commons-io-utils-0.9.4-20220514.143135-8.jar (33 kB at 89 kB/s)
[INFO] Downloading from maven.aksw.snapshots: https://maven.aksw.org/repository/snapshots/org/aksw/jenax/jenax-arq-hdt/4.6.0-1-SNAPSHOT/jenax-arq-hdt-4.6.0-1-20220516.210123-1.jar
[INFO] Downloaded from maven.aksw.snapshots: https://maven.aksw.org/repository/snapshots/org/aksw/jenax/jenax-arq-propertypaths/4.6.0-1-SNAPSHOT/jenax-arq-propertypaths-4.6.0-1-20220516.205607-1.jar (30 kB at 79 kB/s)
[INFO] Downloading from maven.aksw.snapshots: https://maven.aksw.org/repository/snapshots/org/aksw/jenax/jenax-arq-json/4.6.0-1-SNAPSHOT/jenax-arq-json-4.6.0-1-20220516.205601-1.jar
[INFO] Downloaded from maven.aksw.snapshots: https://maven.aksw.org/repository/snapshots/org/aksw/jenax/jenax-arq-algebra/4.6.0-1-SNAPSHOT/jenax-arq-algebra-4.6.0-1-20220516.210147-1.jar (193 kB at 505 kB/s)
[INFO] Downloading from maven.aksw.snapshots: https://maven.aksw.org/repository/snapshots/org/aksw/jenax/jenax-arq-stmt/4.6.0-1-SNAPSHOT/jenax-arq-stmt-4.6.0-1-20220516.205555-1.jar
[INFO] Downloaded from maven.aksw.snapshots: https://maven.aksw.org/repository/snapshots/org/aksw/jenax/jenax-arq-hdt/4.6.0-1-SNAPSHOT/jenax-arq-hdt-4.6.0-1-20220516.210123-1.jar (12 kB at 31 kB/s)
[INFO] Downloading from maven.aksw.snapshots: https://maven.aksw.org/repository/snapshots/org/aksw/jenax/jenax-resources-prefixes/4.6.0-1-SNAPSHOT/jenax-resources-prefixes-4.6.0-1-20220516.205443-1.jar
[INFO] Downloaded from maven.aksw.snapshots: https://maven.aksw.org/repository/snapshots/org/aksw/jenax/jenax-arq-udf/4.6.0-1-SNAPSHOT/jenax-arq-udf-4.6.0-1-20220516.210139-1.jar (15 kB at 40 kB/s)
[INFO] Downloading from maven.aksw.snapshots: https://maven.aksw.org/repository/snapshots/org/aksw/jenax/jenax-arq-plugins-bundle/4.6.0-1-SNAPSHOT/jenax-arq-plugins-bundle-4.6.0-1-20220516.210301-1.jar
[INFO] Downloaded from maven.aksw.snapshots: https://maven.aksw.org/repository/snapshots/org/aksw/jenax/jenax-arq-json/4.6.0-1-SNAPSHOT/jenax-arq-json-4.6.0-1-20220516.205601-1.jar (9.7 kB at 25 kB/s)
[INFO] Downloading from maven.aksw.snapshots: https://maven.aksw.org/repository/snapshots/org/aksw/jenax/jenax-arq-collections/4.6.0-1-SNAPSHOT/jenax-arq-collections-4.6.0-1-20220516.205657-1.jar
[INFO] Downloaded from maven.aksw.snapshots: https://maven.aksw.org/repository/snapshots/org/aksw/jenax/jenax-arq-utils/4.6.0-1-SNAPSHOT/jenax-arq-utils-4.6.0-1-20220516.205426-1.jar (257 kB at 653 kB/s)
[INFO] Downloading from maven.aksw.snapshots: https://maven.aksw.org/repository/snapshots/org/aksw/jenax/jenax-annotations-reprogen/4.6.0-1-SNAPSHOT/jenax-annotations-reprogen-4.6.0-1-20220516.205459-1.jar
[INFO] Downloaded from maven.aksw.snapshots: https://maven.aksw.org/repository/snapshots/org/aksw/jenax/jenax-resources-prefixes/4.6.0-1-SNAPSHOT/jenax-resources-prefixes-4.6.0-1-20220516.205443-1.jar (83 kB at 209 kB/s)
[INFO] Downloading from maven.aksw.snapshots: https://maven.aksw.org/repository/snapshots/org/aksw/jenax/jenax-arq-plugins-datatypes/4.6.0-1-SNAPSHOT/jenax-arq-plugins-datatypes-4.6.0-1-20220516.210220-1.jar
[INFO] Downloaded from maven.aksw.snapshots: https://maven.aksw.org/repository/snapshots/org/aksw/jenax/jenax-arq-stmt/4.6.0-1-SNAPSHOT/jenax-arq-stmt-4.6.0-1-20220516.205555-1.jar (59 kB at 148 kB/s)
[INFO] Downloading from maven.aksw.snapshots: https://maven.aksw.org/repository/snapshots/org/aksw/jenax/jenax-models-dcat-api/4.6.0-1-SNAPSHOT/jenax-models-dcat-api-4.6.0-1-20220516.210227-1.jar
[INFO] Downloaded from maven.aksw.snapshots: https://maven.aksw.org/repository/snapshots/org/aksw/jenax/jenax-annotations-reprogen/4.6.0-1-SNAPSHOT/jenax-annotations-reprogen-4.6.0-1-20220516.205459-1.jar (14 kB at 34 kB/s)
[INFO] Downloading from maven.aksw.snapshots: https://maven.aksw.org/repository/snapshots/org/aksw/jenax/jenax-functionbinder-core/4.6.0-1-SNAPSHOT/jenax-functionbinder-core-4.6.0-1-20220516.210242-1.jar
[INFO] Downloaded from maven.aksw.snapshots: https://maven.aksw.org/repository/snapshots/org/aksw/jenax/jenax-models-dcat-api/4.6.0-1-SNAPSHOT/jenax-models-dcat-api-4.6.0-1-20220516.210227-1.jar (27 kB at 66 kB/s)
[INFO] Downloading from maven.aksw.snapshots: https://maven.aksw.org/repository/snapshots/org/aksw/jenax/jenax-reprogen-shared/4.6.0-1-SNAPSHOT/jenax-reprogen-shared-4.6.0-1-20220516.205704-1.jar
[INFO] Downloaded from maven.aksw.snapshots: https://maven.aksw.org/repository/snapshots/org/aksw/jenax/jenax-arq-plugins-bundle/4.6.0-1-SNAPSHOT/jenax-arq-plugins-bundle-4.6.0-1-20220516.210301-1.jar (158 kB at 389 kB/s)
[INFO] Downloading from maven.aksw.snapshots: https://maven.aksw.org/repository/snapshots/org/aksw/jenax/jenax-arq-tika/4.6.0-1-SNAPSHOT/jenax-arq-tika-4.6.0-1-20220516.205547-1.jar
[INFO] Downloaded from maven.aksw.snapshots: https://maven.aksw.org/repository/snapshots/org/aksw/jenax/jenax-arq-collections/4.6.0-1-SNAPSHOT/jenax-arq-collections-4.6.0-1-20220516.205657-1.jar (92 kB at 227 kB/s)
[INFO] Downloading from maven.aksw.snapshots: https://maven.aksw.org/repository/snapshots/org/aksw/jenax/jenax-rx-dataaccess/4.6.0-1-SNAPSHOT/jenax-rx-dataaccess-4.6.0-1-20220516.205954-1.jar
[INFO] Downloaded from maven.aksw.snapshots: https://maven.aksw.org/repository/snapshots/org/aksw/jenax/jenax-arq-plugins-datatypes/4.6.0-1-SNAPSHOT/jenax-arq-plugins-datatypes-4.6.0-1-20220516.210220-1.jar (8.8 kB at 22 kB/s)
[INFO] Downloading from maven.aksw.snapshots: https://maven.aksw.org/repository/snapshots/org/aksw/jenax/jenax-io-kryo/4.6.0-1-SNAPSHOT/jenax-io-kryo-4.6.0-1-20220516.205908-1.jar
[INFO] Downloaded from maven.aksw.snapshots: https://maven.aksw.org/repository/snapshots/org/aksw/jenax/jenax-functionbinder-core/4.6.0-1-SNAPSHOT/jenax-functionbinder-core-4.6.0-1-20220516.210242-1.jar (15 kB at 36 kB/s)
[INFO] Downloading from maven.aksw.snapshots: https://maven.aksw.org/repository/snapshots/org/aksw/jenax/jenax-io-json/4.6.0-1-SNAPSHOT/jenax-io-json-4.6.0-1-20220516.205649-1.jar
[INFO] Downloaded from maven.aksw.snapshots: https://maven.aksw.org/repository/snapshots/org/aksw/jenax/jenax-arq-tika/4.6.0-1-SNAPSHOT/jenax-arq-tika-4.6.0-1-20220516.205547-1.jar (3.4 kB at 8.2 kB/s)
[INFO] Downloading from maven.aksw.snapshots: https://maven.aksw.org/repository/snapshots/org/aksw/jenax/jenax-analytics-core/4.6.0-1-SNAPSHOT/jenax-analytics-core-4.6.0-1-20220516.205919-1.jar
[INFO] Downloaded from maven.aksw.snapshots: https://maven.aksw.org/repository/snapshots/org/aksw/jenax/jenax-reprogen-shared/4.6.0-1-SNAPSHOT/jenax-reprogen-shared-4.6.0-1-20220516.205704-1.jar (5.3 kB at 13 kB/s)
[INFO] Downloading from maven.aksw.snapshots: https://maven.aksw.org/repository/snapshots/org/aksw/jenax/jenax-reprogen-core/4.6.0-1-SNAPSHOT/jenax-reprogen-core-4.6.0-1-20220516.205746-1.jar
[INFO] Downloaded from maven.aksw.snapshots: https://maven.aksw.org/repository/snapshots/org/aksw/jenax/jenax-io-json/4.6.0-1-SNAPSHOT/jenax-io-json-4.6.0-1-20220516.205649-1.jar (8.6 kB at 20 kB/s)
[INFO] Downloading from maven.aksw.snapshots: https://maven.aksw.org/repository/snapshots/org/aksw/commons/aksw-commons-beans/0.9.4-SNAPSHOT/aksw-commons-beans-0.9.4-20220514.143042-8.jar
[INFO] Downloaded from maven.aksw.snapshots: https://maven.aksw.org/repository/snapshots/org/aksw/jenax/jenax-analytics-core/4.6.0-1-SNAPSHOT/jenax-analytics-core-4.6.0-1-20220516.205919-1.jar (66 kB at 156 kB/s)
[INFO] Downloading from maven.aksw.snapshots: https://maven.aksw.org/repository/snapshots/org/aksw/jenax/jenax-arq-entityquery/4.6.0-1-SNAPSHOT/jenax-arq-entityquery-4.6.0-1-20220516.205926-1.jar
[INFO] Downloaded from maven.aksw.snapshots: https://maven.aksw.org/repository/snapshots/org/aksw/jenax/jenax-io-kryo/4.6.0-1-SNAPSHOT/jenax-io-kryo-4.6.0-1-20220516.205908-1.jar (36 kB at 81 kB/s)
[INFO] Downloading from maven.aksw.snapshots: https://maven.aksw.org/repository/snapshots/org/aksw/commons/aksw-commons-collections/0.9.4-SNAPSHOT/aksw-commons-collections-0.9.4-20220514.143017-8.jar
[INFO] Downloaded from maven.aksw.snapshots: https://maven.aksw.org/repository/snapshots/org/aksw/jenax/jenax-reprogen-core/4.6.0-1-SNAPSHOT/jenax-reprogen-core-4.6.0-1-20220516.205746-1.jar (67 kB at 151 kB/s)
[INFO] Downloaded from maven.aksw.snapshots: https://maven.aksw.org/repository/snapshots/org/aksw/jenax/jenax-rx-dataaccess/4.6.0-1-SNAPSHOT/jenax-rx-dataaccess-4.6.0-1-20220516.205954-1.jar (368 kB at 835 kB/s)
[INFO] Downloading from maven.aksw.snapshots: https://maven.aksw.org/repository/snapshots/org/aksw/jenax/jenax-server-standalone/4.6.0-1-SNAPSHOT/jenax-server-standalone-4.6.0-1-20220516.210411-1.jar
[INFO] Downloading from maven.aksw.snapshots: https://maven.aksw.org/repository/snapshots/org/aksw/jenax/jenax-io-core/4.6.0-1-SNAPSHOT/jenax-io-core-4.6.0-1-20220516.210030-1.jar
[INFO] Downloaded from maven.aksw.snapshots: https://maven.aksw.org/repository/snapshots/org/aksw/commons/aksw-commons-beans/0.9.4-SNAPSHOT/aksw-commons-beans-0.9.4-20220514.143042-8.jar (40 kB at 90 kB/s)
[INFO] Downloading from maven.aksw.snapshots: https://maven.aksw.org/repository/snapshots/org/aksw/jenax/jenax-server-frontends/4.6.0-1-SNAPSHOT/jenax-server-frontends-4.6.0-1-20220516.210403-1.jar
[INFO] Downloaded from maven.aksw.snapshots: https://maven.aksw.org/repository/snapshots/org/aksw/jenax/jenax-arq-entityquery/4.6.0-1-SNAPSHOT/jenax-arq-entityquery-4.6.0-1-20220516.205926-1.jar (44 kB at 99 kB/s)
[INFO] Downloading from maven.aksw.snapshots: https://maven.aksw.org/repository/snapshots/org/aksw/jenax/jenax-server-core/4.6.0-1-SNAPSHOT/jenax-server-core-4.6.0-1-20220516.210356-1.jar
[INFO] Downloaded from maven.aksw.snapshots: https://maven.aksw.org/repository/snapshots/org/aksw/jenax/jenax-server-standalone/4.6.0-1-SNAPSHOT/jenax-server-standalone-4.6.0-1-20220516.210411-1.jar (5.4 kB at 12 kB/s)
[INFO] Downloaded from maven.aksw.snapshots: https://maven.aksw.org/repository/snapshots/org/aksw/jenax/jenax-server-frontends/4.6.0-1-SNAPSHOT/jenax-server-frontends-4.6.0-1-20220516.210403-1.jar (9.9 kB at 22 kB/s)
[INFO] Downloaded from maven.aksw.snapshots: https://maven.aksw.org/repository/snapshots/org/aksw/jenax/jenax-io-core/4.6.0-1-SNAPSHOT/jenax-io-core-4.6.0-1-20220516.210030-1.jar (221 kB at 472 kB/s)
[INFO] Downloaded from maven.aksw.snapshots: https://maven.aksw.org/repository/snapshots/org/aksw/commons/aksw-commons-collections/0.9.4-SNAPSHOT/aksw-commons-collections-0.9.4-20220514.143017-8.jar (290 kB at 616 kB/s)
[INFO] Downloaded from maven.aksw.snapshots: https://maven.aksw.org/repository/snapshots/org/aksw/jenax/jenax-server-core/4.6.0-1-SNAPSHOT/jenax-server-core-4.6.0-1-20220516.210356-1.jar (412 kB at 864 kB/s)
[INFO] Downloading from apache-repo-snapshots: https://repository.apache.org/content/repositories/snapshots/org/apache/jena/jena-tdb2/4.6.0-SNAPSHOT/jena-tdb2-4.6.0-20220516.052346-6.jar
[INFO] Downloading from apache-repo-snapshots: https://repository.apache.org/content/repositories/snapshots/org/apache/jena/jena-dboe-storage/4.6.0-SNAPSHOT/jena-dboe-storage-4.6.0-20220516.052346-6.jar
[INFO] Downloading from apache-repo-snapshots: https://repository.apache.org/content/repositories/snapshots/org/apache/jena/jena-dboe-trans-data/4.6.0-SNAPSHOT/jena-dboe-trans-data-4.6.0-20220516.052346-6.jar
[INFO] Downloading from apache-repo-snapshots: https://repository.apache.org/content/repositories/snapshots/org/apache/jena/jena-dboe-base/4.6.0-SNAPSHOT/jena-dboe-base-4.6.0-20220516.052346-6.jar
[INFO] Downloading from apache-repo-snapshots: https://repository.apache.org/content/repositories/snapshots/org/apache/jena/jena-dboe-transaction/4.6.0-SNAPSHOT/jena-dboe-transaction-4.6.0-20220516.052346-6.jar
[INFO] Downloaded from apache-repo-snapshots: https://repository.apache.org/content/repositories/snapshots/org/apache/jena/jena-tdb2/4.6.0-SNAPSHOT/jena-tdb2-4.6.0-20220516.052346-6.jar (0 B at 0 B/s)
[INFO] Downloading from apache-repo-snapshots: https://repository.apache.org/content/repositories/snapshots/org/apache/jena/jena-dboe-index/4.6.0-SNAPSHOT/jena-dboe-index-4.6.0-20220516.052346-6.jar
[INFO] Downloaded from apache-repo-snapshots: https://repository.apache.org/content/repositories/snapshots/org/apache/jena/jena-dboe-transaction/4.6.0-SNAPSHOT/jena-dboe-transaction-4.6.0-20220516.052346-6.jar (0 B at 0 B/s)
[INFO] Downloading from apache-repo-snapshots: https://repository.apache.org/content/repositories/snapshots/org/apache/jena/jena-base/4.6.0-SNAPSHOT/jena-base-4.6.0-20220516.052346-6.jar
[INFO] Downloaded from apache-repo-snapshots: https://repository.apache.org/content/repositories/snapshots/org/apache/jena/jena-dboe-storage/4.6.0-SNAPSHOT/jena-dboe-storage-4.6.0-20220516.052346-6.jar (0 B at 0 B/s)
[INFO] Downloading from apache-repo-snapshots: https://repository.apache.org/content/repositories/snapshots/org/apache/jena/jena-shaded-guava/4.6.0-SNAPSHOT/jena-shaded-guava-4.6.0-20220516.052346-6.jar
[INFO] Downloaded from apache-repo-snapshots: https://repository.apache.org/content/repositories/snapshots/org/apache/jena/jena-dboe-index/4.6.0-SNAPSHOT/jena-dboe-index-4.6.0-20220516.052346-6.jar (19 kB at 97 kB/s)
[INFO] Downloading from apache-repo-snapshots: https://repository.apache.org/content/repositories/snapshots/org/apache/jena/jena-geosparql/4.6.0-SNAPSHOT/jena-geosparql-4.6.0-20220516.052346-6.jar
[INFO] Downloaded from apache-repo-snapshots: https://repository.apache.org/content/repositories/snapshots/org/apache/jena/jena-dboe-base/4.6.0-SNAPSHOT/jena-dboe-base-4.6.0-20220516.052346-6.jar (0 B at 0 B/s)
[INFO] Downloading from apache-repo-snapshots: https://repository.apache.org/content/repositories/snapshots/org/apache/jena/jena-rdfconnection/4.6.0-SNAPSHOT/jena-rdfconnection-4.6.0-20220516.052346-6.jar
[INFO] Downloaded from apache-repo-snapshots: https://repository.apache.org/content/repositories/snapshots/org/apache/jena/jena-dboe-trans-data/4.6.0-SNAPSHOT/jena-dboe-trans-data-4.6.0-20220516.052346-6.jar (0 B at 0 B/s)
[INFO] Downloading from apache-repo-snapshots: https://repository.apache.org/content/repositories/snapshots/org/apache/jena/jena-core/4.6.0-SNAPSHOT/jena-core-4.6.0-20220516.052346-6.jar
[INFO] Downloaded from apache-repo-snapshots: https://repository.apache.org/content/repositories/snapshots/org/apache/jena/jena-rdfconnection/4.6.0-SNAPSHOT/jena-rdfconnection-4.6.0-20220516.052346-6.jar (70 kB at 257 kB/s)
[INFO] Downloading from apache-repo-snapshots: https://repository.apache.org/content/repositories/snapshots/org/apache/jena/jena-arq/4.6.0-SNAPSHOT/jena-arq-4.6.0-20220516.052346-6.jar
[INFO] Downloaded from apache-repo-snapshots: https://repository.apache.org/content/repositories/snapshots/org/apache/jena/jena-base/4.6.0-SNAPSHOT/jena-base-4.6.0-20220516.052346-6.jar (249 kB at 805 kB/s)
[INFO] Downloading from apache-repo-snapshots: https://repository.apache.org/content/repositories/snapshots/org/apache/jena/jena-iri/4.6.0-SNAPSHOT/jena-iri-4.6.0-20220516.052346-6.jar
[INFO] Downloaded from apache-repo-snapshots: https://repository.apache.org/content/repositories/snapshots/org/apache/jena/jena-core/4.6.0-SNAPSHOT/jena-core-4.6.0-20220516.052346-6.jar (0 B at 0 B/s)
[INFO] Downloaded from apache-repo-snapshots: https://repository.apache.org/content/repositories/snapshots/org/apache/jena/jena-shaded-guava/4.6.0-SNAPSHOT/jena-shaded-guava-4.6.0-20220516.052346-6.jar (0 B at 0 B/s)
[INFO] Downloaded from apache-repo-snapshots: https://repository.apache.org/content/repositories/snapshots/org/apache/jena/jena-geosparql/4.6.0-SNAPSHOT/jena-geosparql-4.6.0-20220516.052346-6.jar (308 kB at 983 kB/s)
[INFO] Downloaded from apache-repo-snapshots: https://repository.apache.org/content/repositories/snapshots/org/apache/jena/jena-iri/4.6.0-SNAPSHOT/jena-iri-4.6.0-20220516.052346-6.jar (138 kB at 389 kB/s)
[INFO] Downloaded from apache-repo-snapshots: https://repository.apache.org/content/repositories/snapshots/org/apache/jena/jena-arq/4.6.0-SNAPSHOT/jena-arq-4.6.0-20220516.052346-6.jar (3.5 MB at 7.8 MB/s)
[INFO] Downloading from maven.aksw.internal: https://maven.aksw.org/repository/internal/com/fasterxml/jackson/core/jackson-databind/2.13.2.2/jackson-databind-2.13.2.2.jar
[INFO] Downloading from maven.aksw.snapshots: https://maven.aksw.org/repository/snapshots/com/fasterxml/jackson/core/jackson-databind/2.13.2.2/jackson-databind-2.13.2.2.jar
[INFO] Downloading from central: https://repo.maven.apache.org/maven2/com/fasterxml/jackson/core/jackson-databind/2.13.2.2/jackson-databind-2.13.2.2.jar
[INFO] Downloaded from central: https://repo.maven.apache.org/maven2/com/fasterxml/jackson/core/jackson-databind/2.13.2.2/jackson-databind-2.13.2.2.jar (1.5 MB at 14 MB/s)
[INFO] 
[INFO] --- maven-clean-plugin:2.5:clean (default-clean) @ rdf-processing-toolkit-cli ---
[INFO] Deleting /usr/share/tomcat8/.jenkins/jobs/RDF-Processing-Toolkit/workspace/rdf-processing-toolkit-cli/target
[INFO] 
[INFO] --- maven-resources-plugin:2.6:resources (default-resources) @ rdf-processing-toolkit-cli ---
[INFO] Using 'UTF-8' encoding to copy filtered resources.
[INFO] Copying 10 resources
[INFO] Copying 1 resource
[INFO] 
[INFO] --- maven-compiler-plugin:3.6.0:compile (default-compile) @ rdf-processing-toolkit-cli ---
[INFO] Changes detected - recompiling the module!
[INFO] Compiling 56 source files to /usr/share/tomcat8/.jenkins/jobs/RDF-Processing-Toolkit/workspace/rdf-processing-toolkit-cli/target/classes
[INFO] /usr/share/tomcat8/.jenkins/jobs/RDF-Processing-Toolkit/workspace/rdf-processing-toolkit-cli/src/main/java/org/aksw/sparql_integrate/cli/MainCliSparqlLoad.java: Some input files use or override a deprecated API.
[INFO] /usr/share/tomcat8/.jenkins/jobs/RDF-Processing-Toolkit/workspace/rdf-processing-toolkit-cli/src/main/java/org/aksw/sparql_integrate/cli/MainCliSparqlLoad.java: Recompile with -Xlint:deprecation for details.
[INFO] 
[INFO] --- maven-resources-plugin:2.6:testResources (default-testResources) @ rdf-processing-toolkit-cli ---
[INFO] Using 'UTF-8' encoding to copy filtered resources.
[INFO] Copying 11 resources
[INFO] 
[INFO] --- maven-compiler-plugin:3.6.0:testCompile (default-testCompile) @ rdf-processing-toolkit-cli ---
[INFO] Changes detected - recompiling the module!
[INFO] Compiling 2 source files to /usr/share/tomcat8/.jenkins/jobs/RDF-Processing-Toolkit/workspace/rdf-processing-toolkit-cli/target/test-classes
[INFO] 
[INFO] --- maven-surefire-plugin:2.19:test (default-test) @ rdf-processing-toolkit-cli ---

-------------------------------------------------------
 T E S T S
-------------------------------------------------------
NOTE: Picked up JDK_JAVA_OPTIONS:  --add-opens=java.base/java.lang=ALL-UNNAMED --add-opens=java.base/java.io=ALL-UNNAMED --add-opens=java.rmi/sun.rmi.transport=ALL-UNNAMED
Running org.aksw.sparql_integrate.ngs.cli.main.TestCliNgs
Tests run: 1, Failures: 0, Errors: 0, Skipped: 0, Time elapsed: 0.015 sec - in org.aksw.sparql_integrate.ngs.cli.main.TestCliNgs
Running org.aksw.sparql_integrate.ngs.cli.main.TestSparqlBindingStreamOperators
java.lang.RuntimeException: java.lang.RuntimeException: No lang found for label txt
	at org.aksw.commons.util.exception.ExceptionUtilsAksw.rethrowUnless(ExceptionUtilsAksw.java:40)
	at org.aksw.commons.util.exception.ExceptionUtilsAksw.rethrowIfNotBrokenPipe(ExceptionUtilsAksw.java:81)
	at org.aksw.rdf_processing_toolkit.cli.cmd.CmdUtils.lambda$callCmd$0(CmdUtils.java:69)
	at picocli.CommandLine.execute(CommandLine.java:2088)
	at org.aksw.rdf_processing_toolkit.cli.cmd.CmdUtils.callCmd(CmdUtils.java:75)
	at org.aksw.rdf_processing_toolkit.cli.cmd.CmdUtils.callCmd(CmdUtils.java:39)
	at org.aksw.sparql_integrate.ngs.cli.main.TestSparqlBindingStreamOperators.test1(TestSparqlBindingStreamOperators.java:15)
	at java.base/jdk.internal.reflect.NativeMethodAccessorImpl.invoke0(Native Method)
	at java.base/jdk.internal.reflect.NativeMethodAccessorImpl.invoke(NativeMethodAccessorImpl.java:62)
	at java.base/jdk.internal.reflect.DelegatingMethodAccessorImpl.invoke(DelegatingMethodAccessorImpl.java:43)
	at java.base/java.lang.reflect.Method.invoke(Method.java:566)
	at org.junit.runners.model.FrameworkMethod$1.runReflectiveCall(FrameworkMethod.java:50)
	at org.junit.internal.runners.model.ReflectiveCallable.run(ReflectiveCallable.java:12)
	at org.junit.runners.model.FrameworkMethod.invokeExplosively(FrameworkMethod.java:47)
	at org.junit.internal.runners.statements.InvokeMethod.evaluate(InvokeMethod.java:17)
	at org.junit.runners.ParentRunner.runLeaf(ParentRunner.java:325)
	at org.junit.runners.BlockJUnit4ClassRunner.runChild(BlockJUnit4ClassRunner.java:78)
	at org.junit.runners.BlockJUnit4ClassRunner.runChild(BlockJUnit4ClassRunner.java:57)
	at org.junit.runners.ParentRunner$3.run(ParentRunner.java:290)
	at org.junit.runners.ParentRunner$1.schedule(ParentRunner.java:71)
	at org.junit.runners.ParentRunner.runChildren(ParentRunner.java:288)
	at org.junit.runners.ParentRunner.access$000(ParentRunner.java:58)
	at org.junit.runners.ParentRunner$2.evaluate(ParentRunner.java:268)
	at org.junit.runners.ParentRunner.run(ParentRunner.java:363)
	at org.apache.maven.surefire.junit4.JUnit4Provider.execute(JUnit4Provider.java:344)
	at org.apache.maven.surefire.junit4.JUnit4Provider.executeWithRerun(JUnit4Provider.java:269)
	at org.apache.maven.surefire.junit4.JUnit4Provider.executeTestSet(JUnit4Provider.java:240)
	at org.apache.maven.surefire.junit4.JUnit4Provider.invoke(JUnit4Provider.java:184)
	at org.apache.maven.surefire.booter.ForkedBooter.invokeProviderInSameClassLoader(ForkedBooter.java:286)
	at org.apache.maven.surefire.booter.ForkedBooter.runSuitesInProcess(ForkedBooter.java:240)
	at org.apache.maven.surefire.booter.ForkedBooter.main(ForkedBooter.java:121)
Caused by: java.lang.RuntimeException: No lang found for label txt
	at org.aksw.jena_sparql_api.rx.RDFLanguagesEx.lambda$findLang$6(RDFLanguagesEx.java:209)
	at java.base/java.util.Optional.orElseThrow(Optional.java:408)
	at org.aksw.jena_sparql_api.rx.RDFLanguagesEx.findLang(RDFLanguagesEx.java:209)
	at org.aksw.sparql_binding_stream.cli.main.SbsCmdImpls.query(SbsCmdImpls.java:201)
	at org.aksw.sparql_binding_stream.cli.cmd.CmdSbsMap.call(CmdSbsMap.java:37)
	at org.aksw.sparql_binding_stream.cli.cmd.CmdSbsMap.call(CmdSbsMap.java:13)
	at picocli.CommandLine.executeUserObject(CommandLine.java:1953)
	at picocli.CommandLine.access$1300(CommandLine.java:145)
	at picocli.CommandLine$RunLast.executeUserObjectOfLastSubcommandWithSameParent(CommandLine.java:2358)
	at picocli.CommandLine$RunLast.handle(CommandLine.java:2352)
	at picocli.CommandLine$RunLast.handle(CommandLine.java:2314)
	at picocli.CommandLine$AbstractParseResultHandler.execute(CommandLine.java:2179)
	at picocli.CommandLine$RunLast.execute(CommandLine.java:2316)
	at picocli.CommandLine.execute(CommandLine.java:2078)
	... 27 more
java.lang.RuntimeException: java.lang.RuntimeException: No lang found for label txt
	at org.aksw.commons.util.exception.ExceptionUtilsAksw.rethrowUnless(ExceptionUtilsAksw.java:40)
	at org.aksw.commons.util.exception.ExceptionUtilsAksw.rethrowIfNotBrokenPipe(ExceptionUtilsAksw.java:81)
	at org.aksw.rdf_processing_toolkit.cli.cmd.CmdUtils.lambda$callCmd$0(CmdUtils.java:69)
	at picocli.CommandLine.execute(CommandLine.java:2088)
	at org.aksw.rdf_processing_toolkit.cli.cmd.CmdUtils.callCmd(CmdUtils.java:75)
	at org.aksw.rdf_processing_toolkit.cli.cmd.CmdUtils.callCmd(CmdUtils.java:39)
	at org.aksw.sparql_integrate.ngs.cli.main.TestSparqlBindingStreamOperators.test1(TestSparqlBindingStreamOperators.java:16)
	at java.base/jdk.internal.reflect.NativeMethodAccessorImpl.invoke0(Native Method)
	at java.base/jdk.internal.reflect.NativeMethodAccessorImpl.invoke(NativeMethodAccessorImpl.java:62)
	at java.base/jdk.internal.reflect.DelegatingMethodAccessorImpl.invoke(DelegatingMethodAccessorImpl.java:43)
	at java.base/java.lang.reflect.Method.invoke(Method.java:566)
	at org.junit.runners.model.FrameworkMethod$1.runReflectiveCall(FrameworkMethod.java:50)
	at org.junit.internal.runners.model.ReflectiveCallable.run(ReflectiveCallable.java:12)
	at org.junit.runners.model.FrameworkMethod.invokeExplosively(FrameworkMethod.java:47)
	at org.junit.internal.runners.statements.InvokeMethod.evaluate(InvokeMethod.java:17)
	at org.junit.runners.ParentRunner.runLeaf(ParentRunner.java:325)
	at org.junit.runners.BlockJUnit4ClassRunner.runChild(BlockJUnit4ClassRunner.java:78)
	at org.junit.runners.BlockJUnit4ClassRunner.runChild(BlockJUnit4ClassRunner.java:57)
	at org.junit.runners.ParentRunner$3.run(ParentRunner.java:290)
	at org.junit.runners.ParentRunner$1.schedule(ParentRunner.java:71)
	at org.junit.runners.ParentRunner.runChildren(ParentRunner.java:288)
	at org.junit.runners.ParentRunner.access$000(ParentRunner.java:58)
	at org.junit.runners.ParentRunner$2.evaluate(ParentRunner.java:268)
	at org.junit.runners.ParentRunner.run(ParentRunner.java:363)
	at org.apache.maven.surefire.junit4.JUnit4Provider.execute(JUnit4Provider.java:344)
	at org.apache.maven.surefire.junit4.JUnit4Provider.executeWithRerun(JUnit4Provider.java:269)
	at org.apache.maven.surefire.junit4.JUnit4Provider.executeTestSet(JUnit4Provider.java:240)
	at org.apache.maven.surefire.junit4.JUnit4Provider.invoke(JUnit4Provider.java:184)
	at org.apache.maven.surefire.booter.ForkedBooter.invokeProviderInSameClassLoader(ForkedBooter.java:286)
	at org.apache.maven.surefire.booter.ForkedBooter.runSuitesInProcess(ForkedBooter.java:240)
	at org.apache.maven.surefire.booter.ForkedBooter.main(ForkedBooter.java:121)
Caused by: java.lang.RuntimeException: No lang found for label txt
	at org.aksw.jena_sparql_api.rx.RDFLanguagesEx.lambda$findLang$6(RDFLanguagesEx.java:209)
	at java.base/java.util.Optional.orElseThrow(Optional.java:408)
	at org.aksw.jena_sparql_api.rx.RDFLanguagesEx.findLang(RDFLanguagesEx.java:209)
	at org.aksw.sparql_binding_stream.cli.main.SbsCmdImpls.query(SbsCmdImpls.java:201)
	at org.aksw.sparql_binding_stream.cli.cmd.CmdSbsMap.call(CmdSbsMap.java:37)
	at org.aksw.sparql_binding_stream.cli.cmd.CmdSbsMap.call(CmdSbsMap.java:13)
	at picocli.CommandLine.executeUserObject(CommandLine.java:1953)
	at picocli.CommandLine.access$1300(CommandLine.java:145)
	at picocli.CommandLine$RunLast.executeUserObjectOfLastSubcommandWithSameParent(CommandLine.java:2358)
	at picocli.CommandLine$RunLast.handle(CommandLine.java:2352)
	at picocli.CommandLine$RunLast.handle(CommandLine.java:2314)
	at picocli.CommandLine$AbstractParseResultHandler.execute(CommandLine.java:2179)
	at picocli.CommandLine$RunLast.execute(CommandLine.java:2316)
	at picocli.CommandLine.execute(CommandLine.java:2078)
	... 27 more
java.lang.RuntimeException: java.lang.RuntimeException: No lang found for label txt
	at org.aksw.commons.util.exception.ExceptionUtilsAksw.rethrowUnless(ExceptionUtilsAksw.java:40)
	at org.aksw.commons.util.exception.ExceptionUtilsAksw.rethrowIfNotBrokenPipe(ExceptionUtilsAksw.java:81)
	at org.aksw.rdf_processing_toolkit.cli.cmd.CmdUtils.lambda$callCmd$0(CmdUtils.java:69)
	at picocli.CommandLine.execute(CommandLine.java:2088)
	at org.aksw.rdf_processing_toolkit.cli.cmd.CmdUtils.callCmd(CmdUtils.java:75)
	at org.aksw.rdf_processing_toolkit.cli.cmd.CmdUtils.callCmd(CmdUtils.java:39)
	at org.aksw.sparql_integrate.ngs.cli.main.TestSparqlBindingStreamOperators.test1(TestSparqlBindingStreamOperators.java:17)
	at java.base/jdk.internal.reflect.NativeMethodAccessorImpl.invoke0(Native Method)
	at java.base/jdk.internal.reflect.NativeMethodAccessorImpl.invoke(NativeMethodAccessorImpl.java:62)
	at java.base/jdk.internal.reflect.DelegatingMethodAccessorImpl.invoke(DelegatingMethodAccessorImpl.java:43)
	at java.base/java.lang.reflect.Method.invoke(Method.java:566)
	at org.junit.runners.model.FrameworkMethod$1.runReflectiveCall(FrameworkMethod.java:50)
	at org.junit.internal.runners.model.ReflectiveCallable.run(ReflectiveCallable.java:12)
	at org.junit.runners.model.FrameworkMethod.invokeExplosively(FrameworkMethod.java:47)
	at org.junit.internal.runners.statements.InvokeMethod.evaluate(InvokeMethod.java:17)
	at org.junit.runners.ParentRunner.runLeaf(ParentRunner.java:325)
	at org.junit.runners.BlockJUnit4ClassRunner.runChild(BlockJUnit4ClassRunner.java:78)
	at org.junit.runners.BlockJUnit4ClassRunner.runChild(BlockJUnit4ClassRunner.java:57)
	at org.junit.runners.ParentRunner$3.run(ParentRunner.java:290)
	at org.junit.runners.ParentRunner$1.schedule(ParentRunner.java:71)
	at org.junit.runners.ParentRunner.runChildren(ParentRunner.java:288)
	at org.junit.runners.ParentRunner.access$000(ParentRunner.java:58)
	at org.junit.runners.ParentRunner$2.evaluate(ParentRunner.java:268)
	at org.junit.runners.ParentRunner.run(ParentRunner.java:363)
	at org.apache.maven.surefire.junit4.JUnit4Provider.execute(JUnit4Provider.java:344)
	at org.apache.maven.surefire.junit4.JUnit4Provider.executeWithRerun(JUnit4Provider.java:269)
	at org.apache.maven.surefire.junit4.JUnit4Provider.executeTestSet(JUnit4Provider.java:240)
	at org.apache.maven.surefire.junit4.JUnit4Provider.invoke(JUnit4Provider.java:184)
	at org.apache.maven.surefire.booter.ForkedBooter.invokeProviderInSameClassLoader(ForkedBooter.java:286)
	at org.apache.maven.surefire.booter.ForkedBooter.runSuitesInProcess(ForkedBooter.java:240)
	at org.apache.maven.surefire.booter.ForkedBooter.main(ForkedBooter.java:121)
Caused by: java.lang.RuntimeException: No lang found for label txt
	at org.aksw.jena_sparql_api.rx.RDFLanguagesEx.lambda$findLang$6(RDFLanguagesEx.java:209)
	at java.base/java.util.Optional.orElseThrow(Optional.java:408)
	at org.aksw.jena_sparql_api.rx.RDFLanguagesEx.findLang(RDFLanguagesEx.java:209)
	at org.aksw.sparql_binding_stream.cli.main.SbsCmdImpls.query(SbsCmdImpls.java:201)
	at org.aksw.sparql_binding_stream.cli.cmd.CmdSbsMap.call(CmdSbsMap.java:37)
	at org.aksw.sparql_binding_stream.cli.cmd.CmdSbsMap.call(CmdSbsMap.java:13)
	at picocli.CommandLine.executeUserObject(CommandLine.java:1953)
	at picocli.CommandLine.access$1300(CommandLine.java:145)
	at picocli.CommandLine$RunLast.executeUserObjectOfLastSubcommandWithSameParent(CommandLine.java:2358)
	at picocli.CommandLine$RunLast.handle(CommandLine.java:2352)
	at picocli.CommandLine$RunLast.handle(CommandLine.java:2314)
	at picocli.CommandLine$AbstractParseResultHandler.execute(CommandLine.java:2179)
	at picocli.CommandLine$RunLast.execute(CommandLine.java:2316)
	at picocli.CommandLine.execute(CommandLine.java:2078)
	... 27 more
java.lang.RuntimeException: java.lang.RuntimeException: No lang found for label txt
	at org.aksw.commons.util.exception.ExceptionUtilsAksw.rethrowUnless(ExceptionUtilsAksw.java:40)
	at org.aksw.commons.util.exception.ExceptionUtilsAksw.rethrowIfNotBrokenPipe(ExceptionUtilsAksw.java:81)
	at org.aksw.rdf_processing_toolkit.cli.cmd.CmdUtils.lambda$callCmd$0(CmdUtils.java:69)
	at picocli.CommandLine.execute(CommandLine.java:2088)
	at org.aksw.rdf_processing_toolkit.cli.cmd.CmdUtils.callCmd(CmdUtils.java:75)
	at org.aksw.rdf_processing_toolkit.cli.cmd.CmdUtils.callCmd(CmdUtils.java:39)
	at org.aksw.sparql_integrate.ngs.cli.main.TestSparqlBindingStreamOperators.test1(TestSparqlBindingStreamOperators.java:18)
	at java.base/jdk.internal.reflect.NativeMethodAccessorImpl.invoke0(Native Method)
	at java.base/jdk.internal.reflect.NativeMethodAccessorImpl.invoke(NativeMethodAccessorImpl.java:62)
	at java.base/jdk.internal.reflect.DelegatingMethodAccessorImpl.invoke(DelegatingMethodAccessorImpl.java:43)
	at java.base/java.lang.reflect.Method.invoke(Method.java:566)
	at org.junit.runners.model.FrameworkMethod$1.runReflectiveCall(FrameworkMethod.java:50)
	at org.junit.internal.runners.model.ReflectiveCallable.run(ReflectiveCallable.java:12)
	at org.junit.runners.model.FrameworkMethod.invokeExplosively(FrameworkMethod.java:47)
	at org.junit.internal.runners.statements.InvokeMethod.evaluate(InvokeMethod.java:17)
	at org.junit.runners.ParentRunner.runLeaf(ParentRunner.java:325)
	at org.junit.runners.BlockJUnit4ClassRunner.runChild(BlockJUnit4ClassRunner.java:78)
	at org.junit.runners.BlockJUnit4ClassRunner.runChild(BlockJUnit4ClassRunner.java:57)
	at org.junit.runners.ParentRunner$3.run(ParentRunner.java:290)
	at org.junit.runners.ParentRunner$1.schedule(ParentRunner.java:71)
	at org.junit.runners.ParentRunner.runChildren(ParentRunner.java:288)
	at org.junit.runners.ParentRunner.access$000(ParentRunner.java:58)
	at org.junit.runners.ParentRunner$2.evaluate(ParentRunner.java:268)
	at org.junit.runners.ParentRunner.run(ParentRunner.java:363)
	at org.apache.maven.surefire.junit4.JUnit4Provider.execute(JUnit4Provider.java:344)
	at org.apache.maven.surefire.junit4.JUnit4Provider.executeWithRerun(JUnit4Provider.java:269)
	at org.apache.maven.surefire.junit4.JUnit4Provider.executeTestSet(JUnit4Provider.java:240)
	at org.apache.maven.surefire.junit4.JUnit4Provider.invoke(JUnit4Provider.java:184)
	at org.apache.maven.surefire.booter.ForkedBooter.invokeProviderInSameClassLoader(ForkedBooter.java:286)
	at org.apache.maven.surefire.booter.ForkedBooter.runSuitesInProcess(ForkedBooter.java:240)
	at org.apache.maven.surefire.booter.ForkedBooter.main(ForkedBooter.java:121)
Caused by: java.lang.RuntimeException: No lang found for label txt
	at org.aksw.jena_sparql_api.rx.RDFLanguagesEx.lambda$findLang$6(RDFLanguagesEx.java:209)
	at java.base/java.util.Optional.orElseThrow(Optional.java:408)
	at org.aksw.jena_sparql_api.rx.RDFLanguagesEx.findLang(RDFLanguagesEx.java:209)
	at org.aksw.sparql_binding_stream.cli.main.SbsCmdImpls.query(SbsCmdImpls.java:201)
	at org.aksw.sparql_binding_stream.cli.cmd.CmdSbsMap.call(CmdSbsMap.java:37)
	at org.aksw.sparql_binding_stream.cli.cmd.CmdSbsMap.call(CmdSbsMap.java:13)
	at picocli.CommandLine.executeUserObject(CommandLine.java:1953)
	at picocli.CommandLine.access$1300(CommandLine.java:145)
	at picocli.CommandLine$RunLast.executeUserObjectOfLastSubcommandWithSameParent(CommandLine.java:2358)
	at picocli.CommandLine$RunLast.handle(CommandLine.java:2352)
	at picocli.CommandLine$RunLast.handle(CommandLine.java:2314)
	at picocli.CommandLine$AbstractParseResultHandler.execute(CommandLine.java:2179)
	at picocli.CommandLine$RunLast.execute(CommandLine.java:2316)
	at picocli.CommandLine.execute(CommandLine.java:2078)
	... 27 more
java.lang.RuntimeException: java.lang.RuntimeException: No lang found for label txt
	at org.aksw.commons.util.exception.ExceptionUtilsAksw.rethrowUnless(ExceptionUtilsAksw.java:40)
	at org.aksw.commons.util.exception.ExceptionUtilsAksw.rethrowIfNotBrokenPipe(ExceptionUtilsAksw.java:81)
	at org.aksw.rdf_processing_toolkit.cli.cmd.CmdUtils.lambda$callCmd$0(CmdUtils.java:69)
	at picocli.CommandLine.execute(CommandLine.java:2088)
	at org.aksw.rdf_processing_toolkit.cli.cmd.CmdUtils.callCmd(CmdUtils.java:75)
	at org.aksw.rdf_processing_toolkit.cli.cmd.CmdUtils.callCmd(CmdUtils.java:39)
	at org.aksw.sparql_integrate.ngs.cli.main.TestSparqlBindingStreamOperators.test1(TestSparqlBindingStreamOperators.java:20)
	at java.base/jdk.internal.reflect.NativeMethodAccessorImpl.invoke0(Native Method)
	at java.base/jdk.internal.reflect.NativeMethodAccessorImpl.invoke(NativeMethodAccessorImpl.java:62)
	at java.base/jdk.internal.reflect.DelegatingMethodAccessorImpl.invoke(DelegatingMethodAccessorImpl.java:43)
	at java.base/java.lang.reflect.Method.invoke(Method.java:566)
	at org.junit.runners.model.FrameworkMethod$1.runReflectiveCall(FrameworkMethod.java:50)
	at org.junit.internal.runners.model.ReflectiveCallable.run(ReflectiveCallable.java:12)
	at org.junit.runners.model.FrameworkMethod.invokeExplosively(FrameworkMethod.java:47)
	at org.junit.internal.runners.statements.InvokeMethod.evaluate(InvokeMethod.java:17)
	at org.junit.runners.ParentRunner.runLeaf(ParentRunner.java:325)
	at org.junit.runners.BlockJUnit4ClassRunner.runChild(BlockJUnit4ClassRunner.java:78)
	at org.junit.runners.BlockJUnit4ClassRunner.runChild(BlockJUnit4ClassRunner.java:57)
	at org.junit.runners.ParentRunner$3.run(ParentRunner.java:290)
	at org.junit.runners.ParentRunner$1.schedule(ParentRunner.java:71)
	at org.junit.runners.ParentRunner.runChildren(ParentRunner.java:288)
	at org.junit.runners.ParentRunner.access$000(ParentRunner.java:58)
	at org.junit.runners.ParentRunner$2.evaluate(ParentRunner.java:268)
	at org.junit.runners.ParentRunner.run(ParentRunner.java:363)
	at org.apache.maven.surefire.junit4.JUnit4Provider.execute(JUnit4Provider.java:344)
	at org.apache.maven.surefire.junit4.JUnit4Provider.executeWithRerun(JUnit4Provider.java:269)
	at org.apache.maven.surefire.junit4.JUnit4Provider.executeTestSet(JUnit4Provider.java:240)
	at org.apache.maven.surefire.junit4.JUnit4Provider.invoke(JUnit4Provider.java:184)
	at org.apache.maven.surefire.booter.ForkedBooter.invokeProviderInSameClassLoader(ForkedBooter.java:286)
	at org.apache.maven.surefire.booter.ForkedBooter.runSuitesInProcess(ForkedBooter.java:240)
	at org.apache.maven.surefire.booter.ForkedBooter.main(ForkedBooter.java:121)
Caused by: java.lang.RuntimeException: No lang found for label txt
	at org.aksw.jena_sparql_api.rx.RDFLanguagesEx.lambda$findLang$6(RDFLanguagesEx.java:209)
	at java.base/java.util.Optional.orElseThrow(Optional.java:408)
	at org.aksw.jena_sparql_api.rx.RDFLanguagesEx.findLang(RDFLanguagesEx.java:209)
	at org.aksw.sparql_binding_stream.cli.main.SbsCmdImpls.query(SbsCmdImpls.java:201)
	at org.aksw.sparql_binding_stream.cli.cmd.CmdSbsMap.call(CmdSbsMap.java:37)
	at org.aksw.sparql_binding_stream.cli.cmd.CmdSbsMap.call(CmdSbsMap.java:13)
	at picocli.CommandLine.executeUserObject(CommandLine.java:1953)
	at picocli.CommandLine.access$1300(CommandLine.java:145)
	at picocli.CommandLine$RunLast.executeUserObjectOfLastSubcommandWithSameParent(CommandLine.java:2358)
	at picocli.CommandLine$RunLast.handle(CommandLine.java:2352)
	at picocli.CommandLine$RunLast.handle(CommandLine.java:2314)
	at picocli.CommandLine$AbstractParseResultHandler.execute(CommandLine.java:2179)
	at picocli.CommandLine$RunLast.execute(CommandLine.java:2316)
	at picocli.CommandLine.execute(CommandLine.java:2078)
	... 27 more
Tests run: 1, Failures: 0, Errors: 0, Skipped: 0, Time elapsed: 6.018 sec - in org.aksw.sparql_integrate.ngs.cli.main.TestSparqlBindingStreamOperators

Results :

Tests run: 2, Failures: 0, Errors: 0, Skipped: 0

[JENKINS] Recording test results
[INFO] 
[INFO] --- maven-jar-plugin:2.4:jar (default-jar) @ rdf-processing-toolkit-cli ---
[INFO] Building jar: /usr/share/tomcat8/.jenkins/jobs/RDF-Processing-Toolkit/workspace/rdf-processing-toolkit-cli/target/rdf-processing-toolkit-cli-1.9.1-SNAPSHOT.jar
[INFO] 
[INFO] --- maven-javadoc-plugin:2.9.1:jar (attach-javadocs) @ rdf-processing-toolkit-cli ---
[INFO] 
Loading source file /usr/share/tomcat8/.jenkins/jobs/RDF-Processing-Toolkit/workspace/rdf-processing-toolkit-cli/src/main/java/sbs.java...
Loading source file /usr/share/tomcat8/.jenkins/jobs/RDF-Processing-Toolkit/workspace/rdf-processing-toolkit-cli/src/main/java/rpt.java...
Loading source file /usr/share/tomcat8/.jenkins/jobs/RDF-Processing-Toolkit/workspace/rdf-processing-toolkit-cli/src/main/java/ngs.java...
Loading source file /usr/share/tomcat8/.jenkins/jobs/RDF-Processing-Toolkit/workspace/rdf-processing-toolkit-cli/src/main/java/integrate.java...
Loading source files for package org.aksw.named_graph_stream.cli.main...
Loading source files for package org.aksw.named_graph_stream.cli.cmd...
Loading source files for package org.aksw.sparql_integrate.cli...
Loading source files for package org.aksw.sparql_integrate.cli.main...
Loading source files for package org.aksw.sparql_integrate.cli.cmd...
Loading source files for package org.aksw.rdf_processing_toolkit.cli.main...
Loading source files for package org.aksw.rdf_processing_toolkit.cli.cmd...
Loading source files for package org.aksw.jena_sparql_api.rx.op.api...
Loading source files for package org.aksw.sparql_binding_stream.cli.main...
Loading source files for package org.aksw.sparql_binding_stream.cli.cmd...
Constructing Javadoc information...
Standard Doclet version 11.0.13
Building tree for all the packages and classes...
Generating /usr/share/tomcat8/.jenkins/jobs/RDF-Processing-Toolkit/workspace/rdf-processing-toolkit-cli/target/apidocs/integrate.html...
Generating /usr/share/tomcat8/.jenkins/jobs/RDF-Processing-Toolkit/workspace/rdf-processing-toolkit-cli/target/apidocs/ngs.html...
Generating /usr/share/tomcat8/.jenkins/jobs/RDF-Processing-Toolkit/workspace/rdf-processing-toolkit-cli/target/apidocs/rpt.html...
Generating /usr/share/tomcat8/.jenkins/jobs/RDF-Processing-Toolkit/workspace/rdf-processing-toolkit-cli/target/apidocs/sbs.html...
Generating /usr/share/tomcat8/.jenkins/jobs/RDF-Processing-Toolkit/workspace/rdf-processing-toolkit-cli/target/apidocs/org/aksw/jena_sparql_api/rx/op/api/OpConfigSort.html...
Generating /usr/share/tomcat8/.jenkins/jobs/RDF-Processing-Toolkit/workspace/rdf-processing-toolkit-cli/target/apidocs/org/aksw/named_graph_stream/cli/cmd/CmdNgJoin.html...
Generating /usr/share/tomcat8/.jenkins/jobs/RDF-Processing-Toolkit/workspace/rdf-processing-toolkit-cli/target/apidocs/org/aksw/named_graph_stream/cli/cmd/CmdNgsCat.html...
Generating /usr/share/tomcat8/.jenkins/jobs/RDF-Processing-Toolkit/workspace/rdf-processing-toolkit-cli/target/apidocs/org/aksw/named_graph_stream/cli/cmd/CmdNgsFilter.html...
Generating /usr/share/tomcat8/.jenkins/jobs/RDF-Processing-Toolkit/workspace/rdf-processing-toolkit-cli/target/apidocs/org/aksw/named_graph_stream/cli/cmd/CmdNgsGit.html...
Generating /usr/share/tomcat8/.jenkins/jobs/RDF-Processing-Toolkit/workspace/rdf-processing-toolkit-cli/target/apidocs/org/aksw/named_graph_stream/cli/cmd/CmdNgsHead.html...
Generating /usr/share/tomcat8/.jenkins/jobs/RDF-Processing-Toolkit/workspace/rdf-processing-toolkit-cli/target/apidocs/org/aksw/named_graph_stream/cli/cmd/CmdNgsMain.html...
Generating /usr/share/tomcat8/.jenkins/jobs/RDF-Processing-Toolkit/workspace/rdf-processing-toolkit-cli/target/apidocs/org/aksw/named_graph_stream/cli/cmd/CmdNgsMap.html...
Generating /usr/share/tomcat8/.jenkins/jobs/RDF-Processing-Toolkit/workspace/rdf-processing-toolkit-cli/target/apidocs/org/aksw/named_graph_stream/cli/cmd/CmdNgsMap.MapSpec.html...
Generating /usr/share/tomcat8/.jenkins/jobs/RDF-Processing-Toolkit/workspace/rdf-processing-toolkit-cli/target/apidocs/org/aksw/named_graph_stream/cli/cmd/CmdNgsMerge.html...
Generating /usr/share/tomcat8/.jenkins/jobs/RDF-Processing-Toolkit/workspace/rdf-processing-toolkit-cli/target/apidocs/org/aksw/named_graph_stream/cli/cmd/CmdNgsProbe.html...
Generating /usr/share/tomcat8/.jenkins/jobs/RDF-Processing-Toolkit/workspace/rdf-processing-toolkit-cli/target/apidocs/org/aksw/named_graph_stream/cli/cmd/CmdNgsSort.html...
Generating /usr/share/tomcat8/.jenkins/jobs/RDF-Processing-Toolkit/workspace/rdf-processing-toolkit-cli/target/apidocs/org/aksw/named_graph_stream/cli/cmd/CmdNgsSubjects.html...
Generating /usr/share/tomcat8/.jenkins/jobs/RDF-Processing-Toolkit/workspace/rdf-processing-toolkit-cli/target/apidocs/org/aksw/named_graph_stream/cli/cmd/CmdNgsTail.html...
Generating /usr/share/tomcat8/.jenkins/jobs/RDF-Processing-Toolkit/workspace/rdf-processing-toolkit-cli/target/apidocs/org/aksw/named_graph_stream/cli/cmd/CmdNgsUntil.html...
Generating /usr/share/tomcat8/.jenkins/jobs/RDF-Processing-Toolkit/workspace/rdf-processing-toolkit-cli/target/apidocs/org/aksw/named_graph_stream/cli/cmd/CmdNgsWc.html...
Generating /usr/share/tomcat8/.jenkins/jobs/RDF-Processing-Toolkit/workspace/rdf-processing-toolkit-cli/target/apidocs/org/aksw/named_graph_stream/cli/cmd/CmdNgsWhile.html...
Generating /usr/share/tomcat8/.jenkins/jobs/RDF-Processing-Toolkit/workspace/rdf-processing-toolkit-cli/target/apidocs/org/aksw/named_graph_stream/cli/cmd/IParameterConsumerFlaggedLong.html...
Generating /usr/share/tomcat8/.jenkins/jobs/RDF-Processing-Toolkit/workspace/rdf-processing-toolkit-cli/target/apidocs/org/aksw/named_graph_stream/cli/main/DatasetFlowOps.html...
Generating /usr/share/tomcat8/.jenkins/jobs/RDF-Processing-Toolkit/workspace/rdf-processing-toolkit-cli/target/apidocs/org/aksw/named_graph_stream/cli/main/MainCliNamedGraphStream.html...
Generating /usr/share/tomcat8/.jenkins/jobs/RDF-Processing-Toolkit/workspace/rdf-processing-toolkit-cli/target/apidocs/org/aksw/named_graph_stream/cli/main/MainPlaygroundScanTrig.html...
Generating /usr/share/tomcat8/.jenkins/jobs/RDF-Processing-Toolkit/workspace/rdf-processing-toolkit-cli/target/apidocs/org/aksw/named_graph_stream/cli/main/NamedGraphFluent.html...
Generating /usr/share/tomcat8/.jenkins/jobs/RDF-Processing-Toolkit/workspace/rdf-processing-toolkit-cli/target/apidocs/org/aksw/named_graph_stream/cli/main/NamedGraphStreamOps.html...
Generating /usr/share/tomcat8/.jenkins/jobs/RDF-Processing-Toolkit/workspace/rdf-processing-toolkit-cli/target/apidocs/org/aksw/named_graph_stream/cli/main/NgsCmdImpls.html...
Generating /usr/share/tomcat8/.jenkins/jobs/RDF-Processing-Toolkit/workspace/rdf-processing-toolkit-cli/target/apidocs/org/aksw/named_graph_stream/cli/main/NgsGitCmdImpls.html...
Generating /usr/share/tomcat8/.jenkins/jobs/RDF-Processing-Toolkit/workspace/rdf-processing-toolkit-cli/target/apidocs/org/aksw/named_graph_stream/cli/main/QueryEvaluatorForTuple.html...
Generating /usr/share/tomcat8/.jenkins/jobs/RDF-Processing-Toolkit/workspace/rdf-processing-toolkit-cli/target/apidocs/org/aksw/rdf_processing_toolkit/cli/cmd/CliUtils.html...
Generating /usr/share/tomcat8/.jenkins/jobs/RDF-Processing-Toolkit/workspace/rdf-processing-toolkit-cli/target/apidocs/org/aksw/rdf_processing_toolkit/cli/cmd/CmdCommonBase.html...
Generating /usr/share/tomcat8/.jenkins/jobs/RDF-Processing-Toolkit/workspace/rdf-processing-toolkit-cli/target/apidocs/org/aksw/rdf_processing_toolkit/cli/cmd/CmdRptMain.html...
Generating /usr/share/tomcat8/.jenkins/jobs/RDF-Processing-Toolkit/workspace/rdf-processing-toolkit-cli/target/apidocs/org/aksw/rdf_processing_toolkit/cli/cmd/CmdUtils.html...
Generating /usr/share/tomcat8/.jenkins/jobs/RDF-Processing-Toolkit/workspace/rdf-processing-toolkit-cli/target/apidocs/org/aksw/rdf_processing_toolkit/cli/cmd/HasDebugMode.html...
Generating /usr/share/tomcat8/.jenkins/jobs/RDF-Processing-Toolkit/workspace/rdf-processing-toolkit-cli/target/apidocs/org/aksw/rdf_processing_toolkit/cli/cmd/VersionProviderFromClasspathProperties.html...
Generating /usr/share/tomcat8/.jenkins/jobs/RDF-Processing-Toolkit/workspace/rdf-processing-toolkit-cli/target/apidocs/org/aksw/rdf_processing_toolkit/cli/cmd/VersionProviderRdfProcessingToolkit.html...
Generating /usr/share/tomcat8/.jenkins/jobs/RDF-Processing-Toolkit/workspace/rdf-processing-toolkit-cli/target/apidocs/org/aksw/rdf_processing_toolkit/cli/main/MainCliRdfProcessingToolkit.html...
Generating /usr/share/tomcat8/.jenkins/jobs/RDF-Processing-Toolkit/workspace/rdf-processing-toolkit-cli/target/apidocs/org/aksw/sparql_binding_stream/cli/cmd/CmdSbsFilter.html...
Generating /usr/share/tomcat8/.jenkins/jobs/RDF-Processing-Toolkit/workspace/rdf-processing-toolkit-cli/target/apidocs/org/aksw/sparql_binding_stream/cli/cmd/CmdSbsMain.html...
Generating /usr/share/tomcat8/.jenkins/jobs/RDF-Processing-Toolkit/workspace/rdf-processing-toolkit-cli/target/apidocs/org/aksw/sparql_binding_stream/cli/cmd/CmdSbsMap.html...
Generating /usr/share/tomcat8/.jenkins/jobs/RDF-Processing-Toolkit/workspace/rdf-processing-toolkit-cli/target/apidocs/org/aksw/sparql_binding_stream/cli/cmd/CmdSbsSplit.html...
Generating /usr/share/tomcat8/.jenkins/jobs/RDF-Processing-Toolkit/workspace/rdf-processing-toolkit-cli/target/apidocs/org/aksw/sparql_binding_stream/cli/main/MainCliSparqlBindingStream.html...
Generating /usr/share/tomcat8/.jenkins/jobs/RDF-Processing-Toolkit/workspace/rdf-processing-toolkit-cli/target/apidocs/org/aksw/sparql_binding_stream/cli/main/SbsCmdImpls.html...
Generating /usr/share/tomcat8/.jenkins/jobs/RDF-Processing-Toolkit/workspace/rdf-processing-toolkit-cli/target/apidocs/org/aksw/sparql_integrate/cli/CommandMain.html...
Generating /usr/share/tomcat8/.jenkins/jobs/RDF-Processing-Toolkit/workspace/rdf-processing-toolkit-cli/target/apidocs/org/aksw/sparql_integrate/cli/DerbyUtil.html...
Generating /usr/share/tomcat8/.jenkins/jobs/RDF-Processing-Toolkit/workspace/rdf-processing-toolkit-cli/target/apidocs/org/aksw/sparql_integrate/cli/MainCliSparqlIntegrateOld.html...
Generating /usr/share/tomcat8/.jenkins/jobs/RDF-Processing-Toolkit/workspace/rdf-processing-toolkit-cli/target/apidocs/org/aksw/sparql_integrate/cli/MainCliSparqlLoad.html...
Generating /usr/share/tomcat8/.jenkins/jobs/RDF-Processing-Toolkit/workspace/rdf-processing-toolkit-cli/target/apidocs/org/aksw/sparql_integrate/cli/SparqlStmtProcessor.html...
Generating /usr/share/tomcat8/.jenkins/jobs/RDF-Processing-Toolkit/workspace/rdf-processing-toolkit-cli/target/apidocs/org/aksw/sparql_integrate/cli/cmd/CmdSparqlIntegrateMain.html...
Generating /usr/share/tomcat8/.jenkins/jobs/RDF-Processing-Toolkit/workspace/rdf-processing-toolkit-cli/target/apidocs/org/aksw/sparql_integrate/cli/cmd/CmdSparqlIntegrateMain.OutputSpec.html...
Generating /usr/share/tomcat8/.jenkins/jobs/RDF-Processing-Toolkit/workspace/rdf-processing-toolkit-cli/target/apidocs/org/aksw/sparql_integrate/cli/main/MainCliSparqlIntegrate.html...
Generating /usr/share/tomcat8/.jenkins/jobs/RDF-Processing-Toolkit/workspace/rdf-processing-toolkit-cli/target/apidocs/org/aksw/sparql_integrate/cli/main/SparqlIntegrateCmdImpls.html...
Generating /usr/share/tomcat8/.jenkins/jobs/RDF-Processing-Toolkit/workspace/rdf-processing-toolkit-cli/target/apidocs/org/aksw/sparql_integrate/cli/main/SparqlIntegrateLegacyDataSources.html...
Generating /usr/share/tomcat8/.jenkins/jobs/RDF-Processing-Toolkit/workspace/rdf-processing-toolkit-cli/target/apidocs/package-summary.html...
Generating /usr/share/tomcat8/.jenkins/jobs/RDF-Processing-Toolkit/workspace/rdf-processing-toolkit-cli/target/apidocs/package-tree.html...
Generating /usr/share/tomcat8/.jenkins/jobs/RDF-Processing-Toolkit/workspace/rdf-processing-toolkit-cli/target/apidocs/org/aksw/jena_sparql_api/rx/op/api/package-summary.html...
Generating /usr/share/tomcat8/.jenkins/jobs/RDF-Processing-Toolkit/workspace/rdf-processing-toolkit-cli/target/apidocs/org/aksw/jena_sparql_api/rx/op/api/package-tree.html...
Generating /usr/share/tomcat8/.jenkins/jobs/RDF-Processing-Toolkit/workspace/rdf-processing-toolkit-cli/target/apidocs/org/aksw/named_graph_stream/cli/cmd/package-summary.html...
Generating /usr/share/tomcat8/.jenkins/jobs/RDF-Processing-Toolkit/workspace/rdf-processing-toolkit-cli/target/apidocs/org/aksw/named_graph_stream/cli/cmd/package-tree.html...
Generating /usr/share/tomcat8/.jenkins/jobs/RDF-Processing-Toolkit/workspace/rdf-processing-toolkit-cli/target/apidocs/org/aksw/named_graph_stream/cli/main/package-summary.html...
Generating /usr/share/tomcat8/.jenkins/jobs/RDF-Processing-Toolkit/workspace/rdf-processing-toolkit-cli/target/apidocs/org/aksw/named_graph_stream/cli/main/package-tree.html...
Generating /usr/share/tomcat8/.jenkins/jobs/RDF-Processing-Toolkit/workspace/rdf-processing-toolkit-cli/target/apidocs/org/aksw/rdf_processing_toolkit/cli/cmd/package-summary.html...
Generating /usr/share/tomcat8/.jenkins/jobs/RDF-Processing-Toolkit/workspace/rdf-processing-toolkit-cli/target/apidocs/org/aksw/rdf_processing_toolkit/cli/cmd/package-tree.html...
Generating /usr/share/tomcat8/.jenkins/jobs/RDF-Processing-Toolkit/workspace/rdf-processing-toolkit-cli/target/apidocs/org/aksw/rdf_processing_toolkit/cli/main/package-summary.html...
Generating /usr/share/tomcat8/.jenkins/jobs/RDF-Processing-Toolkit/workspace/rdf-processing-toolkit-cli/target/apidocs/org/aksw/rdf_processing_toolkit/cli/main/package-tree.html...
Generating /usr/share/tomcat8/.jenkins/jobs/RDF-Processing-Toolkit/workspace/rdf-processing-toolkit-cli/target/apidocs/org/aksw/sparql_binding_stream/cli/cmd/package-summary.html...
Generating /usr/share/tomcat8/.jenkins/jobs/RDF-Processing-Toolkit/workspace/rdf-processing-toolkit-cli/target/apidocs/org/aksw/sparql_binding_stream/cli/cmd/package-tree.html...
Generating /usr/share/tomcat8/.jenkins/jobs/RDF-Processing-Toolkit/workspace/rdf-processing-toolkit-cli/target/apidocs/org/aksw/sparql_binding_stream/cli/main/package-summary.html...
Generating /usr/share/tomcat8/.jenkins/jobs/RDF-Processing-Toolkit/workspace/rdf-processing-toolkit-cli/target/apidocs/org/aksw/sparql_binding_stream/cli/main/package-tree.html...
Generating /usr/share/tomcat8/.jenkins/jobs/RDF-Processing-Toolkit/workspace/rdf-processing-toolkit-cli/target/apidocs/org/aksw/sparql_integrate/cli/package-summary.html...
Generating /usr/share/tomcat8/.jenkins/jobs/RDF-Processing-Toolkit/workspace/rdf-processing-toolkit-cli/target/apidocs/org/aksw/sparql_integrate/cli/package-tree.html...
Generating /usr/share/tomcat8/.jenkins/jobs/RDF-Processing-Toolkit/workspace/rdf-processing-toolkit-cli/target/apidocs/org/aksw/sparql_integrate/cli/cmd/package-summary.html...
Generating /usr/share/tomcat8/.jenkins/jobs/RDF-Processing-Toolkit/workspace/rdf-processing-toolkit-cli/target/apidocs/org/aksw/sparql_integrate/cli/cmd/package-tree.html...
Generating /usr/share/tomcat8/.jenkins/jobs/RDF-Processing-Toolkit/workspace/rdf-processing-toolkit-cli/target/apidocs/org/aksw/sparql_integrate/cli/main/package-summary.html...
Generating /usr/share/tomcat8/.jenkins/jobs/RDF-Processing-Toolkit/workspace/rdf-processing-toolkit-cli/target/apidocs/org/aksw/sparql_integrate/cli/main/package-tree.html...
Generating /usr/share/tomcat8/.jenkins/jobs/RDF-Processing-Toolkit/workspace/rdf-processing-toolkit-cli/target/apidocs/constant-values.html...
Generating /usr/share/tomcat8/.jenkins/jobs/RDF-Processing-Toolkit/workspace/rdf-processing-toolkit-cli/target/apidocs/org/aksw/named_graph_stream/cli/main/class-use/NgsGitCmdImpls.html...
Generating /usr/share/tomcat8/.jenkins/jobs/RDF-Processing-Toolkit/workspace/rdf-processing-toolkit-cli/target/apidocs/org/aksw/named_graph_stream/cli/main/class-use/QueryEvaluatorForTuple.html...
Generating /usr/share/tomcat8/.jenkins/jobs/RDF-Processing-Toolkit/workspace/rdf-processing-toolkit-cli/target/apidocs/org/aksw/named_graph_stream/cli/main/class-use/NamedGraphStreamOps.html...
Generating /usr/share/tomcat8/.jenkins/jobs/RDF-Processing-Toolkit/workspace/rdf-processing-toolkit-cli/target/apidocs/org/aksw/named_graph_stream/cli/main/class-use/NamedGraphFluent.html...
Generating /usr/share/tomcat8/.jenkins/jobs/RDF-Processing-Toolkit/workspace/rdf-processing-toolkit-cli/target/apidocs/org/aksw/named_graph_stream/cli/main/class-use/MainPlaygroundScanTrig.html...
Generating /usr/share/tomcat8/.jenkins/jobs/RDF-Processing-Toolkit/workspace/rdf-processing-toolkit-cli/target/apidocs/org/aksw/named_graph_stream/cli/main/class-use/NgsCmdImpls.html...
Generating /usr/share/tomcat8/.jenkins/jobs/RDF-Processing-Toolkit/workspace/rdf-processing-toolkit-cli/target/apidocs/org/aksw/named_graph_stream/cli/main/class-use/DatasetFlowOps.html...
Generating /usr/share/tomcat8/.jenkins/jobs/RDF-Processing-Toolkit/workspace/rdf-processing-toolkit-cli/target/apidocs/org/aksw/named_graph_stream/cli/main/class-use/MainCliNamedGraphStream.html...
Generating /usr/share/tomcat8/.jenkins/jobs/RDF-Processing-Toolkit/workspace/rdf-processing-toolkit-cli/target/apidocs/org/aksw/named_graph_stream/cli/cmd/class-use/CmdNgsWhile.html...
Generating /usr/share/tomcat8/.jenkins/jobs/RDF-Processing-Toolkit/workspace/rdf-processing-toolkit-cli/target/apidocs/org/aksw/named_graph_stream/cli/cmd/class-use/CmdNgJoin.html...
Generating /usr/share/tomcat8/.jenkins/jobs/RDF-Processing-Toolkit/workspace/rdf-processing-toolkit-cli/target/apidocs/org/aksw/named_graph_stream/cli/cmd/class-use/CmdNgsMain.html...
Generating /usr/share/tomcat8/.jenkins/jobs/RDF-Processing-Toolkit/workspace/rdf-processing-toolkit-cli/target/apidocs/org/aksw/named_graph_stream/cli/cmd/class-use/CmdNgsMerge.html...
Generating /usr/share/tomcat8/.jenkins/jobs/RDF-Processing-Toolkit/workspace/rdf-processing-toolkit-cli/target/apidocs/org/aksw/named_graph_stream/cli/cmd/class-use/CmdNgsMap.html...
Generating /usr/share/tomcat8/.jenkins/jobs/RDF-Processing-Toolkit/workspace/rdf-processing-toolkit-cli/target/apidocs/org/aksw/named_graph_stream/cli/cmd/class-use/CmdNgsMap.MapSpec.html...
Generating /usr/share/tomcat8/.jenkins/jobs/RDF-Processing-Toolkit/workspace/rdf-processing-toolkit-cli/target/apidocs/org/aksw/named_graph_stream/cli/cmd/class-use/IParameterConsumerFlaggedLong.html...
Generating /usr/share/tomcat8/.jenkins/jobs/RDF-Processing-Toolkit/workspace/rdf-processing-toolkit-cli/target/apidocs/org/aksw/named_graph_stream/cli/cmd/class-use/CmdNgsSubjects.html...
Generating /usr/share/tomcat8/.jenkins/jobs/RDF-Processing-Toolkit/workspace/rdf-processing-toolkit-cli/target/apidocs/org/aksw/named_graph_stream/cli/cmd/class-use/CmdNgsUntil.html...
Generating /usr/share/tomcat8/.jenkins/jobs/RDF-Processing-Toolkit/workspace/rdf-processing-toolkit-cli/target/apidocs/org/aksw/named_graph_stream/cli/cmd/class-use/CmdNgsTail.html...
Generating /usr/share/tomcat8/.jenkins/jobs/RDF-Processing-Toolkit/workspace/rdf-processing-toolkit-cli/target/apidocs/org/aksw/named_graph_stream/cli/cmd/class-use/CmdNgsCat.html...
Generating /usr/share/tomcat8/.jenkins/jobs/RDF-Processing-Toolkit/workspace/rdf-processing-toolkit-cli/target/apidocs/org/aksw/named_graph_stream/cli/cmd/class-use/CmdNgsWc.html...
Generating /usr/share/tomcat8/.jenkins/jobs/RDF-Processing-Toolkit/workspace/rdf-processing-toolkit-cli/target/apidocs/org/aksw/named_graph_stream/cli/cmd/class-use/CmdNgsProbe.html...
Generating /usr/share/tomcat8/.jenkins/jobs/RDF-Processing-Toolkit/workspace/rdf-processing-toolkit-cli/target/apidocs/org/aksw/named_graph_stream/cli/cmd/class-use/CmdNgsGit.html...
Generating /usr/share/tomcat8/.jenkins/jobs/RDF-Processing-Toolkit/workspace/rdf-processing-toolkit-cli/target/apidocs/org/aksw/named_graph_stream/cli/cmd/class-use/CmdNgsHead.html...
Generating /usr/share/tomcat8/.jenkins/jobs/RDF-Processing-Toolkit/workspace/rdf-processing-toolkit-cli/target/apidocs/org/aksw/named_graph_stream/cli/cmd/class-use/CmdNgsFilter.html...
Generating /usr/share/tomcat8/.jenkins/jobs/RDF-Processing-Toolkit/workspace/rdf-processing-toolkit-cli/target/apidocs/org/aksw/named_graph_stream/cli/cmd/class-use/CmdNgsSort.html...
Generating /usr/share/tomcat8/.jenkins/jobs/RDF-Processing-Toolkit/workspace/rdf-processing-toolkit-cli/target/apidocs/org/aksw/sparql_integrate/cli/class-use/DerbyUtil.html...
Generating /usr/share/tomcat8/.jenkins/jobs/RDF-Processing-Toolkit/workspace/rdf-processing-toolkit-cli/target/apidocs/org/aksw/sparql_integrate/cli/class-use/MainCliSparqlIntegrateOld.html...
Generating /usr/share/tomcat8/.jenkins/jobs/RDF-Processing-Toolkit/workspace/rdf-processing-toolkit-cli/target/apidocs/org/aksw/sparql_integrate/cli/class-use/SparqlStmtProcessor.html...
Generating /usr/share/tomcat8/.jenkins/jobs/RDF-Processing-Toolkit/workspace/rdf-processing-toolkit-cli/target/apidocs/org/aksw/sparql_integrate/cli/class-use/MainCliSparqlLoad.html...
Generating /usr/share/tomcat8/.jenkins/jobs/RDF-Processing-Toolkit/workspace/rdf-processing-toolkit-cli/target/apidocs/org/aksw/sparql_integrate/cli/class-use/CommandMain.html...
Generating /usr/share/tomcat8/.jenkins/jobs/RDF-Processing-Toolkit/workspace/rdf-processing-toolkit-cli/target/apidocs/org/aksw/sparql_integrate/cli/main/class-use/SparqlIntegrateLegacyDataSources.html...
Generating /usr/share/tomcat8/.jenkins/jobs/RDF-Processing-Toolkit/workspace/rdf-processing-toolkit-cli/target/apidocs/org/aksw/sparql_integrate/cli/main/class-use/MainCliSparqlIntegrate.html...
Generating /usr/share/tomcat8/.jenkins/jobs/RDF-Processing-Toolkit/workspace/rdf-processing-toolkit-cli/target/apidocs/org/aksw/sparql_integrate/cli/main/class-use/SparqlIntegrateCmdImpls.html...
Generating /usr/share/tomcat8/.jenkins/jobs/RDF-Processing-Toolkit/workspace/rdf-processing-toolkit-cli/target/apidocs/org/aksw/sparql_integrate/cli/cmd/class-use/CmdSparqlIntegrateMain.html...
Generating /usr/share/tomcat8/.jenkins/jobs/RDF-Processing-Toolkit/workspace/rdf-processing-toolkit-cli/target/apidocs/org/aksw/sparql_integrate/cli/cmd/class-use/CmdSparqlIntegrateMain.OutputSpec.html...
Generating /usr/share/tomcat8/.jenkins/jobs/RDF-Processing-Toolkit/workspace/rdf-processing-toolkit-cli/target/apidocs/org/aksw/rdf_processing_toolkit/cli/main/class-use/MainCliRdfProcessingToolkit.html...
Generating /usr/share/tomcat8/.jenkins/jobs/RDF-Processing-Toolkit/workspace/rdf-processing-toolkit-cli/target/apidocs/org/aksw/rdf_processing_toolkit/cli/cmd/class-use/HasDebugMode.html...
Generating /usr/share/tomcat8/.jenkins/jobs/RDF-Processing-Toolkit/workspace/rdf-processing-toolkit-cli/target/apidocs/org/aksw/rdf_processing_toolkit/cli/cmd/class-use/CmdCommonBase.html...
Generating /usr/share/tomcat8/.jenkins/jobs/RDF-Processing-Toolkit/workspace/rdf-processing-toolkit-cli/target/apidocs/org/aksw/rdf_processing_toolkit/cli/cmd/class-use/VersionProviderRdfProcessingToolkit.html...
Generating /usr/share/tomcat8/.jenkins/jobs/RDF-Processing-Toolkit/workspace/rdf-processing-toolkit-cli/target/apidocs/org/aksw/rdf_processing_toolkit/cli/cmd/class-use/CliUtils.html...
Generating /usr/share/tomcat8/.jenkins/jobs/RDF-Processing-Toolkit/workspace/rdf-processing-toolkit-cli/target/apidocs/org/aksw/rdf_processing_toolkit/cli/cmd/class-use/CmdUtils.html...
Generating /usr/share/tomcat8/.jenkins/jobs/RDF-Processing-Toolkit/workspace/rdf-processing-toolkit-cli/target/apidocs/org/aksw/rdf_processing_toolkit/cli/cmd/class-use/CmdRptMain.html...
Generating /usr/share/tomcat8/.jenkins/jobs/RDF-Processing-Toolkit/workspace/rdf-processing-toolkit-cli/target/apidocs/org/aksw/rdf_processing_toolkit/cli/cmd/class-use/VersionProviderFromClasspathProperties.html...
Generating /usr/share/tomcat8/.jenkins/jobs/RDF-Processing-Toolkit/workspace/rdf-processing-toolkit-cli/target/apidocs/org/aksw/jena_sparql_api/rx/op/api/class-use/OpConfigSort.html...
Generating /usr/share/tomcat8/.jenkins/jobs/RDF-Processing-Toolkit/workspace/rdf-processing-toolkit-cli/target/apidocs/org/aksw/sparql_binding_stream/cli/main/class-use/SbsCmdImpls.html...
Generating /usr/share/tomcat8/.jenkins/jobs/RDF-Processing-Toolkit/workspace/rdf-processing-toolkit-cli/target/apidocs/org/aksw/sparql_binding_stream/cli/main/class-use/MainCliSparqlBindingStream.html...
Generating /usr/share/tomcat8/.jenkins/jobs/RDF-Processing-Toolkit/workspace/rdf-processing-toolkit-cli/target/apidocs/org/aksw/sparql_binding_stream/cli/cmd/class-use/CmdSbsMain.html...
Generating /usr/share/tomcat8/.jenkins/jobs/RDF-Processing-Toolkit/workspace/rdf-processing-toolkit-cli/target/apidocs/org/aksw/sparql_binding_stream/cli/cmd/class-use/CmdSbsMap.html...
Generating /usr/share/tomcat8/.jenkins/jobs/RDF-Processing-Toolkit/workspace/rdf-processing-toolkit-cli/target/apidocs/org/aksw/sparql_binding_stream/cli/cmd/class-use/CmdSbsSplit.html...
Generating /usr/share/tomcat8/.jenkins/jobs/RDF-Processing-Toolkit/workspace/rdf-processing-toolkit-cli/target/apidocs/org/aksw/sparql_binding_stream/cli/cmd/class-use/CmdSbsFilter.html...
Generating /usr/share/tomcat8/.jenkins/jobs/RDF-Processing-Toolkit/workspace/rdf-processing-toolkit-cli/target/apidocs/class-use/sbs.html...
Generating /usr/share/tomcat8/.jenkins/jobs/RDF-Processing-Toolkit/workspace/rdf-processing-toolkit-cli/target/apidocs/class-use/rpt.html...
Generating /usr/share/tomcat8/.jenkins/jobs/RDF-Processing-Toolkit/workspace/rdf-processing-toolkit-cli/target/apidocs/class-use/ngs.html...
Generating /usr/share/tomcat8/.jenkins/jobs/RDF-Processing-Toolkit/workspace/rdf-processing-toolkit-cli/target/apidocs/class-use/integrate.html...
Generating /usr/share/tomcat8/.jenkins/jobs/RDF-Processing-Toolkit/workspace/rdf-processing-toolkit-cli/target/apidocs/package-use.html...
Generating /usr/share/tomcat8/.jenkins/jobs/RDF-Processing-Toolkit/workspace/rdf-processing-toolkit-cli/target/apidocs/org/aksw/jena_sparql_api/rx/op/api/package-use.html...
Generating /usr/share/tomcat8/.jenkins/jobs/RDF-Processing-Toolkit/workspace/rdf-processing-toolkit-cli/target/apidocs/org/aksw/named_graph_stream/cli/cmd/package-use.html...
Generating /usr/share/tomcat8/.jenkins/jobs/RDF-Processing-Toolkit/workspace/rdf-processing-toolkit-cli/target/apidocs/org/aksw/named_graph_stream/cli/main/package-use.html...
Generating /usr/share/tomcat8/.jenkins/jobs/RDF-Processing-Toolkit/workspace/rdf-processing-toolkit-cli/target/apidocs/org/aksw/rdf_processing_toolkit/cli/cmd/package-use.html...
Generating /usr/share/tomcat8/.jenkins/jobs/RDF-Processing-Toolkit/workspace/rdf-processing-toolkit-cli/target/apidocs/org/aksw/rdf_processing_toolkit/cli/main/package-use.html...
Generating /usr/share/tomcat8/.jenkins/jobs/RDF-Processing-Toolkit/workspace/rdf-processing-toolkit-cli/target/apidocs/org/aksw/sparql_binding_stream/cli/cmd/package-use.html...
Generating /usr/share/tomcat8/.jenkins/jobs/RDF-Processing-Toolkit/workspace/rdf-processing-toolkit-cli/target/apidocs/org/aksw/sparql_binding_stream/cli/main/package-use.html...
Generating /usr/share/tomcat8/.jenkins/jobs/RDF-Processing-Toolkit/workspace/rdf-processing-toolkit-cli/target/apidocs/org/aksw/sparql_integrate/cli/package-use.html...
Generating /usr/share/tomcat8/.jenkins/jobs/RDF-Processing-Toolkit/workspace/rdf-processing-toolkit-cli/target/apidocs/org/aksw/sparql_integrate/cli/cmd/package-use.html...
Generating /usr/share/tomcat8/.jenkins/jobs/RDF-Processing-Toolkit/workspace/rdf-processing-toolkit-cli/target/apidocs/org/aksw/sparql_integrate/cli/main/package-use.html...
Building index for all the packages and classes...
Generating /usr/share/tomcat8/.jenkins/jobs/RDF-Processing-Toolkit/workspace/rdf-processing-toolkit-cli/target/apidocs/overview-tree.html...
Generating /usr/share/tomcat8/.jenkins/jobs/RDF-Processing-Toolkit/workspace/rdf-processing-toolkit-cli/target/apidocs/index-all.html...
Building index for all classes...
Generating /usr/share/tomcat8/.jenkins/jobs/RDF-Processing-Toolkit/workspace/rdf-processing-toolkit-cli/target/apidocs/allclasses-index.html...
Generating /usr/share/tomcat8/.jenkins/jobs/RDF-Processing-Toolkit/workspace/rdf-processing-toolkit-cli/target/apidocs/allpackages-index.html...
Generating /usr/share/tomcat8/.jenkins/jobs/RDF-Processing-Toolkit/workspace/rdf-processing-toolkit-cli/target/apidocs/deprecated-list.html...
Building index for all classes...
Generating /usr/share/tomcat8/.jenkins/jobs/RDF-Processing-Toolkit/workspace/rdf-processing-toolkit-cli/target/apidocs/allclasses.html...
Generating /usr/share/tomcat8/.jenkins/jobs/RDF-Processing-Toolkit/workspace/rdf-processing-toolkit-cli/target/apidocs/allclasses.html...
Generating /usr/share/tomcat8/.jenkins/jobs/RDF-Processing-Toolkit/workspace/rdf-processing-toolkit-cli/target/apidocs/index.html...
Generating /usr/share/tomcat8/.jenkins/jobs/RDF-Processing-Toolkit/workspace/rdf-processing-toolkit-cli/target/apidocs/overview-summary.html...
Generating /usr/share/tomcat8/.jenkins/jobs/RDF-Processing-Toolkit/workspace/rdf-processing-toolkit-cli/target/apidocs/help-doc.html...
100 warnings
[WARNING] Javadoc Warnings
[WARNING] javadoc: warning - The code being documented uses modules but the packages defined in http://docs.oracle.com/javase/7/docs/api/ are in the unnamed module.
[WARNING] javadoc: warning - The code being documented uses modules but the packages defined in http://docs.oracle.com/javase/7/docs/api/ are in the unnamed module.
[WARNING] javadoc: warning - The code being documented uses modules but the packages defined in http://docs.oracle.com/javase/7/docs/api/ are in the unnamed module.
[WARNING] javadoc: warning - The code being documented uses modules but the packages defined in http://docs.oracle.com/javase/7/docs/api/ are in the unnamed module.
[WARNING] javadoc: warning - The code being documented uses modules but the packages defined in http://docs.oracle.com/javase/7/docs/api/ are in the unnamed module.
[WARNING] javadoc: warning - The code being documented uses modules but the packages defined in http://docs.oracle.com/javase/7/docs/api/ are in the unnamed module.
[WARNING] javadoc: warning - The code being documented uses modules but the packages defined in http://docs.oracle.com/javase/7/docs/api/ are in the unnamed module.
[WARNING] javadoc: warning - The code being documented uses modules but the packages defined in http://docs.oracle.com/javase/7/docs/api/ are in the unnamed module.
[WARNING] javadoc: warning - The code being documented uses modules but the packages defined in http://docs.oracle.com/javase/7/docs/api/ are in the unnamed module.
[WARNING] javadoc: warning - The code being documented uses modules but the packages defined in http://docs.oracle.com/javase/7/docs/api/ are in the unnamed module.
[WARNING] javadoc: warning - The code being documented uses modules but the packages defined in http://docs.oracle.com/javase/7/docs/api/ are in the unnamed module.
[WARNING] javadoc: warning - The code being documented uses modules but the packages defined in http://docs.oracle.com/javase/7/docs/api/ are in the unnamed module.
[WARNING] javadoc: warning - The code being documented uses modules but the packages defined in http://docs.oracle.com/javase/7/docs/api/ are in the unnamed module.
[WARNING] javadoc: warning - The code being documented uses modules but the packages defined in http://docs.oracle.com/javase/7/docs/api/ are in the unnamed module.
[WARNING] javadoc: warning - The code being documented uses modules but the packages defined in http://docs.oracle.com/javase/7/docs/api/ are in the unnamed module.
[WARNING] javadoc: warning - The code being documented uses modules but the packages defined in http://docs.oracle.com/javase/7/docs/api/ are in the unnamed module.
[WARNING] javadoc: warning - The code being documented uses modules but the packages defined in http://docs.oracle.com/javase/7/docs/api/ are in the unnamed module.
[WARNING] javadoc: warning - The code being documented uses modules but the packages defined in http://docs.oracle.com/javase/7/docs/api/ are in the unnamed module.
[WARNING] javadoc: warning - The code being documented uses modules but the packages defined in http://docs.oracle.com/javase/7/docs/api/ are in the unnamed module.
[WARNING] javadoc: warning - The code being documented uses modules but the packages defined in http://docs.oracle.com/javase/7/docs/api/ are in the unnamed module.
[WARNING] javadoc: warning - The code being documented uses modules but the packages defined in http://docs.oracle.com/javase/7/docs/api/ are in the unnamed module.
[WARNING] javadoc: warning - The code being documented uses modules but the packages defined in http://docs.oracle.com/javase/7/docs/api/ are in the unnamed module.
[WARNING] javadoc: warning - The code being documented uses modules but the packages defined in http://docs.oracle.com/javase/7/docs/api/ are in the unnamed module.
[WARNING] javadoc: warning - The code being documented uses modules but the packages defined in http://docs.oracle.com/javase/7/docs/api/ are in the unnamed module.
[WARNING] javadoc: warning - The code being documented uses modules but the packages defined in http://docs.oracle.com/javase/7/docs/api/ are in the unnamed module.
[WARNING] javadoc: warning - The code being documented uses modules but the packages defined in http://docs.oracle.com/javase/7/docs/api/ are in the unnamed module.
[WARNING] javadoc: warning - The code being documented uses modules but the packages defined in http://docs.oracle.com/javase/7/docs/api/ are in the unnamed module.
[WARNING] javadoc: warning - The code being documented uses modules but the packages defined in http://docs.oracle.com/javase/7/docs/api/ are in the unnamed module.
[WARNING] javadoc: warning - The code being documented uses modules but the packages defined in http://docs.oracle.com/javase/7/docs/api/ are in the unnamed module.
[WARNING] javadoc: warning - The code being documented uses modules but the packages defined in http://docs.oracle.com/javase/7/docs/api/ are in the unnamed module.
[WARNING] javadoc: warning - The code being documented uses modules but the packages defined in http://docs.oracle.com/javase/7/docs/api/ are in the unnamed module.
[WARNING] javadoc: warning - The code being documented uses modules but the packages defined in http://docs.oracle.com/javase/7/docs/api/ are in the unnamed module.
[WARNING] javadoc: warning - The code being documented uses modules but the packages defined in http://docs.oracle.com/javase/7/docs/api/ are in the unnamed module.
[WARNING] javadoc: warning - The code being documented uses modules but the packages defined in http://docs.oracle.com/javase/7/docs/api/ are in the unnamed module.
[WARNING] javadoc: warning - The code being documented uses modules but the packages defined in http://docs.oracle.com/javase/7/docs/api/ are in the unnamed module.
[WARNING] javadoc: warning - The code being documented uses modules but the packages defined in http://docs.oracle.com/javase/7/docs/api/ are in the unnamed module.
[WARNING] javadoc: warning - The code being documented uses modules but the packages defined in http://docs.oracle.com/javase/7/docs/api/ are in the unnamed module.
[WARNING] javadoc: warning - The code being documented uses modules but the packages defined in http://docs.oracle.com/javase/7/docs/api/ are in the unnamed module.
[WARNING] javadoc: warning - The code being documented uses modules but the packages defined in http://docs.oracle.com/javase/7/docs/api/ are in the unnamed module.
[WARNING] javadoc: warning - The code being documented uses modules but the packages defined in http://docs.oracle.com/javase/7/docs/api/ are in the unnamed module.
[WARNING] javadoc: warning - The code being documented uses modules but the packages defined in http://docs.oracle.com/javase/7/docs/api/ are in the unnamed module.
[WARNING] javadoc: warning - The code being documented uses modules but the packages defined in http://docs.oracle.com/javase/7/docs/api/ are in the unnamed module.
[WARNING] javadoc: warning - The code being documented uses modules but the packages defined in http://docs.oracle.com/javase/7/docs/api/ are in the unnamed module.
[WARNING] javadoc: warning - The code being documented uses modules but the packages defined in http://docs.oracle.com/javase/7/docs/api/ are in the unnamed module.
[WARNING] javadoc: warning - The code being documented uses modules but the packages defined in http://docs.oracle.com/javase/7/docs/api/ are in the unnamed module.
[WARNING] javadoc: warning - The code being documented uses modules but the packages defined in http://docs.oracle.com/javase/7/docs/api/ are in the unnamed module.
[WARNING] javadoc: warning - The code being documented uses modules but the packages defined in http://docs.oracle.com/javase/7/docs/api/ are in the unnamed module.
[WARNING] javadoc: warning - The code being documented uses modules but the packages defined in http://docs.oracle.com/javase/7/docs/api/ are in the unnamed module.
[WARNING] javadoc: warning - The code being documented uses modules but the packages defined in http://docs.oracle.com/javase/7/docs/api/ are in the unnamed module.
[WARNING] javadoc: warning - The code being documented uses modules but the packages defined in http://docs.oracle.com/javase/7/docs/api/ are in the unnamed module.
[WARNING] javadoc: warning - The code being documented uses modules but the packages defined in http://docs.oracle.com/javase/7/docs/api/ are in the unnamed module.
[WARNING] javadoc: warning - The code being documented uses modules but the packages defined in http://docs.oracle.com/javase/7/docs/api/ are in the unnamed module.
[WARNING] javadoc: warning - The code being documented uses modules but the packages defined in http://docs.oracle.com/javase/7/docs/api/ are in the unnamed module.
[WARNING] javadoc: warning - The code being documented uses modules but the packages defined in http://docs.oracle.com/javase/7/docs/api/ are in the unnamed module.
[WARNING] javadoc: warning - The code being documented uses modules but the packages defined in http://docs.oracle.com/javase/7/docs/api/ are in the unnamed module.
[WARNING] javadoc: warning - The code being documented uses modules but the packages defined in http://docs.oracle.com/javase/7/docs/api/ are in the unnamed module.
[WARNING] javadoc: warning - The code being documented uses modules but the packages defined in http://docs.oracle.com/javase/7/docs/api/ are in the unnamed module.
[WARNING] javadoc: warning - The code being documented uses modules but the packages defined in http://docs.oracle.com/javase/7/docs/api/ are in the unnamed module.
[WARNING] javadoc: warning - The code being documented uses modules but the packages defined in http://docs.oracle.com/javase/7/docs/api/ are in the unnamed module.
[WARNING] javadoc: warning - The code being documented uses modules but the packages defined in http://docs.oracle.com/javase/7/docs/api/ are in the unnamed module.
[WARNING] javadoc: warning - The code being documented uses modules but the packages defined in http://docs.oracle.com/javase/7/docs/api/ are in the unnamed module.
[WARNING] javadoc: warning - The code being documented uses modules but the packages defined in http://docs.oracle.com/javase/7/docs/api/ are in the unnamed module.
[WARNING] javadoc: warning - The code being documented uses modules but the packages defined in http://docs.oracle.com/javase/7/docs/api/ are in the unnamed module.
[WARNING] javadoc: warning - The code being documented uses modules but the packages defined in http://docs.oracle.com/javase/7/docs/api/ are in the unnamed module.
[WARNING] javadoc: warning - The code being documented uses modules but the packages defined in http://docs.oracle.com/javase/7/docs/api/ are in the unnamed module.
[WARNING] javadoc: warning - The code being documented uses modules but the packages defined in http://docs.oracle.com/javase/7/docs/api/ are in the unnamed module.
[WARNING] javadoc: warning - The code being documented uses modules but the packages defined in http://docs.oracle.com/javase/7/docs/api/ are in the unnamed module.
[WARNING] javadoc: warning - The code being documented uses modules but the packages defined in http://docs.oracle.com/javase/7/docs/api/ are in the unnamed module.
[WARNING] javadoc: warning - The code being documented uses modules but the packages defined in http://docs.oracle.com/javase/7/docs/api/ are in the unnamed module.
[WARNING] javadoc: warning - The code being documented uses modules but the packages defined in http://docs.oracle.com/javase/7/docs/api/ are in the unnamed module.
[WARNING] javadoc: warning - The code being documented uses modules but the packages defined in http://docs.oracle.com/javase/7/docs/api/ are in the unnamed module.
[WARNING] javadoc: warning - The code being documented uses modules but the packages defined in http://docs.oracle.com/javase/7/docs/api/ are in the unnamed module.
[WARNING] javadoc: warning - The code being documented uses modules but the packages defined in http://docs.oracle.com/javase/7/docs/api/ are in the unnamed module.
[WARNING] javadoc: warning - The code being documented uses modules but the packages defined in http://docs.oracle.com/javase/7/docs/api/ are in the unnamed module.
[WARNING] javadoc: warning - The code being documented uses modules but the packages defined in http://docs.oracle.com/javase/7/docs/api/ are in the unnamed module.
[WARNING] javadoc: warning - The code being documented uses modules but the packages defined in http://docs.oracle.com/javase/7/docs/api/ are in the unnamed module.
[WARNING] javadoc: warning - The code being documented uses modules but the packages defined in http://docs.oracle.com/javase/7/docs/api/ are in the unnamed module.
[WARNING] javadoc: warning - The code being documented uses modules but the packages defined in http://docs.oracle.com/javase/7/docs/api/ are in the unnamed module.
[WARNING] javadoc: warning - The code being documented uses modules but the packages defined in http://docs.oracle.com/javase/7/docs/api/ are in the unnamed module.
[WARNING] javadoc: warning - The code being documented uses modules but the packages defined in http://docs.oracle.com/javase/7/docs/api/ are in the unnamed module.
[WARNING] javadoc: warning - The code being documented uses modules but the packages defined in http://docs.oracle.com/javase/7/docs/api/ are in the unnamed module.
[WARNING] javadoc: warning - The code being documented uses modules but the packages defined in http://docs.oracle.com/javase/7/docs/api/ are in the unnamed module.
[WARNING] javadoc: warning - The code being documented uses modules but the packages defined in http://docs.oracle.com/javase/7/docs/api/ are in the unnamed module.
[WARNING] javadoc: warning - The code being documented uses modules but the packages defined in http://docs.oracle.com/javase/7/docs/api/ are in the unnamed module.
[WARNING] javadoc: warning - The code being documented uses modules but the packages defined in http://docs.oracle.com/javase/7/docs/api/ are in the unnamed module.
[WARNING] javadoc: warning - The code being documented uses modules but the packages defined in http://docs.oracle.com/javase/7/docs/api/ are in the unnamed module.
[WARNING] javadoc: warning - The code being documented uses modules but the packages defined in http://docs.oracle.com/javase/7/docs/api/ are in the unnamed module.
[WARNING] javadoc: warning - The code being documented uses modules but the packages defined in http://docs.oracle.com/javase/7/docs/api/ are in the unnamed module.
[WARNING] javadoc: warning - The code being documented uses modules but the packages defined in http://docs.oracle.com/javase/7/docs/api/ are in the unnamed module.
[WARNING] javadoc: warning - The code being documented uses modules but the packages defined in http://docs.oracle.com/javase/7/docs/api/ are in the unnamed module.
[WARNING] javadoc: warning - The code being documented uses modules but the packages defined in http://docs.oracle.com/javase/7/docs/api/ are in the unnamed module.
[WARNING] javadoc: warning - The code being documented uses modules but the packages defined in http://docs.oracle.com/javase/7/docs/api/ are in the unnamed module.
[WARNING] javadoc: warning - The code being documented uses modules but the packages defined in http://docs.oracle.com/javase/7/docs/api/ are in the unnamed module.
[WARNING] javadoc: warning - The code being documented uses modules but the packages defined in http://docs.oracle.com/javase/7/docs/api/ are in the unnamed module.
[WARNING] javadoc: warning - The code being documented uses modules but the packages defined in http://docs.oracle.com/javase/7/docs/api/ are in the unnamed module.
[WARNING] javadoc: warning - The code being documented uses modules but the packages defined in http://docs.oracle.com/javase/7/docs/api/ are in the unnamed module.
[WARNING] javadoc: warning - The code being documented uses modules but the packages defined in http://docs.oracle.com/javase/7/docs/api/ are in the unnamed module.
[WARNING] javadoc: warning - The code being documented uses modules but the packages defined in http://docs.oracle.com/javase/7/docs/api/ are in the unnamed module.
[WARNING] javadoc: warning - The code being documented uses modules but the packages defined in http://docs.oracle.com/javase/7/docs/api/ are in the unnamed module.
[WARNING] javadoc: warning - The code being documented uses modules but the packages defined in http://docs.oracle.com/javase/7/docs/api/ are in the unnamed module.
[INFO] Building jar: /usr/share/tomcat8/.jenkins/jobs/RDF-Processing-Toolkit/workspace/rdf-processing-toolkit-cli/target/rdf-processing-toolkit-cli-1.9.1-SNAPSHOT-javadoc.jar
[INFO] 
[INFO] --- maven-source-plugin:3.0.1:jar-no-fork (attach-sources) @ rdf-processing-toolkit-cli ---
[INFO] Building jar: /usr/share/tomcat8/.jenkins/jobs/RDF-Processing-Toolkit/workspace/rdf-processing-toolkit-cli/target/rdf-processing-toolkit-cli-1.9.1-SNAPSHOT-sources.jar
[INFO] 
[INFO] --- maven-install-plugin:2.4:install (default-install) @ rdf-processing-toolkit-cli ---
[INFO] Installing /usr/share/tomcat8/.jenkins/jobs/RDF-Processing-Toolkit/workspace/rdf-processing-toolkit-cli/target/rdf-processing-toolkit-cli-1.9.1-SNAPSHOT.jar to /usr/share/tomcat8/.m2/repository/org/aksw/rdf-processing-toolkit/rdf-processing-toolkit-cli/1.9.1-SNAPSHOT/rdf-processing-toolkit-cli-1.9.1-SNAPSHOT.jar
[INFO] Installing /usr/share/tomcat8/.jenkins/jobs/RDF-Processing-Toolkit/workspace/rdf-processing-toolkit-cli/pom.xml to /usr/share/tomcat8/.m2/repository/org/aksw/rdf-processing-toolkit/rdf-processing-toolkit-cli/1.9.1-SNAPSHOT/rdf-processing-toolkit-cli-1.9.1-SNAPSHOT.pom
[INFO] Installing /usr/share/tomcat8/.jenkins/jobs/RDF-Processing-Toolkit/workspace/rdf-processing-toolkit-cli/target/rdf-processing-toolkit-cli-1.9.1-SNAPSHOT-javadoc.jar to /usr/share/tomcat8/.m2/repository/org/aksw/rdf-processing-toolkit/rdf-processing-toolkit-cli/1.9.1-SNAPSHOT/rdf-processing-toolkit-cli-1.9.1-SNAPSHOT-javadoc.jar
[INFO] Installing /usr/share/tomcat8/.jenkins/jobs/RDF-Processing-Toolkit/workspace/rdf-processing-toolkit-cli/target/rdf-processing-toolkit-cli-1.9.1-SNAPSHOT-sources.jar to /usr/share/tomcat8/.m2/repository/org/aksw/rdf-processing-toolkit/rdf-processing-toolkit-cli/1.9.1-SNAPSHOT/rdf-processing-toolkit-cli-1.9.1-SNAPSHOT-sources.jar
[INFO] 
[INFO] --< org.aksw.rdf-processing-toolkit:rdf-processing-toolkit-pkg-parent >--
[INFO] Building rdf-processing-toolkit-pkg-parent 1.9.1-SNAPSHOT          [3/8]
[INFO] --------------------------------[ pom ]---------------------------------
[INFO] 
[INFO] --- maven-clean-plugin:2.5:clean (default-clean) @ rdf-processing-toolkit-pkg-parent ---
[INFO] 
[INFO] --- maven-javadoc-plugin:2.9.1:jar (attach-javadocs) @ rdf-processing-toolkit-pkg-parent ---
[INFO] Not executing Javadoc as the project is not a Java classpath-capable package
[INFO] 
[INFO] --- maven-source-plugin:3.0.1:jar-no-fork (attach-sources) @ rdf-processing-toolkit-pkg-parent ---
[INFO] 
[INFO] --- maven-install-plugin:2.4:install (default-install) @ rdf-processing-toolkit-pkg-parent ---
[INFO] Installing /usr/share/tomcat8/.jenkins/jobs/RDF-Processing-Toolkit/workspace/rdf-processing-toolkit-pkg-parent/pom.xml to /usr/share/tomcat8/.m2/repository/org/aksw/rdf-processing-toolkit/rdf-processing-toolkit-pkg-parent/1.9.1-SNAPSHOT/rdf-processing-toolkit-pkg-parent-1.9.1-SNAPSHOT.pom
[INFO] 
[INFO] --< org.aksw.rdf-processing-toolkit:rdf-processing-toolkit-pkg-deb-cli >--
[INFO] Building rdf-processing-toolkit-pkg-deb-cli 1.9.1-SNAPSHOT         [4/8]
[INFO] --------------------------------[ jar ]---------------------------------
[INFO] 
[INFO] --- maven-clean-plugin:2.5:clean (default-clean) @ rdf-processing-toolkit-pkg-deb-cli ---
[INFO] Deleting /usr/share/tomcat8/.jenkins/jobs/RDF-Processing-Toolkit/workspace/rdf-processing-toolkit-pkg-parent/rdf-processing-toolkit-pkg-deb-cli/target
[INFO] 
[INFO] --- maven-resources-plugin:2.6:resources (default-resources) @ rdf-processing-toolkit-pkg-deb-cli ---
[INFO] Using 'UTF-8' encoding to copy filtered resources.
[INFO] skip non existing resourceDirectory /usr/share/tomcat8/.jenkins/jobs/RDF-Processing-Toolkit/workspace/rdf-processing-toolkit-pkg-parent/rdf-processing-toolkit-pkg-deb-cli/src/main/resources
[INFO] skip non existing resourceDirectory /usr/share/tomcat8/.jenkins/jobs/RDF-Processing-Toolkit/workspace/rdf-processing-toolkit-pkg-parent/rdf-processing-toolkit-pkg-deb-cli/src/main/resources-filtered
[INFO] 
[INFO] --- maven-compiler-plugin:3.6.0:compile (default-compile) @ rdf-processing-toolkit-pkg-deb-cli ---
[INFO] No sources to compile
[INFO] 
[INFO] --- maven-resources-plugin:2.6:testResources (default-testResources) @ rdf-processing-toolkit-pkg-deb-cli ---
[INFO] Using 'UTF-8' encoding to copy filtered resources.
[INFO] skip non existing resourceDirectory /usr/share/tomcat8/.jenkins/jobs/RDF-Processing-Toolkit/workspace/rdf-processing-toolkit-pkg-parent/rdf-processing-toolkit-pkg-deb-cli/src/test/resources
[INFO] 
[INFO] --- maven-compiler-plugin:3.6.0:testCompile (default-testCompile) @ rdf-processing-toolkit-pkg-deb-cli ---
[INFO] No sources to compile
[INFO] 
[INFO] --- maven-surefire-plugin:2.19:test (default-test) @ rdf-processing-toolkit-pkg-deb-cli ---
[INFO] No tests to run.
[JENKINS] Recording test results
[INFO] 
[INFO] --- maven-jar-plugin:2.4:jar (default-jar) @ rdf-processing-toolkit-pkg-deb-cli ---
[WARNING] JAR will be empty - no content was marked for inclusion!
[INFO] Building jar: /usr/share/tomcat8/.jenkins/jobs/RDF-Processing-Toolkit/workspace/rdf-processing-toolkit-pkg-parent/rdf-processing-toolkit-pkg-deb-cli/target/rdf-processing-toolkit-pkg-deb-cli-1.9.1-SNAPSHOT.jar
[INFO] 
[INFO] --- maven-javadoc-plugin:2.9.1:jar (attach-javadocs) @ rdf-processing-toolkit-pkg-deb-cli ---
[INFO] 
[INFO] --- maven-source-plugin:3.0.1:jar-no-fork (attach-sources) @ rdf-processing-toolkit-pkg-deb-cli ---
[INFO] No sources in project. Archive not created.
[INFO] 
[INFO] --- maven-install-plugin:2.4:install (default-install) @ rdf-processing-toolkit-pkg-deb-cli ---
[INFO] Installing /usr/share/tomcat8/.jenkins/jobs/RDF-Processing-Toolkit/workspace/rdf-processing-toolkit-pkg-parent/rdf-processing-toolkit-pkg-deb-cli/target/rdf-processing-toolkit-pkg-deb-cli-1.9.1-SNAPSHOT.jar to /usr/share/tomcat8/.m2/repository/org/aksw/rdf-processing-toolkit/rdf-processing-toolkit-pkg-deb-cli/1.9.1-SNAPSHOT/rdf-processing-toolkit-pkg-deb-cli-1.9.1-SNAPSHOT.jar
[INFO] Installing /usr/share/tomcat8/.jenkins/jobs/RDF-Processing-Toolkit/workspace/rdf-processing-toolkit-pkg-parent/rdf-processing-toolkit-pkg-deb-cli/pom.xml to /usr/share/tomcat8/.m2/repository/org/aksw/rdf-processing-toolkit/rdf-processing-toolkit-pkg-deb-cli/1.9.1-SNAPSHOT/rdf-processing-toolkit-pkg-deb-cli-1.9.1-SNAPSHOT.pom
[INFO] 
[INFO] --< org.aksw.rdf-processing-toolkit:rdf-processing-toolkit-pkg-rpm-cli >--
[INFO] Building rdf-processing-toolkit-pkg-rpm-cli 1.9.1-SNAPSHOT         [5/8]
[INFO] --------------------------------[ rpm ]---------------------------------
[INFO] Downloading from central: https://repo.maven.apache.org/maven2/org/apache/maven/plugins/maven-resources-plugin/maven-metadata.xml
[INFO] Downloaded from central: https://repo.maven.apache.org/maven2/org/apache/maven/plugins/maven-resources-plugin/maven-metadata.xml (874 B at 26 kB/s)
[INFO] Downloading from central: https://repo.maven.apache.org/maven2/org/apache/maven/plugins/maven-install-plugin/maven-metadata.xml
[INFO] Downloaded from central: https://repo.maven.apache.org/maven2/org/apache/maven/plugins/maven-install-plugin/maven-metadata.xml (0 B at 0 B/s)
[INFO] 
[INFO] --- maven-clean-plugin:2.5:clean (default-clean) @ rdf-processing-toolkit-pkg-rpm-cli ---
[INFO] Deleting /usr/share/tomcat8/.jenkins/jobs/RDF-Processing-Toolkit/workspace/rdf-processing-toolkit-pkg-parent/rdf-processing-toolkit-pkg-rpm-cli/target
[INFO] 
[INFO] --- maven-resources-plugin:3.2.0:resources (default-resources) @ rdf-processing-toolkit-pkg-rpm-cli ---
[INFO] Using 'UTF-8' encoding to copy filtered resources.
[INFO] Using 'UTF-8' encoding to copy filtered properties files.
[INFO] skip non existing resourceDirectory /usr/share/tomcat8/.jenkins/jobs/RDF-Processing-Toolkit/workspace/rdf-processing-toolkit-pkg-parent/rdf-processing-toolkit-pkg-rpm-cli/src/main/resources
[INFO] skip non existing resourceDirectory /usr/share/tomcat8/.jenkins/jobs/RDF-Processing-Toolkit/workspace/rdf-processing-toolkit-pkg-parent/rdf-processing-toolkit-pkg-rpm-cli/src/main/resources-filtered
[INFO] 
[INFO] --- maven-compiler-plugin:3.6.0:compile (default-compile) @ rdf-processing-toolkit-pkg-rpm-cli ---
[INFO] No sources to compile
[INFO] 
[INFO] --- maven-resources-plugin:3.2.0:testResources (default-testResources) @ rdf-processing-toolkit-pkg-rpm-cli ---
[INFO] Using 'UTF-8' encoding to copy filtered resources.
[INFO] Using 'UTF-8' encoding to copy filtered properties files.
[INFO] skip non existing resourceDirectory /usr/share/tomcat8/.jenkins/jobs/RDF-Processing-Toolkit/workspace/rdf-processing-toolkit-pkg-parent/rdf-processing-toolkit-pkg-rpm-cli/src/test/resources
[INFO] 
[INFO] --- maven-compiler-plugin:3.6.0:testCompile (default-testCompile) @ rdf-processing-toolkit-pkg-rpm-cli ---
[INFO] No sources to compile
[INFO] 
[INFO] --- maven-surefire-plugin:2.19:test (default-test) @ rdf-processing-toolkit-pkg-rpm-cli ---
[INFO] No tests to run.
[JENKINS] Recording test results
[INFO] 
[INFO] --- rpm:1.8.0:rpm (default-rpm) @ rdf-processing-toolkit-pkg-rpm-cli ---
[INFO] Building with SNAPSHOT version from project: 1.9.1
[INFO] Writing to target to: /usr/share/tomcat8/.jenkins/jobs/RDF-Processing-Toolkit/workspace/rdf-processing-toolkit-pkg-parent/rdf-processing-toolkit-pkg-rpm-cli/target/rdf-processing-toolkit-cli-1.9.1-0.202205170346.noarch.rpm
[INFO] Building with SNAPSHOT version from project: 1.9.1
[INFO] RPM base information - name: rdf-processing-toolkit-cli, version: 1.9.1-0.202205170346, arch: noarch
[INFO] Writing target file: /usr/share/tomcat8/.jenkins/jobs/RDF-Processing-Toolkit/workspace/rdf-processing-toolkit-pkg-parent/rdf-processing-toolkit-pkg-rpm-cli/target/rdf-processing-toolkit-cli-1.9.1-0.202205170346.noarch.rpm
[INFO] Building with SNAPSHOT version from project: 1.9.1
[INFO] Required RPM version: 4.11
[INFO] attaching rpm
[INFO] 
[INFO] --- maven-javadoc-plugin:2.9.1:jar (attach-javadocs) @ rdf-processing-toolkit-pkg-rpm-cli ---
[INFO] Not executing Javadoc as the project is not a Java classpath-capable package
[INFO] 
[INFO] --- maven-source-plugin:3.0.1:jar-no-fork (attach-sources) @ rdf-processing-toolkit-pkg-rpm-cli ---
[INFO] No sources in project. Archive not created.
[INFO] 
[INFO] --- maven-install-plugin:3.0.0-M1:install (default-install) @ rdf-processing-toolkit-pkg-rpm-cli ---
[INFO] Installing /usr/share/tomcat8/.jenkins/jobs/RDF-Processing-Toolkit/workspace/rdf-processing-toolkit-pkg-parent/rdf-processing-toolkit-pkg-rpm-cli/target/rdf-processing-toolkit-cli-1.9.1-0.202205170346.noarch.rpm to /usr/share/tomcat8/.m2/repository/org/aksw/rdf-processing-toolkit/rdf-processing-toolkit-pkg-rpm-cli/1.9.1-SNAPSHOT/rdf-processing-toolkit-pkg-rpm-cli-1.9.1-SNAPSHOT.rpm
[INFO] Installing /usr/share/tomcat8/.jenkins/jobs/RDF-Processing-Toolkit/workspace/rdf-processing-toolkit-pkg-parent/rdf-processing-toolkit-pkg-rpm-cli/pom.xml to /usr/share/tomcat8/.m2/repository/org/aksw/rdf-processing-toolkit/rdf-processing-toolkit-pkg-rpm-cli/1.9.1-SNAPSHOT/rdf-processing-toolkit-pkg-rpm-cli-1.9.1-SNAPSHOT.pom
[INFO] 
[INFO] --< org.aksw.rdf-processing-toolkit:rdf-processing-toolkit-pkg-docker-cli >--
[INFO] Building rdf-processing-toolkit-pkg-docker-cli 1.9.1-SNAPSHOT      [6/8]
[INFO] --------------------------------[ jar ]---------------------------------
[INFO] 
[INFO] --- maven-clean-plugin:2.5:clean (default-clean) @ rdf-processing-toolkit-pkg-docker-cli ---
[INFO] Deleting /usr/share/tomcat8/.jenkins/jobs/RDF-Processing-Toolkit/workspace/rdf-processing-toolkit-pkg-parent/rdf-processing-toolkit-pkg-docker-cli/target
[INFO] 
[INFO] --- maven-resources-plugin:2.6:resources (default-resources) @ rdf-processing-toolkit-pkg-docker-cli ---
[INFO] Using 'UTF-8' encoding to copy filtered resources.
[INFO] skip non existing resourceDirectory /usr/share/tomcat8/.jenkins/jobs/RDF-Processing-Toolkit/workspace/rdf-processing-toolkit-pkg-parent/rdf-processing-toolkit-pkg-docker-cli/src/main/resources
[INFO] skip non existing resourceDirectory /usr/share/tomcat8/.jenkins/jobs/RDF-Processing-Toolkit/workspace/rdf-processing-toolkit-pkg-parent/rdf-processing-toolkit-pkg-docker-cli/src/main/resources-filtered
[INFO] 
[INFO] --- maven-compiler-plugin:3.6.0:compile (default-compile) @ rdf-processing-toolkit-pkg-docker-cli ---
[INFO] No sources to compile
[INFO] 
[INFO] --- maven-resources-plugin:2.6:testResources (default-testResources) @ rdf-processing-toolkit-pkg-docker-cli ---
[INFO] Using 'UTF-8' encoding to copy filtered resources.
[INFO] skip non existing resourceDirectory /usr/share/tomcat8/.jenkins/jobs/RDF-Processing-Toolkit/workspace/rdf-processing-toolkit-pkg-parent/rdf-processing-toolkit-pkg-docker-cli/src/test/resources
[INFO] 
[INFO] --- maven-compiler-plugin:3.6.0:testCompile (default-testCompile) @ rdf-processing-toolkit-pkg-docker-cli ---
[INFO] No sources to compile
[INFO] 
[INFO] --- maven-surefire-plugin:2.19:test (default-test) @ rdf-processing-toolkit-pkg-docker-cli ---
[INFO] No tests to run.
[JENKINS] Recording test results
[INFO] 
[INFO] --- maven-jar-plugin:2.4:jar (default-jar) @ rdf-processing-toolkit-pkg-docker-cli ---
[WARNING] JAR will be empty - no content was marked for inclusion!
[INFO] Building jar: /usr/share/tomcat8/.jenkins/jobs/RDF-Processing-Toolkit/workspace/rdf-processing-toolkit-pkg-parent/rdf-processing-toolkit-pkg-docker-cli/target/rdf-processing-toolkit-pkg-docker-cli-1.9.1-SNAPSHOT.jar
[INFO] 
[INFO] --- maven-javadoc-plugin:2.9.1:jar (attach-javadocs) @ rdf-processing-toolkit-pkg-docker-cli ---
[INFO] 
[INFO] --- maven-source-plugin:3.0.1:jar-no-fork (attach-sources) @ rdf-processing-toolkit-pkg-docker-cli ---
[INFO] No sources in project. Archive not created.
[INFO] 
[INFO] --- maven-install-plugin:2.4:install (default-install) @ rdf-processing-toolkit-pkg-docker-cli ---
[INFO] Installing /usr/share/tomcat8/.jenkins/jobs/RDF-Processing-Toolkit/workspace/rdf-processing-toolkit-pkg-parent/rdf-processing-toolkit-pkg-docker-cli/target/rdf-processing-toolkit-pkg-docker-cli-1.9.1-SNAPSHOT.jar to /usr/share/tomcat8/.m2/repository/org/aksw/rdf-processing-toolkit/rdf-processing-toolkit-pkg-docker-cli/1.9.1-SNAPSHOT/rdf-processing-toolkit-pkg-docker-cli-1.9.1-SNAPSHOT.jar
[INFO] Installing /usr/share/tomcat8/.jenkins/jobs/RDF-Processing-Toolkit/workspace/rdf-processing-toolkit-pkg-parent/rdf-processing-toolkit-pkg-docker-cli/pom.xml to /usr/share/tomcat8/.m2/repository/org/aksw/rdf-processing-toolkit/rdf-processing-toolkit-pkg-docker-cli/1.9.1-SNAPSHOT/rdf-processing-toolkit-pkg-docker-cli-1.9.1-SNAPSHOT.pom
[INFO] 
[INFO] --< org.aksw.rdf-processing-toolkit:rdf-processing-toolkit-pkg-uberjar-cli >--
[INFO] Building rdf-processing-toolkit-pkg-uberjar-cli 1.9.1-SNAPSHOT     [7/8]
[INFO] --------------------------------[ jar ]---------------------------------
[INFO] 
[INFO] --- maven-clean-plugin:2.5:clean (default-clean) @ rdf-processing-toolkit-pkg-uberjar-cli ---
[INFO] Deleting /usr/share/tomcat8/.jenkins/jobs/RDF-Processing-Toolkit/workspace/rdf-processing-toolkit-pkg-parent/rdf-processing-toolkit-pkg-uberjar-cli/target
[INFO] 
[INFO] --- maven-resources-plugin:2.6:resources (default-resources) @ rdf-processing-toolkit-pkg-uberjar-cli ---
[INFO] Using 'UTF-8' encoding to copy filtered resources.
[INFO] skip non existing resourceDirectory /usr/share/tomcat8/.jenkins/jobs/RDF-Processing-Toolkit/workspace/rdf-processing-toolkit-pkg-parent/rdf-processing-toolkit-pkg-uberjar-cli/src/main/resources
[INFO] skip non existing resourceDirectory /usr/share/tomcat8/.jenkins/jobs/RDF-Processing-Toolkit/workspace/rdf-processing-toolkit-pkg-parent/rdf-processing-toolkit-pkg-uberjar-cli/src/main/resources-filtered
[INFO] 
[INFO] --- maven-compiler-plugin:3.6.0:compile (default-compile) @ rdf-processing-toolkit-pkg-uberjar-cli ---
[INFO] No sources to compile
[INFO] 
[INFO] --- maven-resources-plugin:2.6:testResources (default-testResources) @ rdf-processing-toolkit-pkg-uberjar-cli ---
[INFO] Using 'UTF-8' encoding to copy filtered resources.
[INFO] skip non existing resourceDirectory /usr/share/tomcat8/.jenkins/jobs/RDF-Processing-Toolkit/workspace/rdf-processing-toolkit-pkg-parent/rdf-processing-toolkit-pkg-uberjar-cli/src/test/resources
[INFO] 
[INFO] --- maven-compiler-plugin:3.6.0:testCompile (default-testCompile) @ rdf-processing-toolkit-pkg-uberjar-cli ---
[INFO] No sources to compile
[INFO] 
[INFO] --- maven-surefire-plugin:2.19:test (default-test) @ rdf-processing-toolkit-pkg-uberjar-cli ---
[INFO] No tests to run.
[JENKINS] Recording test results
[INFO] 
[INFO] --- maven-jar-plugin:2.4:jar (default-jar) @ rdf-processing-toolkit-pkg-uberjar-cli ---
[WARNING] JAR will be empty - no content was marked for inclusion!
[INFO] Building jar: /usr/share/tomcat8/.jenkins/jobs/RDF-Processing-Toolkit/workspace/rdf-processing-toolkit-pkg-parent/rdf-processing-toolkit-pkg-uberjar-cli/target/rdf-processing-toolkit-pkg-uberjar-cli-1.9.1-SNAPSHOT.jar
[INFO] 
[INFO] --- maven-javadoc-plugin:2.9.1:jar (attach-javadocs) @ rdf-processing-toolkit-pkg-uberjar-cli ---
[INFO] 
[INFO] --- maven-source-plugin:3.0.1:jar-no-fork (attach-sources) @ rdf-processing-toolkit-pkg-uberjar-cli ---
[INFO] No sources in project. Archive not created.
[INFO] 
[INFO] --- maven-install-plugin:2.4:install (default-install) @ rdf-processing-toolkit-pkg-uberjar-cli ---
[INFO] Installing /usr/share/tomcat8/.jenkins/jobs/RDF-Processing-Toolkit/workspace/rdf-processing-toolkit-pkg-parent/rdf-processing-toolkit-pkg-uberjar-cli/target/rdf-processing-toolkit-pkg-uberjar-cli-1.9.1-SNAPSHOT.jar to /usr/share/tomcat8/.m2/repository/org/aksw/rdf-processing-toolkit/rdf-processing-toolkit-pkg-uberjar-cli/1.9.1-SNAPSHOT/rdf-processing-toolkit-pkg-uberjar-cli-1.9.1-SNAPSHOT.jar
[INFO] Installing /usr/share/tomcat8/.jenkins/jobs/RDF-Processing-Toolkit/workspace/rdf-processing-toolkit-pkg-parent/rdf-processing-toolkit-pkg-uberjar-cli/pom.xml to /usr/share/tomcat8/.m2/repository/org/aksw/rdf-processing-toolkit/rdf-processing-toolkit-pkg-uberjar-cli/1.9.1-SNAPSHOT/rdf-processing-toolkit-pkg-uberjar-cli-1.9.1-SNAPSHOT.pom
[INFO] 
[INFO] --< org.aksw.rdf-processing-toolkit:rdf-processing-toolkit-pkg-dummy >--
[INFO] Building rdf-processing-toolkit-pkg-dummy 1.9.1-SNAPSHOT           [8/8]
[INFO] --------------------------------[ jar ]---------------------------------
[INFO] 
[INFO] --- maven-clean-plugin:2.5:clean (default-clean) @ rdf-processing-toolkit-pkg-dummy ---
[INFO] Deleting /usr/share/tomcat8/.jenkins/jobs/RDF-Processing-Toolkit/workspace/rdf-processing-toolkit-pkg-parent/rdf-processing-toolkit-pkg-dummy/target
[INFO] 
[INFO] --- maven-resources-plugin:2.6:resources (default-resources) @ rdf-processing-toolkit-pkg-dummy ---
[INFO] Using 'UTF-8' encoding to copy filtered resources.
[INFO] skip non existing resourceDirectory /usr/share/tomcat8/.jenkins/jobs/RDF-Processing-Toolkit/workspace/rdf-processing-toolkit-pkg-parent/rdf-processing-toolkit-pkg-dummy/src/main/resources
[INFO] skip non existing resourceDirectory /usr/share/tomcat8/.jenkins/jobs/RDF-Processing-Toolkit/workspace/rdf-processing-toolkit-pkg-parent/rdf-processing-toolkit-pkg-dummy/src/main/resources-filtered
[INFO] 
[INFO] --- maven-compiler-plugin:3.6.0:compile (default-compile) @ rdf-processing-toolkit-pkg-dummy ---
[INFO] No sources to compile
[INFO] 
[INFO] --- maven-resources-plugin:2.6:testResources (default-testResources) @ rdf-processing-toolkit-pkg-dummy ---
[INFO] Using 'UTF-8' encoding to copy filtered resources.
[INFO] skip non existing resourceDirectory /usr/share/tomcat8/.jenkins/jobs/RDF-Processing-Toolkit/workspace/rdf-processing-toolkit-pkg-parent/rdf-processing-toolkit-pkg-dummy/src/test/resources
[INFO] 
[INFO] --- maven-compiler-plugin:3.6.0:testCompile (default-testCompile) @ rdf-processing-toolkit-pkg-dummy ---
[INFO] No sources to compile
[INFO] 
[INFO] --- maven-surefire-plugin:2.19:test (default-test) @ rdf-processing-toolkit-pkg-dummy ---
[INFO] No tests to run.
[JENKINS] Recording test results
[INFO] 
[INFO] --- maven-jar-plugin:2.4:jar (default-jar) @ rdf-processing-toolkit-pkg-dummy ---
[WARNING] JAR will be empty - no content was marked for inclusion!
[INFO] Building jar: /usr/share/tomcat8/.jenkins/jobs/RDF-Processing-Toolkit/workspace/rdf-processing-toolkit-pkg-parent/rdf-processing-toolkit-pkg-dummy/target/rdf-processing-toolkit-pkg-dummy-1.9.1-SNAPSHOT.jar
[INFO] 
[INFO] --- maven-javadoc-plugin:2.9.1:jar (attach-javadocs) @ rdf-processing-toolkit-pkg-dummy ---
[INFO] 
[INFO] --- maven-source-plugin:3.0.1:jar-no-fork (attach-sources) @ rdf-processing-toolkit-pkg-dummy ---
[INFO] No sources in project. Archive not created.
[INFO] 
[INFO] --- maven-install-plugin:2.4:install (default-install) @ rdf-processing-toolkit-pkg-dummy ---
[INFO] Installing /usr/share/tomcat8/.jenkins/jobs/RDF-Processing-Toolkit/workspace/rdf-processing-toolkit-pkg-parent/rdf-processing-toolkit-pkg-dummy/target/rdf-processing-toolkit-pkg-dummy-1.9.1-SNAPSHOT.jar to /usr/share/tomcat8/.m2/repository/org/aksw/rdf-processing-toolkit/rdf-processing-toolkit-pkg-dummy/1.9.1-SNAPSHOT/rdf-processing-toolkit-pkg-dummy-1.9.1-SNAPSHOT.jar
[INFO] Installing /usr/share/tomcat8/.jenkins/jobs/RDF-Processing-Toolkit/workspace/rdf-processing-toolkit-pkg-parent/rdf-processing-toolkit-pkg-dummy/pom.xml to /usr/share/tomcat8/.m2/repository/org/aksw/rdf-processing-toolkit/rdf-processing-toolkit-pkg-dummy/1.9.1-SNAPSHOT/rdf-processing-toolkit-pkg-dummy-1.9.1-SNAPSHOT.pom
[INFO] ------------------------------------------------------------------------
[INFO] Reactor Summary for RDF Processing Toolkit 1.9.1-SNAPSHOT:
[INFO] 
[INFO] RDF Processing Toolkit ............................. SUCCESS [  4.877 s]
[INFO] rdf-processing-toolkit-cli ......................... SUCCESS [03:11 min]
[INFO] rdf-processing-toolkit-pkg-parent .................. SUCCESS [  0.705 s]
[INFO] rdf-processing-toolkit-pkg-deb-cli ................. SUCCESS [  2.539 s]
[INFO] rdf-processing-toolkit-pkg-rpm-cli ................. SUCCESS [ 14.687 s]
[INFO] rdf-processing-toolkit-pkg-docker-cli .............. SUCCESS [  1.347 s]
[INFO] rdf-processing-toolkit-pkg-uberjar-cli ............. SUCCESS [  1.489 s]
[INFO] rdf-processing-toolkit-pkg-dummy ................... SUCCESS [  1.378 s]
[INFO] ------------------------------------------------------------------------
[INFO] BUILD SUCCESS
[INFO] ------------------------------------------------------------------------
[INFO] Total time:  03:57 min
[INFO] Finished at: 2022-05-17T05:47:07+02:00
[INFO] ------------------------------------------------------------------------
Waiting for Jenkins to finish collecting data
[JENKINS] Archiving /usr/share/tomcat8/.jenkins/jobs/RDF-Processing-Toolkit/workspace/pom.xml to org.aksw.rdf-processing-toolkit/rdf-processing-toolkit-parent/1.9.1-SNAPSHOT/rdf-processing-toolkit-parent-1.9.1-SNAPSHOT.pom
[JENKINS] Archiving /usr/share/tomcat8/.jenkins/jobs/RDF-Processing-Toolkit/workspace/rdf-processing-toolkit-pkg-parent/pom.xml to org.aksw.rdf-processing-toolkit/rdf-processing-toolkit-pkg-parent/1.9.1-SNAPSHOT/rdf-processing-toolkit-pkg-parent-1.9.1-SNAPSHOT.pom
[JENKINS] Archiving /usr/share/tomcat8/.jenkins/jobs/RDF-Processing-Toolkit/workspace/rdf-processing-toolkit-pkg-parent/rdf-processing-toolkit-pkg-dummy/pom.xml to org.aksw.rdf-processing-toolkit/rdf-processing-toolkit-pkg-dummy/1.9.1-SNAPSHOT/rdf-processing-toolkit-pkg-dummy-1.9.1-SNAPSHOT.pom
[JENKINS] Archiving /usr/share/tomcat8/.jenkins/jobs/RDF-Processing-Toolkit/workspace/rdf-processing-toolkit-pkg-parent/rdf-processing-toolkit-pkg-dummy/target/rdf-processing-toolkit-pkg-dummy-1.9.1-SNAPSHOT.jar to org.aksw.rdf-processing-toolkit/rdf-processing-toolkit-pkg-dummy/1.9.1-SNAPSHOT/rdf-processing-toolkit-pkg-dummy-1.9.1-SNAPSHOT.jar
[JENKINS] Archiving /usr/share/tomcat8/.jenkins/jobs/RDF-Processing-Toolkit/workspace/rdf-processing-toolkit-pkg-parent/rdf-processing-toolkit-pkg-deb-cli/pom.xml to org.aksw.rdf-processing-toolkit/rdf-processing-toolkit-pkg-deb-cli/1.9.1-SNAPSHOT/rdf-processing-toolkit-pkg-deb-cli-1.9.1-SNAPSHOT.pom
[JENKINS] Archiving /usr/share/tomcat8/.jenkins/jobs/RDF-Processing-Toolkit/workspace/rdf-processing-toolkit-pkg-parent/rdf-processing-toolkit-pkg-deb-cli/target/rdf-processing-toolkit-pkg-deb-cli-1.9.1-SNAPSHOT.jar to org.aksw.rdf-processing-toolkit/rdf-processing-toolkit-pkg-deb-cli/1.9.1-SNAPSHOT/rdf-processing-toolkit-pkg-deb-cli-1.9.1-SNAPSHOT.jar
[JENKINS] Archiving /usr/share/tomcat8/.jenkins/jobs/RDF-Processing-Toolkit/workspace/rdf-processing-toolkit-pkg-parent/rdf-processing-toolkit-pkg-uberjar-cli/pom.xml to org.aksw.rdf-processing-toolkit/rdf-processing-toolkit-pkg-uberjar-cli/1.9.1-SNAPSHOT/rdf-processing-toolkit-pkg-uberjar-cli-1.9.1-SNAPSHOT.pom
[JENKINS] Archiving /usr/share/tomcat8/.jenkins/jobs/RDF-Processing-Toolkit/workspace/rdf-processing-toolkit-pkg-parent/rdf-processing-toolkit-pkg-uberjar-cli/target/rdf-processing-toolkit-pkg-uberjar-cli-1.9.1-SNAPSHOT.jar to org.aksw.rdf-processing-toolkit/rdf-processing-toolkit-pkg-uberjar-cli/1.9.1-SNAPSHOT/rdf-processing-toolkit-pkg-uberjar-cli-1.9.1-SNAPSHOT.jar
[JENKINS] Archiving /usr/share/tomcat8/.jenkins/jobs/RDF-Processing-Toolkit/workspace/rdf-processing-toolkit-pkg-parent/rdf-processing-toolkit-pkg-docker-cli/pom.xml to org.aksw.rdf-processing-toolkit/rdf-processing-toolkit-pkg-docker-cli/1.9.1-SNAPSHOT/rdf-processing-toolkit-pkg-docker-cli-1.9.1-SNAPSHOT.pom
[JENKINS] Archiving /usr/share/tomcat8/.jenkins/jobs/RDF-Processing-Toolkit/workspace/rdf-processing-toolkit-pkg-parent/rdf-processing-toolkit-pkg-docker-cli/target/rdf-processing-toolkit-pkg-docker-cli-1.9.1-SNAPSHOT.jar to org.aksw.rdf-processing-toolkit/rdf-processing-toolkit-pkg-docker-cli/1.9.1-SNAPSHOT/rdf-processing-toolkit-pkg-docker-cli-1.9.1-SNAPSHOT.jar
[JENKINS] Archiving /usr/share/tomcat8/.jenkins/jobs/RDF-Processing-Toolkit/workspace/rdf-processing-toolkit-cli/pom.xml to org.aksw.rdf-processing-toolkit/rdf-processing-toolkit-cli/1.9.1-SNAPSHOT/rdf-processing-toolkit-cli-1.9.1-SNAPSHOT.pom
[JENKINS] Archiving /usr/share/tomcat8/.jenkins/jobs/RDF-Processing-Toolkit/workspace/rdf-processing-toolkit-cli/target/rdf-processing-toolkit-cli-1.9.1-SNAPSHOT.jar to org.aksw.rdf-processing-toolkit/rdf-processing-toolkit-cli/1.9.1-SNAPSHOT/rdf-processing-toolkit-cli-1.9.1-SNAPSHOT.jar
[JENKINS] Archiving /usr/share/tomcat8/.jenkins/jobs/RDF-Processing-Toolkit/workspace/rdf-processing-toolkit-cli/target/rdf-processing-toolkit-cli-1.9.1-SNAPSHOT-javadoc.jar to org.aksw.rdf-processing-toolkit/rdf-processing-toolkit-cli/1.9.1-SNAPSHOT/rdf-processing-toolkit-cli-1.9.1-SNAPSHOT-javadoc.jar
[JENKINS] Archiving /usr/share/tomcat8/.jenkins/jobs/RDF-Processing-Toolkit/workspace/rdf-processing-toolkit-cli/target/rdf-processing-toolkit-cli-1.9.1-SNAPSHOT-sources.jar to org.aksw.rdf-processing-toolkit/rdf-processing-toolkit-cli/1.9.1-SNAPSHOT/rdf-processing-toolkit-cli-1.9.1-SNAPSHOT-sources.jar
[JENKINS] Archiving /usr/share/tomcat8/.jenkins/jobs/RDF-Processing-Toolkit/workspace/rdf-processing-toolkit-pkg-parent/rdf-processing-toolkit-pkg-rpm-cli/pom.xml to org.aksw.rdf-processing-toolkit/rdf-processing-toolkit-pkg-rpm-cli/1.9.1-SNAPSHOT/rdf-processing-toolkit-pkg-rpm-cli-1.9.1-SNAPSHOT.pom
[JENKINS] Archiving /usr/share/tomcat8/.jenkins/jobs/RDF-Processing-Toolkit/workspace/rdf-processing-toolkit-pkg-parent/rdf-processing-toolkit-pkg-rpm-cli/target/rdf-processing-toolkit-cli-1.9.1-0.202205170346.noarch.rpm to org.aksw.rdf-processing-toolkit/rdf-processing-toolkit-pkg-rpm-cli/1.9.1-SNAPSHOT/rdf-processing-toolkit-pkg-rpm-cli-1.9.1-SNAPSHOT.rpm
[workspace] $ /bin/sh -xe /tmp/tomcat8-tomcat8-tmp/jenkins17612213890290100167.sh
channel stopped
+ + findxargs -L1 . sudo -name su *.deb
 cstadler /home/cstadler/bin/upload-deb-cstadler.sh
./rdf-processing-toolkit-debian-cli/target/rdf-processing-toolkit-cli_1.1.0~20210624170710_all.deb: Permission denied
Error 2 opening /tmp/rdf-processing-toolkit-cli_1.1.0~20210624170710_all.deb: No such file or directory
There have been errors!
Build step 'Execute shell' marked build as failure
Archiving artifacts
Finished: FAILURE