SuccessConsole Output

Skipping 88 KB.. Full Log
NFO] Downloading from apache-snapshot: https://repository.apache.org/content/repositories/snapshots/net/minidev/json-smart/maven-metadata.xml
[INFO] Downloading from apache.snapshots.https: https://repository.apache.org/content/repositories/snapshots/net/minidev/json-smart/maven-metadata.xml
[INFO] Downloading from repository.jboss.org: http://repository.jboss.org/nexus/content/groups/public/net/minidev/json-smart/maven-metadata.xml
[INFO] Downloaded from maven.aksw.internal: https://maven.aksw.org/repository/internal/net/minidev/json-smart/maven-metadata.xml (0 B at 0 B/s)
[INFO] Downloaded from central: https://repo.maven.apache.org/maven2/net/minidev/json-smart/maven-metadata.xml (0 B at 0 B/s)
[INFO] Downloaded from oss-sonatype-releases: https://oss.sonatype.org/content/repositories/releases/net/minidev/json-smart/maven-metadata.xml (0 B at 0 B/s)
[INFO] Downloading from maven.aksw.internal: https://maven.aksw.org/repository/internal/org/aksw/jenax/jenax-arq-rx/4.4.0-2/jenax-arq-rx-4.4.0-2.pom
[INFO] Downloading from maven.aksw.snapshots: https://maven.aksw.org/repository/snapshots/org/aksw/jenax/jenax-arq-rx/4.4.0-2/jenax-arq-rx-4.4.0-2.pom
[INFO] Downloading from central: https://repo.maven.apache.org/maven2/org/aksw/jenax/jenax-arq-rx/4.4.0-2/jenax-arq-rx-4.4.0-2.pom
[INFO] Downloaded from central: https://repo.maven.apache.org/maven2/org/aksw/jenax/jenax-arq-rx/4.4.0-2/jenax-arq-rx-4.4.0-2.pom (0 B at 0 B/s)
[INFO] Downloading from maven.aksw.internal: https://maven.aksw.org/repository/internal/org/aksw/jenax/jenax-parent/4.4.0-2/jenax-parent-4.4.0-2.pom
[INFO] Downloading from maven.aksw.snapshots: https://maven.aksw.org/repository/snapshots/org/aksw/jenax/jenax-parent/4.4.0-2/jenax-parent-4.4.0-2.pom
[INFO] Downloading from central: https://repo.maven.apache.org/maven2/org/aksw/jenax/jenax-parent/4.4.0-2/jenax-parent-4.4.0-2.pom
[INFO] Downloaded from central: https://repo.maven.apache.org/maven2/org/aksw/jenax/jenax-parent/4.4.0-2/jenax-parent-4.4.0-2.pom (0 B at 0 B/s)
[INFO] Downloading from maven.aksw.internal: https://maven.aksw.org/repository/internal/org/aksw/jenax/jenax-models-entityinfo/4.4.0-2/jenax-models-entityinfo-4.4.0-2.pom
[INFO] Downloading from maven.aksw.snapshots: https://maven.aksw.org/repository/snapshots/org/aksw/jenax/jenax-models-entityinfo/4.4.0-2/jenax-models-entityinfo-4.4.0-2.pom
[INFO] Downloading from central: https://repo.maven.apache.org/maven2/org/aksw/jenax/jenax-models-entityinfo/4.4.0-2/jenax-models-entityinfo-4.4.0-2.pom
[INFO] Downloaded from central: https://repo.maven.apache.org/maven2/org/aksw/jenax/jenax-models-entityinfo/4.4.0-2/jenax-models-entityinfo-4.4.0-2.pom (1.3 kB at 8.1 kB/s)
[INFO] Downloading from maven.aksw.internal: https://maven.aksw.org/repository/internal/org/aksw/jenax/jenax-models-parent/4.4.0-2/jenax-models-parent-4.4.0-2.pom
[INFO] Downloading from maven.aksw.snapshots: https://maven.aksw.org/repository/snapshots/org/aksw/jenax/jenax-models-parent/4.4.0-2/jenax-models-parent-4.4.0-2.pom
[INFO] Downloading from central: https://repo.maven.apache.org/maven2/org/aksw/jenax/jenax-models-parent/4.4.0-2/jenax-models-parent-4.4.0-2.pom
[INFO] Downloaded from central: https://repo.maven.apache.org/maven2/org/aksw/jenax/jenax-models-parent/4.4.0-2/jenax-models-parent-4.4.0-2.pom (0 B at 0 B/s)
[INFO] Downloading from maven.aksw.internal: https://maven.aksw.org/repository/internal/org/aksw/jenax/jenax-reprogen-core/4.4.0-2/jenax-reprogen-core-4.4.0-2.pom
[INFO] Downloading from maven.aksw.snapshots: https://maven.aksw.org/repository/snapshots/org/aksw/jenax/jenax-reprogen-core/4.4.0-2/jenax-reprogen-core-4.4.0-2.pom
[INFO] Downloading from central: https://repo.maven.apache.org/maven2/org/aksw/jenax/jenax-reprogen-core/4.4.0-2/jenax-reprogen-core-4.4.0-2.pom
[INFO] Downloaded from central: https://repo.maven.apache.org/maven2/org/aksw/jenax/jenax-reprogen-core/4.4.0-2/jenax-reprogen-core-4.4.0-2.pom (0 B at 0 B/s)
[INFO] Downloading from maven.aksw.internal: https://maven.aksw.org/repository/internal/org/aksw/jenax/jenax-reprogen-parent/4.4.0-2/jenax-reprogen-parent-4.4.0-2.pom
[INFO] Downloading from maven.aksw.snapshots: https://maven.aksw.org/repository/snapshots/org/aksw/jenax/jenax-reprogen-parent/4.4.0-2/jenax-reprogen-parent-4.4.0-2.pom
[INFO] Downloading from central: https://repo.maven.apache.org/maven2/org/aksw/jenax/jenax-reprogen-parent/4.4.0-2/jenax-reprogen-parent-4.4.0-2.pom
[INFO] Downloaded from central: https://repo.maven.apache.org/maven2/org/aksw/jenax/jenax-reprogen-parent/4.4.0-2/jenax-reprogen-parent-4.4.0-2.pom (0 B at 0 B/s)
[INFO] Downloading from maven.aksw.internal: https://maven.aksw.org/repository/internal/org/aksw/jenax/jenax-arq-collections/4.4.0-2/jenax-arq-collections-4.4.0-2.pom
[INFO] Downloading from maven.aksw.snapshots: https://maven.aksw.org/repository/snapshots/org/aksw/jenax/jenax-arq-collections/4.4.0-2/jenax-arq-collections-4.4.0-2.pom
[INFO] Downloading from central: https://repo.maven.apache.org/maven2/org/aksw/jenax/jenax-arq-collections/4.4.0-2/jenax-arq-collections-4.4.0-2.pom
[INFO] Downloaded from central: https://repo.maven.apache.org/maven2/org/aksw/jenax/jenax-arq-collections/4.4.0-2/jenax-arq-collections-4.4.0-2.pom (0 B at 0 B/s)
[INFO] Downloading from maven.aksw.internal: https://maven.aksw.org/repository/internal/org/aksw/jenax/jenax-resources-prefixes/4.4.0-2/jenax-resources-prefixes-4.4.0-2.pom
[INFO] Downloading from maven.aksw.snapshots: https://maven.aksw.org/repository/snapshots/org/aksw/jenax/jenax-resources-prefixes/4.4.0-2/jenax-resources-prefixes-4.4.0-2.pom
[INFO] Downloading from central: https://repo.maven.apache.org/maven2/org/aksw/jenax/jenax-resources-prefixes/4.4.0-2/jenax-resources-prefixes-4.4.0-2.pom
[INFO] Downloaded from central: https://repo.maven.apache.org/maven2/org/aksw/jenax/jenax-resources-prefixes/4.4.0-2/jenax-resources-prefixes-4.4.0-2.pom (0 B at 0 B/s)
[INFO] Downloading from maven.aksw.internal: https://maven.aksw.org/repository/internal/org/aksw/jenax/jenax-resources-parent/4.4.0-2/jenax-resources-parent-4.4.0-2.pom
[INFO] Downloading from maven.aksw.snapshots: https://maven.aksw.org/repository/snapshots/org/aksw/jenax/jenax-resources-parent/4.4.0-2/jenax-resources-parent-4.4.0-2.pom
[INFO] Downloading from central: https://repo.maven.apache.org/maven2/org/aksw/jenax/jenax-resources-parent/4.4.0-2/jenax-resources-parent-4.4.0-2.pom
[INFO] Downloaded from central: https://repo.maven.apache.org/maven2/org/aksw/jenax/jenax-resources-parent/4.4.0-2/jenax-resources-parent-4.4.0-2.pom (0 B at 0 B/s)
[INFO] Downloading from maven.aksw.internal: https://maven.aksw.org/repository/internal/org/aksw/jenax/jenax-arq-utils/4.4.0-2/jenax-arq-utils-4.4.0-2.pom
[INFO] Downloading from maven.aksw.snapshots: https://maven.aksw.org/repository/snapshots/org/aksw/jenax/jenax-arq-utils/4.4.0-2/jenax-arq-utils-4.4.0-2.pom
[INFO] Downloading from central: https://repo.maven.apache.org/maven2/org/aksw/jenax/jenax-arq-utils/4.4.0-2/jenax-arq-utils-4.4.0-2.pom
[INFO] Downloaded from central: https://repo.maven.apache.org/maven2/org/aksw/jenax/jenax-arq-utils/4.4.0-2/jenax-arq-utils-4.4.0-2.pom (0 B at 0 B/s)
[INFO] Downloading from maven.aksw.internal: https://maven.aksw.org/repository/internal/org/aksw/jenax/jenax-annotations-parent/4.4.0-2/jenax-annotations-parent-4.4.0-2.pom
[INFO] Downloading from maven.aksw.snapshots: https://maven.aksw.org/repository/snapshots/org/aksw/jenax/jenax-annotations-parent/4.4.0-2/jenax-annotations-parent-4.4.0-2.pom
[INFO] Downloading from central: https://repo.maven.apache.org/maven2/org/aksw/jenax/jenax-annotations-parent/4.4.0-2/jenax-annotations-parent-4.4.0-2.pom
[INFO] Downloaded from central: https://repo.maven.apache.org/maven2/org/aksw/jenax/jenax-annotations-parent/4.4.0-2/jenax-annotations-parent-4.4.0-2.pom (0 B at 0 B/s)
[INFO] Downloading from maven.aksw.internal: https://maven.aksw.org/repository/internal/org/aksw/jenax/jenax-reprogen-shared/4.4.0-2/jenax-reprogen-shared-4.4.0-2.pom
[INFO] Downloading from maven.aksw.snapshots: https://maven.aksw.org/repository/snapshots/org/aksw/jenax/jenax-reprogen-shared/4.4.0-2/jenax-reprogen-shared-4.4.0-2.pom
[INFO] Downloading from central: https://repo.maven.apache.org/maven2/org/aksw/jenax/jenax-reprogen-shared/4.4.0-2/jenax-reprogen-shared-4.4.0-2.pom
[INFO] Downloaded from central: https://repo.maven.apache.org/maven2/org/aksw/jenax/jenax-reprogen-shared/4.4.0-2/jenax-reprogen-shared-4.4.0-2.pom (0 B at 0 B/s)
[INFO] Downloading from maven.aksw.internal: https://maven.aksw.org/repository/internal/org/apache/jena/jena-rdfconnection/4.4.0/jena-rdfconnection-4.4.0.pom
[INFO] Downloading from maven.aksw.snapshots: https://maven.aksw.org/repository/snapshots/org/apache/jena/jena-rdfconnection/4.4.0/jena-rdfconnection-4.4.0.pom
[INFO] Downloading from central: https://repo.maven.apache.org/maven2/org/apache/jena/jena-rdfconnection/4.4.0/jena-rdfconnection-4.4.0.pom
[INFO] Downloaded from central: https://repo.maven.apache.org/maven2/org/apache/jena/jena-rdfconnection/4.4.0/jena-rdfconnection-4.4.0.pom (0 B at 0 B/s)
[INFO] Downloading from maven.aksw.internal: https://maven.aksw.org/repository/internal/org/aksw/jenax/jenax-arq-connection-core/4.4.0-2/jenax-arq-connection-core-4.4.0-2.pom
[INFO] Downloading from maven.aksw.snapshots: https://maven.aksw.org/repository/snapshots/org/aksw/jenax/jenax-arq-connection-core/4.4.0-2/jenax-arq-connection-core-4.4.0-2.pom
[INFO] Downloading from central: https://repo.maven.apache.org/maven2/org/aksw/jenax/jenax-arq-connection-core/4.4.0-2/jenax-arq-connection-core-4.4.0-2.pom
[INFO] Downloaded from central: https://repo.maven.apache.org/maven2/org/aksw/jenax/jenax-arq-connection-core/4.4.0-2/jenax-arq-connection-core-4.4.0-2.pom (0 B at 0 B/s)
[INFO] Downloading from maven.aksw.internal: https://maven.aksw.org/repository/internal/org/aksw/jenax/jenax-arq-stmt/4.4.0-2/jenax-arq-stmt-4.4.0-2.pom
[INFO] Downloading from maven.aksw.snapshots: https://maven.aksw.org/repository/snapshots/org/aksw/jenax/jenax-arq-stmt/4.4.0-2/jenax-arq-stmt-4.4.0-2.pom
[INFO] Downloading from central: https://repo.maven.apache.org/maven2/org/aksw/jenax/jenax-arq-stmt/4.4.0-2/jenax-arq-stmt-4.4.0-2.pom
[INFO] Downloaded from central: https://repo.maven.apache.org/maven2/org/aksw/jenax/jenax-arq-stmt/4.4.0-2/jenax-arq-stmt-4.4.0-2.pom (0 B at 0 B/s)
[INFO] Downloading from maven.aksw.internal: https://maven.aksw.org/repository/internal/org/aksw/jenax/jenax-arq-aggregators/4.4.0-2/jenax-arq-aggregators-4.4.0-2.pom
[INFO] Downloading from maven.aksw.snapshots: https://maven.aksw.org/repository/snapshots/org/aksw/jenax/jenax-arq-aggregators/4.4.0-2/jenax-arq-aggregators-4.4.0-2.pom
[INFO] Downloading from central: https://repo.maven.apache.org/maven2/org/aksw/jenax/jenax-arq-aggregators/4.4.0-2/jenax-arq-aggregators-4.4.0-2.pom
[INFO] Downloaded from central: https://repo.maven.apache.org/maven2/org/aksw/jenax/jenax-arq-aggregators/4.4.0-2/jenax-arq-aggregators-4.4.0-2.pom (0 B at 0 B/s)
[INFO] Downloading from maven.aksw.internal: https://maven.aksw.org/repository/internal/org/aksw/jenax/jenax-arq-functions/4.4.0-2/jenax-arq-functions-4.4.0-2.pom
[INFO] Downloading from maven.aksw.snapshots: https://maven.aksw.org/repository/snapshots/org/aksw/jenax/jenax-arq-functions/4.4.0-2/jenax-arq-functions-4.4.0-2.pom
[INFO] Downloading from central: https://repo.maven.apache.org/maven2/org/aksw/jenax/jenax-arq-functions/4.4.0-2/jenax-arq-functions-4.4.0-2.pom
[INFO] Downloaded from central: https://repo.maven.apache.org/maven2/org/aksw/jenax/jenax-arq-functions/4.4.0-2/jenax-arq-functions-4.4.0-2.pom (933 B at 18 kB/s)
[INFO] Downloading from maven.aksw.internal: https://maven.aksw.org/repository/internal/org/aksw/jenax/jenax-arq-datasets-orderaware/4.4.0-2/jenax-arq-datasets-orderaware-4.4.0-2.pom
[INFO] Downloading from maven.aksw.snapshots: https://maven.aksw.org/repository/snapshots/org/aksw/jenax/jenax-arq-datasets-orderaware/4.4.0-2/jenax-arq-datasets-orderaware-4.4.0-2.pom
[INFO] Downloading from central: https://repo.maven.apache.org/maven2/org/aksw/jenax/jenax-arq-datasets-orderaware/4.4.0-2/jenax-arq-datasets-orderaware-4.4.0-2.pom
[INFO] Downloaded from central: https://repo.maven.apache.org/maven2/org/aksw/jenax/jenax-arq-datasets-orderaware/4.4.0-2/jenax-arq-datasets-orderaware-4.4.0-2.pom (1.2 kB at 32 kB/s)
[INFO] Downloading from maven.aksw.internal: https://maven.aksw.org/repository/internal/org/aksw/jenax/jenax-arq-datasets-parent/4.4.0-2/jenax-arq-datasets-parent-4.4.0-2.pom
[INFO] Downloading from maven.aksw.snapshots: https://maven.aksw.org/repository/snapshots/org/aksw/jenax/jenax-arq-datasets-parent/4.4.0-2/jenax-arq-datasets-parent-4.4.0-2.pom
[INFO] Downloading from central: https://repo.maven.apache.org/maven2/org/aksw/jenax/jenax-arq-datasets-parent/4.4.0-2/jenax-arq-datasets-parent-4.4.0-2.pom
[INFO] Downloaded from central: https://repo.maven.apache.org/maven2/org/aksw/jenax/jenax-arq-datasets-parent/4.4.0-2/jenax-arq-datasets-parent-4.4.0-2.pom (665 B at 20 kB/s)
[INFO] Downloading from maven.aksw.internal: https://maven.aksw.org/repository/internal/org/apache/jena/jena-dboe-storage/4.4.0/jena-dboe-storage-4.4.0.pom
[INFO] Downloading from maven.aksw.snapshots: https://maven.aksw.org/repository/snapshots/org/apache/jena/jena-dboe-storage/4.4.0/jena-dboe-storage-4.4.0.pom
[INFO] Downloading from central: https://repo.maven.apache.org/maven2/org/apache/jena/jena-dboe-storage/4.4.0/jena-dboe-storage-4.4.0.pom
[INFO] Downloaded from central: https://repo.maven.apache.org/maven2/org/apache/jena/jena-dboe-storage/4.4.0/jena-dboe-storage-4.4.0.pom (1.9 kB at 59 kB/s)
[INFO] Downloading from maven.aksw.internal: https://maven.aksw.org/repository/internal/org/apache/jena/jena-db/4.4.0/jena-db-4.4.0.pom
[INFO] Downloading from maven.aksw.snapshots: https://maven.aksw.org/repository/snapshots/org/apache/jena/jena-db/4.4.0/jena-db-4.4.0.pom
[INFO] Downloading from central: https://repo.maven.apache.org/maven2/org/apache/jena/jena-db/4.4.0/jena-db-4.4.0.pom
[INFO] Downloaded from central: https://repo.maven.apache.org/maven2/org/apache/jena/jena-db/4.4.0/jena-db-4.4.0.pom (3.5 kB at 104 kB/s)
[INFO] Downloading from maven.aksw.internal: https://maven.aksw.org/repository/internal/org/apache/jena/jena-dboe-trans-data/4.4.0/jena-dboe-trans-data-4.4.0.pom
[INFO] Downloading from maven.aksw.snapshots: https://maven.aksw.org/repository/snapshots/org/apache/jena/jena-dboe-trans-data/4.4.0/jena-dboe-trans-data-4.4.0.pom
[INFO] Downloading from central: https://repo.maven.apache.org/maven2/org/apache/jena/jena-dboe-trans-data/4.4.0/jena-dboe-trans-data-4.4.0.pom
[INFO] Downloaded from central: https://repo.maven.apache.org/maven2/org/apache/jena/jena-dboe-trans-data/4.4.0/jena-dboe-trans-data-4.4.0.pom (2.6 kB at 74 kB/s)
[INFO] Downloading from maven.aksw.internal: https://maven.aksw.org/repository/internal/org/apache/jena/jena-dboe-transaction/4.4.0/jena-dboe-transaction-4.4.0.pom
[INFO] Downloading from maven.aksw.snapshots: https://maven.aksw.org/repository/snapshots/org/apache/jena/jena-dboe-transaction/4.4.0/jena-dboe-transaction-4.4.0.pom
[INFO] Downloading from central: https://repo.maven.apache.org/maven2/org/apache/jena/jena-dboe-transaction/4.4.0/jena-dboe-transaction-4.4.0.pom
[INFO] Downloaded from central: https://repo.maven.apache.org/maven2/org/apache/jena/jena-dboe-transaction/4.4.0/jena-dboe-transaction-4.4.0.pom (1.7 kB at 43 kB/s)
[INFO] Downloading from maven.aksw.internal: https://maven.aksw.org/repository/internal/org/apache/jena/jena-dboe-base/4.4.0/jena-dboe-base-4.4.0.pom
[INFO] Downloading from maven.aksw.snapshots: https://maven.aksw.org/repository/snapshots/org/apache/jena/jena-dboe-base/4.4.0/jena-dboe-base-4.4.0.pom
[INFO] Downloading from central: https://repo.maven.apache.org/maven2/org/apache/jena/jena-dboe-base/4.4.0/jena-dboe-base-4.4.0.pom
[INFO] Downloaded from central: https://repo.maven.apache.org/maven2/org/apache/jena/jena-dboe-base/4.4.0/jena-dboe-base-4.4.0.pom (2.5 kB at 75 kB/s)
[INFO] Downloading from maven.aksw.internal: https://maven.aksw.org/repository/internal/org/apache/jena/jena-dboe-index/4.4.0/jena-dboe-index-4.4.0.pom
[INFO] Downloading from maven.aksw.snapshots: https://maven.aksw.org/repository/snapshots/org/apache/jena/jena-dboe-index/4.4.0/jena-dboe-index-4.4.0.pom
[INFO] Downloading from central: https://repo.maven.apache.org/maven2/org/apache/jena/jena-dboe-index/4.4.0/jena-dboe-index-4.4.0.pom
[INFO] Downloaded from central: https://repo.maven.apache.org/maven2/org/apache/jena/jena-dboe-index/4.4.0/jena-dboe-index-4.4.0.pom (1.6 kB at 37 kB/s)
[INFO] Downloading from maven.aksw.internal: https://maven.aksw.org/repository/internal/org/aksw/jenax/jenax-arq-datasets-oneng/4.4.0-2/jenax-arq-datasets-oneng-4.4.0-2.pom
[INFO] Downloading from maven.aksw.snapshots: https://maven.aksw.org/repository/snapshots/org/aksw/jenax/jenax-arq-datasets-oneng/4.4.0-2/jenax-arq-datasets-oneng-4.4.0-2.pom
[INFO] Downloading from central: https://repo.maven.apache.org/maven2/org/aksw/jenax/jenax-arq-datasets-oneng/4.4.0-2/jenax-arq-datasets-oneng-4.4.0-2.pom
[INFO] Downloaded from central: https://repo.maven.apache.org/maven2/org/aksw/jenax/jenax-arq-datasets-oneng/4.4.0-2/jenax-arq-datasets-oneng-4.4.0-2.pom (1.1 kB at 8.7 kB/s)
[INFO] Downloading from maven.aksw.internal: https://maven.aksw.org/repository/internal/org/aksw/jenax/jenax-arq-rdfnode-in-dataset/4.4.0-2/jenax-arq-rdfnode-in-dataset-4.4.0-2.pom
[INFO] Downloading from maven.aksw.snapshots: https://maven.aksw.org/repository/snapshots/org/aksw/jenax/jenax-arq-rdfnode-in-dataset/4.4.0-2/jenax-arq-rdfnode-in-dataset-4.4.0-2.pom
[INFO] Downloading from central: https://repo.maven.apache.org/maven2/org/aksw/jenax/jenax-arq-rdfnode-in-dataset/4.4.0-2/jenax-arq-rdfnode-in-dataset-4.4.0-2.pom
[INFO] Downloaded from central: https://repo.maven.apache.org/maven2/org/aksw/jenax/jenax-arq-rdfnode-in-dataset/4.4.0-2/jenax-arq-rdfnode-in-dataset-4.4.0-2.pom (1.1 kB at 5.1 kB/s)
[INFO] Downloading from maven.aksw.internal: https://maven.aksw.org/repository/internal/org/aksw/jenax/jenax-arq-relations/4.4.0-2/jenax-arq-relations-4.4.0-2.pom
[INFO] Downloading from maven.aksw.snapshots: https://maven.aksw.org/repository/snapshots/org/aksw/jenax/jenax-arq-relations/4.4.0-2/jenax-arq-relations-4.4.0-2.pom
[INFO] Downloading from central: https://repo.maven.apache.org/maven2/org/aksw/jenax/jenax-arq-relations/4.4.0-2/jenax-arq-relations-4.4.0-2.pom
[INFO] Downloaded from central: https://repo.maven.apache.org/maven2/org/aksw/jenax/jenax-arq-relations/4.4.0-2/jenax-arq-relations-4.4.0-2.pom (907 B at 7.3 kB/s)
[INFO] Downloading from maven.aksw.internal: https://maven.aksw.org/repository/internal/org/aksw/commons/aksw-commons-models-csvw-univocity/0.9.3/aksw-commons-models-csvw-univocity-0.9.3.pom
[INFO] Downloading from maven.aksw.snapshots: https://maven.aksw.org/repository/snapshots/org/aksw/commons/aksw-commons-models-csvw-univocity/0.9.3/aksw-commons-models-csvw-univocity-0.9.3.pom
[INFO] Downloading from central: https://repo.maven.apache.org/maven2/org/aksw/commons/aksw-commons-models-csvw-univocity/0.9.3/aksw-commons-models-csvw-univocity-0.9.3.pom
[INFO] Downloading from oss-sonatype-releases: https://oss.sonatype.org/content/repositories/releases/org/aksw/commons/aksw-commons-models-csvw-univocity/0.9.3/aksw-commons-models-csvw-univocity-0.9.3.pom
[INFO] Downloaded from oss-sonatype-releases: https://oss.sonatype.org/content/repositories/releases/org/aksw/commons/aksw-commons-models-csvw-univocity/0.9.3/aksw-commons-models-csvw-univocity-0.9.3.pom (767 B at 2.0 kB/s)
[INFO] Downloading from maven.aksw.internal: https://maven.aksw.org/repository/internal/org/aksw/jenax/jenax-rx-ops-syscall/4.5.0-1-SNAPSHOT/maven-metadata.xml
[INFO] Downloading from maven.aksw.snapshots: https://maven.aksw.org/repository/snapshots/org/aksw/jenax/jenax-rx-ops-syscall/4.5.0-1-SNAPSHOT/maven-metadata.xml
[INFO] Downloading from apache-repo-snapshots: https://repository.apache.org/content/repositories/snapshots/org/aksw/jenax/jenax-rx-ops-syscall/4.5.0-1-SNAPSHOT/maven-metadata.xml
[INFO] Downloaded from maven.aksw.snapshots: https://maven.aksw.org/repository/snapshots/org/aksw/jenax/jenax-rx-ops-syscall/4.5.0-1-SNAPSHOT/maven-metadata.xml (0 B at 0 B/s)
[INFO] Downloading from maven.aksw.internal: https://maven.aksw.org/repository/internal/org/aksw/commons/aksw-commons-io-syscalls/0.9.5-SNAPSHOT/maven-metadata.xml
[INFO] Downloading from apache-repo-snapshots: https://repository.apache.org/content/repositories/snapshots/org/aksw/commons/aksw-commons-io-syscalls/0.9.5-SNAPSHOT/maven-metadata.xml
[INFO] Downloading from jts-snapshots: https://repo.eclipse.org/content/repositories/jts-snapshots/org/aksw/commons/aksw-commons-io-syscalls/0.9.5-SNAPSHOT/maven-metadata.xml
[INFO] Downloading from maven.aksw.snapshots: https://maven.aksw.org/repository/snapshots/org/aksw/commons/aksw-commons-io-syscalls/0.9.5-SNAPSHOT/maven-metadata.xml
[INFO] Downloaded from maven.aksw.snapshots: https://maven.aksw.org/repository/snapshots/org/aksw/commons/aksw-commons-io-syscalls/0.9.5-SNAPSHOT/maven-metadata.xml (377 B at 856 B/s)
[INFO] Downloading from jts-snapshots: https://repo.eclipse.org/content/repositories/jts-snapshots/org/aksw/commons/aksw-commons-io-syscalls/0.9.5-SNAPSHOT/maven-metadata.xml
[INFO] Downloading from maven.aksw.internal: https://maven.aksw.org/repository/internal/org/aksw/commons/aksw-commons-io-syscalls/0.9.5-SNAPSHOT/aksw-commons-io-syscalls-0.9.5-20220614.164747-5.pom
[INFO] Downloading from maven.aksw.snapshots: https://maven.aksw.org/repository/snapshots/org/aksw/commons/aksw-commons-io-syscalls/0.9.5-SNAPSHOT/aksw-commons-io-syscalls-0.9.5-20220614.164747-5.pom
[INFO] Downloaded from maven.aksw.snapshots: https://maven.aksw.org/repository/snapshots/org/aksw/commons/aksw-commons-io-syscalls/0.9.5-SNAPSHOT/aksw-commons-io-syscalls-0.9.5-20220614.164747-5.pom (0 B at 0 B/s)
[INFO] Downloading from maven.aksw.internal: https://maven.aksw.org/repository/internal/org/aksw/jenax/jenax-arq-algebra/4.5.0-1-SNAPSHOT/maven-metadata.xml
[INFO] Downloading from maven.aksw.snapshots: https://maven.aksw.org/repository/snapshots/org/aksw/jenax/jenax-arq-algebra/4.5.0-1-SNAPSHOT/maven-metadata.xml
[INFO] Downloading from apache-repo-snapshots: https://repository.apache.org/content/repositories/snapshots/org/aksw/jenax/jenax-arq-algebra/4.5.0-1-SNAPSHOT/maven-metadata.xml
[INFO] Downloaded from maven.aksw.snapshots: https://maven.aksw.org/repository/snapshots/org/aksw/jenax/jenax-arq-algebra/4.5.0-1-SNAPSHOT/maven-metadata.xml (371 B at 53 kB/s)
[INFO] Downloading from maven.aksw.internal: https://maven.aksw.org/repository/internal/org/aksw/jenax/jenax-arq-propertypaths/4.5.0-1-SNAPSHOT/maven-metadata.xml
[INFO] Downloading from maven.aksw.snapshots: https://maven.aksw.org/repository/snapshots/org/aksw/jenax/jenax-arq-propertypaths/4.5.0-1-SNAPSHOT/maven-metadata.xml
[INFO] Downloading from apache-repo-snapshots: https://repository.apache.org/content/repositories/snapshots/org/aksw/jenax/jenax-arq-propertypaths/4.5.0-1-SNAPSHOT/maven-metadata.xml
[INFO] Downloading from jts-snapshots: https://repo.eclipse.org/content/repositories/jts-snapshots/org/aksw/jenax/jenax-arq-propertypaths/4.5.0-1-SNAPSHOT/maven-metadata.xml
[INFO] Downloaded from maven.aksw.snapshots: https://maven.aksw.org/repository/snapshots/org/aksw/jenax/jenax-arq-propertypaths/4.5.0-1-SNAPSHOT/maven-metadata.xml (0 B at 0 B/s)
[INFO] Downloading from maven.aksw.internal: https://maven.aksw.org/repository/internal/org/aksw/jenax/jenax-arq-propertypaths/4.5.0-1-SNAPSHOT/jenax-arq-propertypaths-4.5.0-1-20220614.162628-53.pom
[INFO] Downloading from maven.aksw.snapshots: https://maven.aksw.org/repository/snapshots/org/aksw/jenax/jenax-arq-propertypaths/4.5.0-1-SNAPSHOT/jenax-arq-propertypaths-4.5.0-1-20220614.162628-53.pom
[INFO] Downloaded from maven.aksw.snapshots: https://maven.aksw.org/repository/snapshots/org/aksw/jenax/jenax-arq-propertypaths/4.5.0-1-SNAPSHOT/jenax-arq-propertypaths-4.5.0-1-20220614.162628-53.pom (0 B at 0 B/s)
[INFO] Downloading from maven.aksw.internal: https://maven.aksw.org/repository/internal/org/aksw/jenax/jenax-arq-udf/4.5.0-1-SNAPSHOT/maven-metadata.xml
[INFO] Downloading from maven.aksw.snapshots: https://maven.aksw.org/repository/snapshots/org/aksw/jenax/jenax-arq-udf/4.5.0-1-SNAPSHOT/maven-metadata.xml
[INFO] Downloading from apache-repo-snapshots: https://repository.apache.org/content/repositories/snapshots/org/aksw/jenax/jenax-arq-udf/4.5.0-1-SNAPSHOT/maven-metadata.xml
[INFO] Downloading from jts-snapshots: https://repo.eclipse.org/content/repositories/jts-snapshots/org/aksw/jenax/jenax-arq-udf/4.5.0-1-SNAPSHOT/maven-metadata.xml
[INFO] Downloaded from maven.aksw.snapshots: https://maven.aksw.org/repository/snapshots/org/aksw/jenax/jenax-arq-udf/4.5.0-1-SNAPSHOT/maven-metadata.xml (367 B at 1.1 kB/s)
[INFO] Downloading from maven.aksw.internal: https://maven.aksw.org/repository/internal/org/aksw/jenax/jenax-arq-udf/4.5.0-1-SNAPSHOT/jenax-arq-udf-4.5.0-1-20220614.163520-52.pom
[INFO] Downloading from maven.aksw.snapshots: https://maven.aksw.org/repository/snapshots/org/aksw/jenax/jenax-arq-udf/4.5.0-1-SNAPSHOT/jenax-arq-udf-4.5.0-1-20220614.163520-52.pom
[INFO] Downloaded from maven.aksw.snapshots: https://maven.aksw.org/repository/snapshots/org/aksw/jenax/jenax-arq-udf/4.5.0-1-SNAPSHOT/jenax-arq-udf-4.5.0-1-20220614.163520-52.pom (0 B at 0 B/s)
[INFO] Downloading from maven.aksw.internal: https://maven.aksw.org/repository/internal/org/aksw/jenax/jenax-arq-hdt/4.5.0-1-SNAPSHOT/maven-metadata.xml
[INFO] Downloading from maven.aksw.snapshots: https://maven.aksw.org/repository/snapshots/org/aksw/jenax/jenax-arq-hdt/4.5.0-1-SNAPSHOT/maven-metadata.xml
[INFO] Downloading from apache-repo-snapshots: https://repository.apache.org/content/repositories/snapshots/org/aksw/jenax/jenax-arq-hdt/4.5.0-1-SNAPSHOT/maven-metadata.xml
[INFO] Downloaded from maven.aksw.snapshots: https://maven.aksw.org/repository/snapshots/org/aksw/jenax/jenax-arq-hdt/4.5.0-1-SNAPSHOT/maven-metadata.xml (367 B at 729 B/s)
[INFO] Downloading from maven.aksw.internal: https://maven.aksw.org/repository/internal/org/aksw/jenax/jenax-arq-plugins-bundle/4.5.0-1-SNAPSHOT/maven-metadata.xml
[INFO] Downloading from maven.aksw.snapshots: https://maven.aksw.org/repository/snapshots/org/aksw/jenax/jenax-arq-plugins-bundle/4.5.0-1-SNAPSHOT/maven-metadata.xml
[INFO] Downloading from apache-repo-snapshots: https://repository.apache.org/content/repositories/snapshots/org/aksw/jenax/jenax-arq-plugins-bundle/4.5.0-1-SNAPSHOT/maven-metadata.xml
[INFO] Downloaded from maven.aksw.snapshots: https://maven.aksw.org/repository/snapshots/org/aksw/jenax/jenax-arq-plugins-bundle/4.5.0-1-SNAPSHOT/maven-metadata.xml (378 B at 47 kB/s)
[INFO] Downloading from maven.aksw.internal: https://maven.aksw.org/repository/internal/org/aksw/jenax/jenax-arq-plugins-bundle/4.5.0-1-SNAPSHOT/jenax-arq-plugins-bundle-4.5.0-1-20220614.163801-57.pom
[INFO] Downloading from maven.aksw.snapshots: https://maven.aksw.org/repository/snapshots/org/aksw/jenax/jenax-arq-plugins-bundle/4.5.0-1-SNAPSHOT/jenax-arq-plugins-bundle-4.5.0-1-20220614.163801-57.pom
[INFO] Downloaded from maven.aksw.snapshots: https://maven.aksw.org/repository/snapshots/org/aksw/jenax/jenax-arq-plugins-bundle/4.5.0-1-SNAPSHOT/jenax-arq-plugins-bundle-4.5.0-1-20220614.163801-57.pom (5.9 kB at 840 kB/s)
[INFO] Downloading from maven.aksw.internal: https://maven.aksw.org/repository/internal/org/aksw/jenax/jenax-arq-plugins-datatypes/4.5.0-1-SNAPSHOT/maven-metadata.xml
[INFO] Downloading from maven.aksw.snapshots: https://maven.aksw.org/repository/snapshots/org/aksw/jenax/jenax-arq-plugins-datatypes/4.5.0-1-SNAPSHOT/maven-metadata.xml
[INFO] Downloading from apache-repo-snapshots: https://repository.apache.org/content/repositories/snapshots/org/aksw/jenax/jenax-arq-plugins-datatypes/4.5.0-1-SNAPSHOT/maven-metadata.xml
[INFO] Downloading from jts-snapshots: https://repo.eclipse.org/content/repositories/jts-snapshots/org/aksw/jenax/jenax-arq-plugins-datatypes/4.5.0-1-SNAPSHOT/maven-metadata.xml
[INFO] Downloaded from maven.aksw.snapshots: https://maven.aksw.org/repository/snapshots/org/aksw/jenax/jenax-arq-plugins-datatypes/4.5.0-1-SNAPSHOT/maven-metadata.xml (0 B at 0 B/s)
[INFO] Downloading from maven.aksw.internal: https://maven.aksw.org/repository/internal/org/aksw/jenax/jenax-arq-plugins-datatypes/4.5.0-1-SNAPSHOT/jenax-arq-plugins-datatypes-4.5.0-1-20220614.163645-56.pom
[INFO] Downloading from maven.aksw.snapshots: https://maven.aksw.org/repository/snapshots/org/aksw/jenax/jenax-arq-plugins-datatypes/4.5.0-1-SNAPSHOT/jenax-arq-plugins-datatypes-4.5.0-1-20220614.163645-56.pom
[INFO] Downloaded from maven.aksw.snapshots: https://maven.aksw.org/repository/snapshots/org/aksw/jenax/jenax-arq-plugins-datatypes/4.5.0-1-SNAPSHOT/jenax-arq-plugins-datatypes-4.5.0-1-20220614.163645-56.pom (1.2 kB at 199 kB/s)
[INFO] Downloading from maven.aksw.internal: https://maven.aksw.org/repository/internal/org/aksw/jenax/jenax-models-dcat-api/4.5.0-1-SNAPSHOT/maven-metadata.xml
[INFO] Downloading from maven.aksw.snapshots: https://maven.aksw.org/repository/snapshots/org/aksw/jenax/jenax-models-dcat-api/4.5.0-1-SNAPSHOT/maven-metadata.xml
[INFO] Downloading from apache-repo-snapshots: https://repository.apache.org/content/repositories/snapshots/org/aksw/jenax/jenax-models-dcat-api/4.5.0-1-SNAPSHOT/maven-metadata.xml
[INFO] Downloading from jts-snapshots: https://repo.eclipse.org/content/repositories/jts-snapshots/org/aksw/jenax/jenax-models-dcat-api/4.5.0-1-SNAPSHOT/maven-metadata.xml
[INFO] Downloaded from maven.aksw.snapshots: https://maven.aksw.org/repository/snapshots/org/aksw/jenax/jenax-models-dcat-api/4.5.0-1-SNAPSHOT/maven-metadata.xml (375 B at 62 kB/s)
[INFO] Downloading from maven.aksw.internal: https://maven.aksw.org/repository/internal/org/aksw/jenax/jenax-models-dcat-api/4.5.0-1-SNAPSHOT/jenax-models-dcat-api-4.5.0-1-20220614.163658-50.pom
[INFO] Downloading from maven.aksw.snapshots: https://maven.aksw.org/repository/snapshots/org/aksw/jenax/jenax-models-dcat-api/4.5.0-1-SNAPSHOT/jenax-models-dcat-api-4.5.0-1-20220614.163658-50.pom
[INFO] Downloaded from maven.aksw.snapshots: https://maven.aksw.org/repository/snapshots/org/aksw/jenax/jenax-models-dcat-api/4.5.0-1-SNAPSHOT/jenax-models-dcat-api-4.5.0-1-20220614.163658-50.pom (1.4 kB at 234 kB/s)
[INFO] Downloading from maven.aksw.internal: https://maven.aksw.org/repository/internal/org/aksw/jenax/jenax-functionbinder-core/4.5.0-1-SNAPSHOT/maven-metadata.xml
[INFO] Downloading from maven.aksw.snapshots: https://maven.aksw.org/repository/snapshots/org/aksw/jenax/jenax-functionbinder-core/4.5.0-1-SNAPSHOT/maven-metadata.xml
[INFO] Downloading from apache-repo-snapshots: https://repository.apache.org/content/repositories/snapshots/org/aksw/jenax/jenax-functionbinder-core/4.5.0-1-SNAPSHOT/maven-metadata.xml
[INFO] Downloading from jts-snapshots: https://repo.eclipse.org/content/repositories/jts-snapshots/org/aksw/jenax/jenax-functionbinder-core/4.5.0-1-SNAPSHOT/maven-metadata.xml
[INFO] Downloaded from maven.aksw.snapshots: https://maven.aksw.org/repository/snapshots/org/aksw/jenax/jenax-functionbinder-core/4.5.0-1-SNAPSHOT/maven-metadata.xml (379 B at 54 kB/s)
[INFO] Downloading from maven.aksw.internal: https://maven.aksw.org/repository/internal/org/aksw/jenax/jenax-functionbinder-core/4.5.0-1-SNAPSHOT/jenax-functionbinder-core-4.5.0-1-20220614.163726-48.pom
[INFO] Downloading from maven.aksw.snapshots: https://maven.aksw.org/repository/snapshots/org/aksw/jenax/jenax-functionbinder-core/4.5.0-1-SNAPSHOT/jenax-functionbinder-core-4.5.0-1-20220614.163726-48.pom
[INFO] Downloaded from maven.aksw.snapshots: https://maven.aksw.org/repository/snapshots/org/aksw/jenax/jenax-functionbinder-core/4.5.0-1-SNAPSHOT/jenax-functionbinder-core-4.5.0-1-20220614.163726-48.pom (1.6 kB at 232 kB/s)
[INFO] Downloading from maven.aksw.internal: https://maven.aksw.org/repository/internal/org/aksw/jenax/jenax-functionbinder-parent/4.5.0-1-SNAPSHOT/maven-metadata.xml
[INFO] Downloading from apache-repo-snapshots: https://repository.apache.org/content/repositories/snapshots/org/aksw/jenax/jenax-functionbinder-parent/4.5.0-1-SNAPSHOT/maven-metadata.xml
[INFO] Downloading from maven.aksw.snapshots: https://maven.aksw.org/repository/snapshots/org/aksw/jenax/jenax-functionbinder-parent/4.5.0-1-SNAPSHOT/maven-metadata.xml
[INFO] Downloading from jts-snapshots: https://repo.eclipse.org/content/repositories/jts-snapshots/org/aksw/jenax/jenax-functionbinder-parent/4.5.0-1-SNAPSHOT/maven-metadata.xml
[INFO] Downloaded from maven.aksw.snapshots: https://maven.aksw.org/repository/snapshots/org/aksw/jenax/jenax-functionbinder-parent/4.5.0-1-SNAPSHOT/maven-metadata.xml (381 B at 54 kB/s)
[INFO] Downloading from maven.aksw.snapshots: https://maven.aksw.org/repository/snapshots/org/aksw/jenax/jenax-functionbinder-parent/4.5.0-1-SNAPSHOT/jenax-functionbinder-parent-4.5.0-1-20220614.163716-49.pom
[INFO] Downloaded from maven.aksw.snapshots: https://maven.aksw.org/repository/snapshots/org/aksw/jenax/jenax-functionbinder-parent/4.5.0-1-SNAPSHOT/jenax-functionbinder-parent-4.5.0-1-20220614.163716-49.pom (581 B at 83 kB/s)
[INFO] Downloading from maven.aksw.internal: https://maven.aksw.org/repository/internal/org/aksw/jenax/jenax-arq-tika/4.5.0-1-SNAPSHOT/maven-metadata.xml
[INFO] Downloading from maven.aksw.snapshots: https://maven.aksw.org/repository/snapshots/org/aksw/jenax/jenax-arq-tika/4.5.0-1-SNAPSHOT/maven-metadata.xml
[INFO] Downloading from apache-repo-snapshots: https://repository.apache.org/content/repositories/snapshots/org/aksw/jenax/jenax-arq-tika/4.5.0-1-SNAPSHOT/maven-metadata.xml
[INFO] Downloading from jts-snapshots: https://repo.eclipse.org/content/repositories/jts-snapshots/org/aksw/jenax/jenax-arq-tika/4.5.0-1-SNAPSHOT/maven-metadata.xml
[INFO] Downloaded from maven.aksw.snapshots: https://maven.aksw.org/repository/snapshots/org/aksw/jenax/jenax-arq-tika/4.5.0-1-SNAPSHOT/maven-metadata.xml (368 B at 53 kB/s)
[INFO] Downloading from maven.aksw.internal: https://maven.aksw.org/repository/internal/org/aksw/jenax/jenax-arq-tika/4.5.0-1-SNAPSHOT/jenax-arq-tika-4.5.0-1-20220614.162546-53.pom
[INFO] Downloading from maven.aksw.snapshots: https://maven.aksw.org/repository/snapshots/org/aksw/jenax/jenax-arq-tika/4.5.0-1-SNAPSHOT/jenax-arq-tika-4.5.0-1-20220614.162546-53.pom
[INFO] Downloaded from maven.aksw.snapshots: https://maven.aksw.org/repository/snapshots/org/aksw/jenax/jenax-arq-tika/4.5.0-1-SNAPSHOT/jenax-arq-tika-4.5.0-1-20220614.162546-53.pom (0 B at 0 B/s)
[INFO] Downloading from maven.aksw.snapshots: https://maven.aksw.org/repository/snapshots/org/aksw/jenax/jenax-arq-connection-core/4.5.0-1-SNAPSHOT/jenax-arq-connection-core-4.5.0-1-20220614.162725-53.jar
[INFO] Downloading from maven.aksw.snapshots: https://maven.aksw.org/repository/snapshots/org/aksw/commons/aksw-commons-utils/0.9.5-SNAPSHOT/aksw-commons-utils-0.9.5-20220614.164555-4.jar
[INFO] Downloading from maven.aksw.snapshots: https://maven.aksw.org/repository/snapshots/org/aksw/jenax/jenax-arq-plugins-service-vfs/4.5.0-1-SNAPSHOT/jenax-arq-plugins-service-vfs-4.5.0-1-20220614.163711-56.jar
[INFO] Downloading from maven.aksw.snapshots: https://maven.aksw.org/repository/snapshots/org/aksw/jenax/jenax-fsrdfstore-system/4.5.0-1-SNAPSHOT/jenax-fsrdfstore-system-4.5.0-1-20220614.164022-47.jar
[INFO] Downloading from maven.aksw.snapshots: https://maven.aksw.org/repository/snapshots/org/aksw/jenax/jenax-fsrdfstore-facade/4.5.0-1-SNAPSHOT/jenax-fsrdfstore-facade-4.5.0-1-20220614.163932-47.jar
[INFO] Downloaded from maven.aksw.snapshots: https://maven.aksw.org/repository/snapshots/org/aksw/jenax/jenax-fsrdfstore-system/4.5.0-1-SNAPSHOT/jenax-fsrdfstore-system-4.5.0-1-20220614.164022-47.jar (2.0 kB at 1.9 kB/s)
[INFO] Downloading from maven.aksw.snapshots: https://maven.aksw.org/repository/snapshots/org/aksw/jenax/jenax-fsrdfstore-core/4.5.0-1-SNAPSHOT/jenax-fsrdfstore-core-4.5.0-1-20220614.163917-47.jar
[INFO] Downloaded from maven.aksw.snapshots: https://maven.aksw.org/repository/snapshots/org/aksw/jenax/jenax-fsrdfstore-facade/4.5.0-1-SNAPSHOT/jenax-fsrdfstore-facade-4.5.0-1-20220614.163932-47.jar (14 kB at 13 kB/s)
[INFO] Downloading from maven.aksw.snapshots: https://maven.aksw.org/repository/snapshots/org/aksw/jenax/jenax-jgrapht-bindings/4.5.0-1-SNAPSHOT/jenax-jgrapht-bindings-4.5.0-1-20220614.162438-27.jar
[INFO] Downloaded from maven.aksw.snapshots: https://maven.aksw.org/repository/snapshots/org/aksw/commons/aksw-commons-utils/0.9.5-SNAPSHOT/aksw-commons-utils-0.9.5-20220614.164555-4.jar (177 kB at 153 kB/s)
[INFO] Downloading from maven.aksw.snapshots: https://maven.aksw.org/repository/snapshots/org/aksw/jenax/jenax-arq-datasets-diff/4.5.0-1-SNAPSHOT/jenax-arq-datasets-diff-4.5.0-1-20220614.163631-52.jar
[INFO] Downloaded from maven.aksw.snapshots: https://maven.aksw.org/repository/snapshots/org/aksw/jenax/jenax-arq-connection-core/4.5.0-1-SNAPSHOT/jenax-arq-connection-core-4.5.0-1-20220614.162725-53.jar (157 kB at 135 kB/s)
[INFO] Downloaded from maven.aksw.snapshots: https://maven.aksw.org/repository/snapshots/org/aksw/jenax/jenax-arq-plugins-service-vfs/4.5.0-1-SNAPSHOT/jenax-arq-plugins-service-vfs-4.5.0-1-20220614.163711-56.jar (15 kB at 13 kB/s)
[INFO] Downloading from maven.aksw.snapshots: https://maven.aksw.org/repository/snapshots/org/aksw/jenax/jenax-arq-quadengine/4.5.0-1-SNAPSHOT/jenax-arq-quadengine-4.5.0-1-20220614.163439-52.jar
[INFO] Downloading from maven.aksw.snapshots: https://maven.aksw.org/repository/snapshots/net/sansa-stack/sansa-spark-jena-java_2.12/0.8.0-RC3-SNAPSHOT/sansa-spark-jena-java_2.12-0.8.0-RC3-20220608.094155-3.jar
[INFO] Downloaded from maven.aksw.snapshots: https://maven.aksw.org/repository/snapshots/org/aksw/jenax/jenax-fsrdfstore-core/4.5.0-1-SNAPSHOT/jenax-fsrdfstore-core-4.5.0-1-20220614.163917-47.jar (67 kB at 30 kB/s)
[INFO] Downloading from maven.aksw.snapshots: https://maven.aksw.org/repository/snapshots/net/sansa-stack/sansa-hadoop-jena/0.8.0-RC3-SNAPSHOT/sansa-hadoop-jena-0.8.0-RC3-20220608.094150-3.jar
[INFO] Downloaded from maven.aksw.snapshots: https://maven.aksw.org/repository/snapshots/org/aksw/jenax/jenax-jgrapht-bindings/4.5.0-1-SNAPSHOT/jenax-jgrapht-bindings-4.5.0-1-20220614.162438-27.jar (24 kB at 10 kB/s)
[INFO] Downloading from maven.aksw.snapshots: https://maven.aksw.org/repository/snapshots/org/aksw/jenax/jenax-rx-ops-syscall/4.5.0-1-SNAPSHOT/jenax-rx-ops-syscall-4.5.0-1-20220614.163817-48.jar
[INFO] Downloaded from maven.aksw.snapshots: https://maven.aksw.org/repository/snapshots/org/aksw/jenax/jenax-arq-quadengine/4.5.0-1-SNAPSHOT/jenax-arq-quadengine-4.5.0-1-20220614.163439-52.jar (17 kB at 7.0 kB/s)
[INFO] Downloaded from maven.aksw.snapshots: https://maven.aksw.org/repository/snapshots/org/aksw/jenax/jenax-arq-datasets-diff/4.5.0-1-SNAPSHOT/jenax-arq-datasets-diff-4.5.0-1-20220614.163631-52.jar (18 kB at 7.5 kB/s)
[INFO] Downloading from maven.aksw.snapshots: https://maven.aksw.org/repository/snapshots/org/aksw/jenax/jenax-arq-rx/4.5.0-1-SNAPSHOT/jenax-arq-rx-4.5.0-1-20220614.163100-53.jar
[INFO] Downloading from maven.aksw.snapshots: https://maven.aksw.org/repository/snapshots/org/aksw/jenax/jenax-models-entityinfo/4.5.0-1-SNAPSHOT/jenax-models-entityinfo-4.5.0-1-20220614.162917-50.jar
[INFO] Downloaded from maven.aksw.snapshots: https://maven.aksw.org/repository/snapshots/net/sansa-stack/sansa-spark-jena-java_2.12/0.8.0-RC3-SNAPSHOT/sansa-spark-jena-java_2.12-0.8.0-RC3-20220608.094155-3.jar (99 kB at 41 kB/s)
[INFO] Downloading from maven.aksw.snapshots: https://maven.aksw.org/repository/snapshots/org/aksw/jenax/jenax-arq-aggregators/4.5.0-1-SNAPSHOT/jenax-arq-aggregators-4.5.0-1-20220614.162953-52.jar
[INFO] Downloaded from maven.aksw.snapshots: https://maven.aksw.org/repository/snapshots/net/sansa-stack/sansa-hadoop-jena/0.8.0-RC3-SNAPSHOT/sansa-hadoop-jena-0.8.0-RC3-20220608.094150-3.jar (102 kB at 42 kB/s)
[INFO] Downloading from maven.aksw.snapshots: https://maven.aksw.org/repository/snapshots/org/aksw/jenax/jenax-arq-rdfterm/4.5.0-1-SNAPSHOT/jenax-arq-rdfterm-4.5.0-1-20220614.162929-52.jar
[INFO] Downloaded from maven.aksw.snapshots: https://maven.aksw.org/repository/snapshots/org/aksw/jenax/jenax-rx-ops-syscall/4.5.0-1-SNAPSHOT/jenax-rx-ops-syscall-4.5.0-1-20220614.163817-48.jar (15 kB at 5.9 kB/s)
[INFO] Downloading from maven.aksw.snapshots: https://maven.aksw.org/repository/snapshots/org/aksw/jenax/jenax-arq-functions/4.5.0-1-SNAPSHOT/jenax-arq-functions-4.5.0-1-20220614.162939-52.jar
[INFO] Downloaded from maven.aksw.snapshots: https://maven.aksw.org/repository/snapshots/org/aksw/jenax/jenax-arq-rx/4.5.0-1-SNAPSHOT/jenax-arq-rx-4.5.0-1-20220614.163100-53.jar (209 kB at 57 kB/s)
[INFO] Downloaded from maven.aksw.snapshots: https://maven.aksw.org/repository/snapshots/org/aksw/jenax/jenax-models-entityinfo/4.5.0-1-SNAPSHOT/jenax-models-entityinfo-4.5.0-1-20220614.162917-50.jar (9.1 kB at 2.5 kB/s)
[INFO] Downloading from maven.aksw.snapshots: https://maven.aksw.org/repository/snapshots/org/aksw/jenax/jenax-arq-datasets-orderaware/4.5.0-1-SNAPSHOT/jenax-arq-datasets-orderaware-4.5.0-1-20220614.163007-52.jar
[INFO] Downloading from maven.aksw.snapshots: https://maven.aksw.org/repository/snapshots/org/aksw/jenax/jenax-arq-datasets-oneng/4.5.0-1-SNAPSHOT/jenax-arq-datasets-oneng-4.5.0-1-20220614.163024-52.jar
[INFO] Downloaded from maven.aksw.snapshots: https://maven.aksw.org/repository/snapshots/org/aksw/jenax/jenax-arq-aggregators/4.5.0-1-SNAPSHOT/jenax-arq-aggregators-4.5.0-1-20220614.162953-52.jar (65 kB at 17 kB/s)
[INFO] Downloading from maven.aksw.snapshots: https://maven.aksw.org/repository/snapshots/org/aksw/commons/aksw-commons-rx/0.9.5-SNAPSHOT/aksw-commons-rx-0.9.5-20220614.164908-3.jar
[INFO] Downloaded from maven.aksw.snapshots: https://maven.aksw.org/repository/snapshots/org/aksw/jenax/jenax-arq-datasets-orderaware/4.5.0-1-SNAPSHOT/jenax-arq-datasets-orderaware-4.5.0-1-20220614.163007-52.jar (32 kB at 8.3 kB/s)
[INFO] Downloaded from maven.aksw.snapshots: https://maven.aksw.org/repository/snapshots/org/aksw/jenax/jenax-arq-rdfterm/4.5.0-1-SNAPSHOT/jenax-arq-rdfterm-4.5.0-1-20220614.162929-52.jar (9.5 kB at 2.5 kB/s)
[INFO] Downloading from maven.aksw.snapshots: https://maven.aksw.org/repository/snapshots/org/aksw/commons/aksw-commons-io-buffers/0.9.5-SNAPSHOT/aksw-commons-io-buffers-0.9.5-20220614.164738-6.jar
[INFO] Downloading from maven.aksw.snapshots: https://maven.aksw.org/repository/snapshots/org/aksw/commons/aksw-commons-claimingcache/0.9.5-SNAPSHOT/aksw-commons-claimingcache-0.9.5-20220614.164651-4.jar
[INFO] Downloaded from maven.aksw.snapshots: https://maven.aksw.org/repository/snapshots/org/aksw/jenax/jenax-arq-functions/4.5.0-1-SNAPSHOT/jenax-arq-functions-4.5.0-1-20220614.162939-52.jar (3.4 kB at 870 B/s)
[INFO] Downloading from maven.aksw.snapshots: https://maven.aksw.org/repository/snapshots/org/aksw/commons/aksw-commons-objectstore/0.9.5-SNAPSHOT/aksw-commons-objectstore-0.9.5-20220614.164728-4.jar
[INFO] Downloaded from maven.aksw.snapshots: https://maven.aksw.org/repository/snapshots/org/aksw/jenax/jenax-arq-datasets-oneng/4.5.0-1-SNAPSHOT/jenax-arq-datasets-oneng-4.5.0-1-20220614.163024-52.jar (8.1 kB at 2.1 kB/s)
[INFO] Downloading from maven.aksw.snapshots: https://maven.aksw.org/repository/snapshots/org/aksw/commons/aksw-commons-paths/0.9.5-SNAPSHOT/aksw-commons-paths-0.9.5-20220614.164700-4.jar
[INFO] Downloaded from maven.aksw.snapshots: https://maven.aksw.org/repository/snapshots/org/aksw/commons/aksw-commons-rx/0.9.5-SNAPSHOT/aksw-commons-rx-0.9.5-20220614.164908-3.jar (67 kB at 14 kB/s)
[INFO] Downloading from maven.aksw.snapshots: https://maven.aksw.org/repository/snapshots/org/aksw/commons/aksw-commons-txn/0.9.5-SNAPSHOT/aksw-commons-txn-0.9.5-20220614.164719-4.jar
[INFO] Downloaded from maven.aksw.snapshots: https://maven.aksw.org/repository/snapshots/org/aksw/commons/aksw-commons-objectstore/0.9.5-SNAPSHOT/aksw-commons-objectstore-0.9.5-20220614.164728-4.jar (32 kB at 6.3 kB/s)
[INFO] Downloaded from maven.aksw.snapshots: https://maven.aksw.org/repository/snapshots/org/aksw/commons/aksw-commons-claimingcache/0.9.5-SNAPSHOT/aksw-commons-claimingcache-0.9.5-20220614.164651-4.jar (34 kB at 6.7 kB/s)
[INFO] Downloading from maven.aksw.snapshots: https://maven.aksw.org/repository/snapshots/org/aksw/jenax/jenax-arq-rdfnode-in-dataset/4.5.0-1-SNAPSHOT/jenax-arq-rdfnode-in-dataset-4.5.0-1-20220614.163037-52.jar
[INFO] Downloaded from maven.aksw.snapshots: https://maven.aksw.org/repository/snapshots/org/aksw/commons/aksw-commons-paths/0.9.5-SNAPSHOT/aksw-commons-paths-0.9.5-20220614.164700-4.jar (53 kB at 10 kB/s)
[INFO] Downloading from maven.aksw.snapshots: https://maven.aksw.org/repository/snapshots/org/aksw/commons/aksw-commons-rx-ex/0.9.5-SNAPSHOT/aksw-commons-rx-ex-0.9.5-20220614.164844-4.jar
[INFO] Downloaded from maven.aksw.snapshots: https://maven.aksw.org/repository/snapshots/org/aksw/commons/aksw-commons-txn/0.9.5-SNAPSHOT/aksw-commons-txn-0.9.5-20220614.164719-4.jar (70 kB at 14 kB/s)
[INFO] Downloading from maven.aksw.snapshots: https://maven.aksw.org/repository/snapshots/org/aksw/jenax/jenax-arq-relations/4.5.0-1-SNAPSHOT/jenax-arq-relations-4.5.0-1-20220614.162646-53.jar
[INFO] Downloading from maven.aksw.snapshots: https://maven.aksw.org/repository/snapshots/org/aksw/commons/aksw-commons-io-syscalls/0.9.5-SNAPSHOT/aksw-commons-io-syscalls-0.9.5-20220614.164747-5.jar
[INFO] Downloaded from maven.aksw.snapshots: https://maven.aksw.org/repository/snapshots/org/aksw/commons/aksw-commons-io-buffers/0.9.5-SNAPSHOT/aksw-commons-io-buffers-0.9.5-20220614.164738-6.jar (117 kB at 23 kB/s)
[INFO] Downloading from maven.aksw.snapshots: https://maven.aksw.org/repository/snapshots/org/aksw/commons/aksw-commons-collectors/0.9.5-SNAPSHOT/aksw-commons-collectors-0.9.5-20220614.164642-4.jar
[INFO] Downloaded from maven.aksw.snapshots: https://maven.aksw.org/repository/snapshots/org/aksw/jenax/jenax-arq-rdfnode-in-dataset/4.5.0-1-SNAPSHOT/jenax-arq-rdfnode-in-dataset-4.5.0-1-20220614.163037-52.jar (14 kB at 2.7 kB/s)
[INFO] Downloading from maven.aksw.snapshots: https://maven.aksw.org/repository/snapshots/org/aksw/commons/aksw-commons-lambdas-serializable/0.9.5-SNAPSHOT/aksw-commons-lambdas-serializable-0.9.5-20220614.164544-4.jar
[INFO] Downloaded from maven.aksw.snapshots: https://maven.aksw.org/repository/snapshots/org/aksw/commons/aksw-commons-rx-ex/0.9.5-SNAPSHOT/aksw-commons-rx-ex-0.9.5-20220614.164844-4.jar (42 kB at 8.1 kB/s)
[INFO] Downloading from maven.aksw.snapshots: https://maven.aksw.org/repository/snapshots/org/aksw/commons/aksw-commons-io-utils/0.9.5-SNAPSHOT/aksw-commons-io-utils-0.9.5-20220614.164710-5.jar
[INFO] Downloaded from maven.aksw.snapshots: https://maven.aksw.org/repository/snapshots/org/aksw/commons/aksw-commons-io-syscalls/0.9.5-SNAPSHOT/aksw-commons-io-syscalls-0.9.5-20220614.164747-5.jar (4.1 kB at 793 B/s)
[INFO] Downloading from maven.aksw.snapshots: https://maven.aksw.org/repository/snapshots/org/aksw/commons/aksw-commons-lambdas-throwing/0.9.5-SNAPSHOT/aksw-commons-lambdas-throwing-0.9.5-20220614.164633-4.jar
[INFO] Downloaded from maven.aksw.snapshots: https://maven.aksw.org/repository/snapshots/org/aksw/jenax/jenax-arq-relations/4.5.0-1-SNAPSHOT/jenax-arq-relations-4.5.0-1-20220614.162646-53.jar (110 kB at 21 kB/s)
[INFO] Downloading from maven.aksw.snapshots: https://maven.aksw.org/repository/snapshots/org/aksw/commons/aksw-commons-io-process-pipes/0.9.5-SNAPSHOT/aksw-commons-io-process-pipes-0.9.5-20220614.164756-5.jar
[INFO] Downloaded from maven.aksw.snapshots: https://maven.aksw.org/repository/snapshots/org/aksw/commons/aksw-commons-collectors/0.9.5-SNAPSHOT/aksw-commons-collectors-0.9.5-20220614.164642-4.jar (74 kB at 14 kB/s)
[INFO] Downloading from maven.aksw.snapshots: https://maven.aksw.org/repository/snapshots/org/aksw/jenax/jenax-arq-algebra/4.5.0-1-SNAPSHOT/jenax-arq-algebra-4.5.0-1-20220614.163541-54.jar
[INFO] Downloaded from maven.aksw.snapshots: https://maven.aksw.org/repository/snapshots/org/aksw/commons/aksw-commons-lambdas-serializable/0.9.5-SNAPSHOT/aksw-commons-lambdas-serializable-0.9.5-20220614.164544-4.jar (9.8 kB at 1.9 kB/s)
[INFO] Downloading from maven.aksw.snapshots: https://maven.aksw.org/repository/snapshots/org/aksw/jenax/jenax-arq-propertypaths/4.5.0-1-SNAPSHOT/jenax-arq-propertypaths-4.5.0-1-20220614.162628-53.jar
[INFO] Downloaded from maven.aksw.snapshots: https://maven.aksw.org/repository/snapshots/org/aksw/commons/aksw-commons-io-process-pipes/0.9.5-SNAPSHOT/aksw-commons-io-process-pipes-0.9.5-20220614.164756-5.jar (39 kB at 7.3 kB/s)
[INFO] Downloading from maven.aksw.snapshots: https://maven.aksw.org/repository/snapshots/org/aksw/jenax/jenax-arq-utils/4.5.0-1-SNAPSHOT/jenax-arq-utils-4.5.0-1-20220614.162355-58.jar
[INFO] Downloaded from maven.aksw.snapshots: https://maven.aksw.org/repository/snapshots/org/aksw/commons/aksw-commons-io-utils/0.9.5-SNAPSHOT/aksw-commons-io-utils-0.9.5-20220614.164710-5.jar (33 kB at 6.3 kB/s)
[INFO] Downloading from maven.aksw.snapshots: https://maven.aksw.org/repository/snapshots/org/aksw/jenax/jenax-arq-udf/4.5.0-1-SNAPSHOT/jenax-arq-udf-4.5.0-1-20220614.163520-52.jar
[INFO] Downloaded from maven.aksw.snapshots: https://maven.aksw.org/repository/snapshots/org/aksw/commons/aksw-commons-lambdas-throwing/0.9.5-SNAPSHOT/aksw-commons-lambdas-throwing-0.9.5-20220614.164633-4.jar (6.4 kB at 1.2 kB/s)
[INFO] Downloading from maven.aksw.snapshots: https://maven.aksw.org/repository/snapshots/org/aksw/jenax/jenax-arq-hdt/4.5.0-1-SNAPSHOT/jenax-arq-hdt-4.5.0-1-20220614.163451-52.jar
[INFO] Downloaded from maven.aksw.snapshots: https://maven.aksw.org/repository/snapshots/org/aksw/jenax/jenax-arq-algebra/4.5.0-1-SNAPSHOT/jenax-arq-algebra-4.5.0-1-20220614.163541-54.jar (193 kB at 36 kB/s)
[INFO] Downloading from maven.aksw.snapshots: https://maven.aksw.org/repository/snapshots/org/aksw/jenax/jenax-arq-json/4.5.0-1-SNAPSHOT/jenax-arq-json-4.5.0-1-20220614.162616-53.jar
[INFO] Downloaded from maven.aksw.snapshots: https://maven.aksw.org/repository/snapshots/org/aksw/jenax/jenax-arq-udf/4.5.0-1-SNAPSHOT/jenax-arq-udf-4.5.0-1-20220614.163520-52.jar (15 kB at 2.8 kB/s)
[INFO] Downloading from maven.aksw.snapshots: https://maven.aksw.org/repository/snapshots/org/aksw/jenax/jenax-arq-stmt/4.5.0-1-SNAPSHOT/jenax-arq-stmt-4.5.0-1-20220614.162604-54.jar
[INFO] Downloaded from maven.aksw.snapshots: https://maven.aksw.org/repository/snapshots/org/aksw/jenax/jenax-arq-hdt/4.5.0-1-SNAPSHOT/jenax-arq-hdt-4.5.0-1-20220614.163451-52.jar (12 kB at 2.2 kB/s)
[INFO] Downloading from maven.aksw.snapshots: https://maven.aksw.org/repository/snapshots/org/aksw/jenax/jenax-resources-prefixes/4.5.0-1-SNAPSHOT/jenax-resources-prefixes-4.5.0-1-20220614.162406-52.jar
[INFO] Downloaded from maven.aksw.snapshots: https://maven.aksw.org/repository/snapshots/org/aksw/jenax/jenax-arq-utils/4.5.0-1-SNAPSHOT/jenax-arq-utils-4.5.0-1-20220614.162355-58.jar (258 kB at 45 kB/s)
[INFO] Downloading from maven.aksw.snapshots: https://maven.aksw.org/repository/snapshots/org/aksw/jenax/jenax-arq-plugins-bundle/4.5.0-1-SNAPSHOT/jenax-arq-plugins-bundle-4.5.0-1-20220614.163801-57.jar
[INFO] Downloaded from maven.aksw.snapshots: https://maven.aksw.org/repository/snapshots/org/aksw/jenax/jenax-arq-propertypaths/4.5.0-1-SNAPSHOT/jenax-arq-propertypaths-4.5.0-1-20220614.162628-53.jar (30 kB at 4.9 kB/s)
[INFO] Downloaded from maven.aksw.snapshots: https://maven.aksw.org/repository/snapshots/org/aksw/jenax/jenax-arq-json/4.5.0-1-SNAPSHOT/jenax-arq-json-4.5.0-1-20220614.162616-53.jar (9.7 kB at 1.6 kB/s)
[INFO] Downloading from maven.aksw.snapshots: https://maven.aksw.org/repository/snapshots/org/aksw/jenax/jenax-arq-collections/4.5.0-1-SNAPSHOT/jenax-arq-collections-4.5.0-1-20220614.162756-53.jar
[INFO] Downloading from maven.aksw.snapshots: https://maven.aksw.org/repository/snapshots/org/aksw/jenax/jenax-annotations-reprogen/4.5.0-1-SNAPSHOT/jenax-annotations-reprogen-4.5.0-1-20220614.162423-49.jar
[INFO] Downloaded from maven.aksw.snapshots: https://maven.aksw.org/repository/snapshots/org/aksw/jenax/jenax-arq-stmt/4.5.0-1-SNAPSHOT/jenax-arq-stmt-4.5.0-1-20220614.162604-54.jar (59 kB at 7.6 kB/s)
[INFO] Downloading from maven.aksw.snapshots: https://maven.aksw.org/repository/snapshots/org/aksw/jenax/jenax-arq-plugins-datatypes/4.5.0-1-SNAPSHOT/jenax-arq-plugins-datatypes-4.5.0-1-20220614.163645-56.jar
[INFO] Downloaded from maven.aksw.snapshots: https://maven.aksw.org/repository/snapshots/org/aksw/jenax/jenax-annotations-reprogen/4.5.0-1-SNAPSHOT/jenax-annotations-reprogen-4.5.0-1-20220614.162423-49.jar (14 kB at 1.6 kB/s)
[INFO] Downloaded from maven.aksw.snapshots: https://maven.aksw.org/repository/snapshots/org/aksw/jenax/jenax-resources-prefixes/4.5.0-1-SNAPSHOT/jenax-resources-prefixes-4.5.0-1-20220614.162406-52.jar (83 kB at 9.7 kB/s)
[INFO] Downloaded from maven.aksw.snapshots: https://maven.aksw.org/repository/snapshots/org/aksw/jenax/jenax-arq-plugins-bundle/4.5.0-1-SNAPSHOT/jenax-arq-plugins-bundle-4.5.0-1-20220614.163801-57.jar (190 kB at 22 kB/s)
[INFO] Downloading from maven.aksw.snapshots: https://maven.aksw.org/repository/snapshots/org/aksw/jenax/jenax-models-dcat-api/4.5.0-1-SNAPSHOT/jenax-models-dcat-api-4.5.0-1-20220614.163658-50.jar
[INFO] Downloading from maven.aksw.snapshots: https://maven.aksw.org/repository/snapshots/org/aksw/jenax/jenax-functionbinder-core/4.5.0-1-SNAPSHOT/jenax-functionbinder-core-4.5.0-1-20220614.163726-48.jar
[INFO] Downloading from maven.aksw.snapshots: https://maven.aksw.org/repository/snapshots/org/aksw/jenax/jenax-reprogen-shared/4.5.0-1-SNAPSHOT/jenax-reprogen-shared-4.5.0-1-20220614.162809-47.jar
[INFO] Downloaded from maven.aksw.snapshots: https://maven.aksw.org/repository/snapshots/org/aksw/jenax/jenax-arq-collections/4.5.0-1-SNAPSHOT/jenax-arq-collections-4.5.0-1-20220614.162756-53.jar (92 kB at 10.0 kB/s)
[INFO] Downloading from maven.aksw.snapshots: https://maven.aksw.org/repository/snapshots/org/aksw/jenax/jenax-arq-tika/4.5.0-1-SNAPSHOT/jenax-arq-tika-4.5.0-1-20220614.162546-53.jar
[INFO] Downloaded from maven.aksw.snapshots: https://maven.aksw.org/repository/snapshots/org/aksw/jenax/jenax-arq-plugins-datatypes/4.5.0-1-SNAPSHOT/jenax-arq-plugins-datatypes-4.5.0-1-20220614.163645-56.jar (8.8 kB at 954 B/s)
[INFO] Downloading from maven.aksw.snapshots: https://maven.aksw.org/repository/snapshots/org/aksw/jenax/jenax-rx-dataaccess/4.5.0-1-SNAPSHOT/jenax-rx-dataaccess-4.5.0-1-20220614.163237-48.jar
[INFO] Downloaded from maven.aksw.snapshots: https://maven.aksw.org/repository/snapshots/org/aksw/jenax/jenax-reprogen-shared/4.5.0-1-SNAPSHOT/jenax-reprogen-shared-4.5.0-1-20220614.162809-47.jar (5.3 kB at 564 B/s)
[INFO] Downloading from maven.aksw.snapshots: https://maven.aksw.org/repository/snapshots/org/aksw/jenax/jenax-io-kryo/4.5.0-1-SNAPSHOT/jenax-io-kryo-4.5.0-1-20220614.163116-47.jar
[INFO] Downloaded from maven.aksw.snapshots: https://maven.aksw.org/repository/snapshots/org/aksw/jenax/jenax-models-dcat-api/4.5.0-1-SNAPSHOT/jenax-models-dcat-api-4.5.0-1-20220614.163658-50.jar (27 kB at 2.9 kB/s)
[INFO] Downloaded from maven.aksw.snapshots: https://maven.aksw.org/repository/snapshots/org/aksw/jenax/jenax-functionbinder-core/4.5.0-1-SNAPSHOT/jenax-functionbinder-core-4.5.0-1-20220614.163726-48.jar (15 kB at 1.6 kB/s)
[INFO] Downloading from maven.aksw.snapshots: https://maven.aksw.org/repository/snapshots/org/aksw/jenax/jenax-io-json/4.5.0-1-SNAPSHOT/jenax-io-json-4.5.0-1-20220614.162739-42.jar
[INFO] Downloading from maven.aksw.snapshots: https://maven.aksw.org/repository/snapshots/org/aksw/jenax/jenax-analytics-core/4.5.0-1-SNAPSHOT/jenax-analytics-core-4.5.0-1-20220614.163135-49.jar
[INFO] Downloaded from maven.aksw.snapshots: https://maven.aksw.org/repository/snapshots/org/aksw/jenax/jenax-arq-tika/4.5.0-1-SNAPSHOT/jenax-arq-tika-4.5.0-1-20220614.162546-53.jar (3.4 kB at 360 B/s)
[INFO] Downloading from maven.aksw.snapshots: https://maven.aksw.org/repository/snapshots/org/aksw/jenax/jenax-reprogen-core/4.5.0-1-SNAPSHOT/jenax-reprogen-core-4.5.0-1-20220614.162903-47.jar
[INFO] Downloaded from maven.aksw.snapshots: https://maven.aksw.org/repository/snapshots/org/aksw/jenax/jenax-rx-dataaccess/4.5.0-1-SNAPSHOT/jenax-rx-dataaccess-4.5.0-1-20220614.163237-48.jar (367 kB at 39 kB/s)
[INFO] Downloading from maven.aksw.snapshots: https://maven.aksw.org/repository/snapshots/org/aksw/commons/aksw-commons-beans/0.9.5-SNAPSHOT/aksw-commons-beans-0.9.5-20220614.164625-4.jar
[INFO] Downloaded from maven.aksw.snapshots: https://maven.aksw.org/repository/snapshots/org/aksw/jenax/jenax-io-kryo/4.5.0-1-SNAPSHOT/jenax-io-kryo-4.5.0-1-20220614.163116-47.jar (36 kB at 3.8 kB/s)
[INFO] Downloading from maven.aksw.snapshots: https://maven.aksw.org/repository/snapshots/org/aksw/jenax/jenax-arq-entityquery/4.5.0-1-SNAPSHOT/jenax-arq-entityquery-4.5.0-1-20220614.163149-52.jar
[INFO] Downloaded from maven.aksw.snapshots: https://maven.aksw.org/repository/snapshots/org/aksw/jenax/jenax-io-json/4.5.0-1-SNAPSHOT/jenax-io-json-4.5.0-1-20220614.162739-42.jar (8.6 kB at 917 B/s)
[INFO] Downloaded from maven.aksw.snapshots: https://maven.aksw.org/repository/snapshots/org/aksw/jenax/jenax-analytics-core/4.5.0-1-SNAPSHOT/jenax-analytics-core-4.5.0-1-20220614.163135-49.jar (66 kB at 7.1 kB/s)
[INFO] Downloading from maven.aksw.snapshots: https://maven.aksw.org/repository/snapshots/org/aksw/commons/aksw-commons-collections/0.9.5-SNAPSHOT/aksw-commons-collections-0.9.5-20220614.164608-4.jar
[INFO] Downloading from maven.aksw.snapshots: https://maven.aksw.org/repository/snapshots/org/aksw/jenax/jenax-io-core/4.5.0-1-SNAPSHOT/jenax-io-core-4.5.0-1-20220614.163345-47.jar
[INFO] Downloaded from maven.aksw.snapshots: https://maven.aksw.org/repository/snapshots/org/aksw/commons/aksw-commons-beans/0.9.5-SNAPSHOT/aksw-commons-beans-0.9.5-20220614.164625-4.jar (40 kB at 4.2 kB/s)
[INFO] Downloading from maven.aksw.snapshots: https://maven.aksw.org/repository/snapshots/org/aksw/jenax/jenax-server-standalone/4.5.0-1-SNAPSHOT/jenax-server-standalone-4.5.0-1-20220614.164015-49.jar
[INFO] Downloaded from maven.aksw.snapshots: https://maven.aksw.org/repository/snapshots/org/aksw/jenax/jenax-reprogen-core/4.5.0-1-SNAPSHOT/jenax-reprogen-core-4.5.0-1-20220614.162903-47.jar (67 kB at 7.1 kB/s)
[INFO] Downloading from maven.aksw.snapshots: https://maven.aksw.org/repository/snapshots/org/aksw/jenax/jenax-server-frontends/4.5.0-1-SNAPSHOT/jenax-server-frontends-4.5.0-1-20220614.163959-49.jar
[INFO] Downloaded from maven.aksw.snapshots: https://maven.aksw.org/repository/snapshots/org/aksw/jenax/jenax-arq-entityquery/4.5.0-1-SNAPSHOT/jenax-arq-entityquery-4.5.0-1-20220614.163149-52.jar (44 kB at 4.7 kB/s)
[INFO] Downloading from maven.aksw.snapshots: https://maven.aksw.org/repository/snapshots/org/aksw/jenax/jenax-server-core/4.5.0-1-SNAPSHOT/jenax-server-core-4.5.0-1-20220614.163947-49.jar
[INFO] Downloaded from maven.aksw.snapshots: https://maven.aksw.org/repository/snapshots/org/aksw/jenax/jenax-io-core/4.5.0-1-SNAPSHOT/jenax-io-core-4.5.0-1-20220614.163345-47.jar (221 kB at 23 kB/s)
[INFO] Downloaded from maven.aksw.snapshots: https://maven.aksw.org/repository/snapshots/org/aksw/commons/aksw-commons-collections/0.9.5-SNAPSHOT/aksw-commons-collections-0.9.5-20220614.164608-4.jar (289 kB at 30 kB/s)
[INFO] Downloaded from maven.aksw.snapshots: https://maven.aksw.org/repository/snapshots/org/aksw/jenax/jenax-server-standalone/4.5.0-1-SNAPSHOT/jenax-server-standalone-4.5.0-1-20220614.164015-49.jar (5.4 kB at 571 B/s)
[INFO] Downloaded from maven.aksw.snapshots: https://maven.aksw.org/repository/snapshots/org/aksw/jenax/jenax-server-frontends/4.5.0-1-SNAPSHOT/jenax-server-frontends-4.5.0-1-20220614.163959-49.jar (9.9 kB at 1.0 kB/s)
[INFO] Downloaded from maven.aksw.snapshots: https://maven.aksw.org/repository/snapshots/org/aksw/jenax/jenax-server-core/4.5.0-1-SNAPSHOT/jenax-server-core-4.5.0-1-20220614.163947-49.jar (412 kB at 43 kB/s)
[INFO] Downloading from maven.aksw.internal: https://maven.aksw.org/repository/internal/org/aksw/commons/aksw-commons-models-csvw-univocity/0.9.3/aksw-commons-models-csvw-univocity-0.9.3.jar
[INFO] Downloading from maven.aksw.internal: https://maven.aksw.org/repository/internal/org/aksw/commons/aksw-commons-models-csvw-domain/0.9.3/aksw-commons-models-csvw-domain-0.9.3.jar
[INFO] Downloading from maven.aksw.snapshots: https://maven.aksw.org/repository/snapshots/org/aksw/commons/aksw-commons-models-csvw-univocity/0.9.3/aksw-commons-models-csvw-univocity-0.9.3.jar
[INFO] Downloading from maven.aksw.snapshots: https://maven.aksw.org/repository/snapshots/org/aksw/commons/aksw-commons-models-csvw-domain/0.9.3/aksw-commons-models-csvw-domain-0.9.3.jar
[INFO] Downloading from central: https://repo.maven.apache.org/maven2/org/aksw/commons/aksw-commons-models-csvw-univocity/0.9.3/aksw-commons-models-csvw-univocity-0.9.3.jar
[INFO] Downloading from central: https://repo.maven.apache.org/maven2/org/aksw/commons/aksw-commons-models-csvw-domain/0.9.3/aksw-commons-models-csvw-domain-0.9.3.jar
[INFO] Downloaded from central: https://repo.maven.apache.org/maven2/org/aksw/commons/aksw-commons-models-csvw-univocity/0.9.3/aksw-commons-models-csvw-univocity-0.9.3.jar (4.2 kB at 117 kB/s)
[INFO] Downloaded from central: https://repo.maven.apache.org/maven2/org/aksw/commons/aksw-commons-models-csvw-domain/0.9.3/aksw-commons-models-csvw-domain-0.9.3.jar (13 kB at 196 kB/s)
[INFO] 
[INFO] --- maven-clean-plugin:2.5:clean (default-clean) @ rdf-processing-toolkit-cli ---
[INFO] Deleting /usr/share/tomcat8/.jenkins/jobs/RDF-Processing-Toolkit/workspace/rdf-processing-toolkit-cli/target
[INFO] 
[INFO] --- maven-resources-plugin:2.6:resources (default-resources) @ rdf-processing-toolkit-cli ---
[INFO] Using 'UTF-8' encoding to copy filtered resources.
[INFO] Copying 10 resources
[INFO] Copying 1 resource
[INFO] 
[INFO] --- maven-compiler-plugin:3.6.0:compile (default-compile) @ rdf-processing-toolkit-cli ---
[INFO] Changes detected - recompiling the module!
[INFO] Compiling 56 source files to /usr/share/tomcat8/.jenkins/jobs/RDF-Processing-Toolkit/workspace/rdf-processing-toolkit-cli/target/classes
[INFO] /usr/share/tomcat8/.jenkins/jobs/RDF-Processing-Toolkit/workspace/rdf-processing-toolkit-cli/src/main/java/org/aksw/sparql_integrate/cli/MainCliSparqlLoad.java: Some input files use or override a deprecated API.
[INFO] /usr/share/tomcat8/.jenkins/jobs/RDF-Processing-Toolkit/workspace/rdf-processing-toolkit-cli/src/main/java/org/aksw/sparql_integrate/cli/MainCliSparqlLoad.java: Recompile with -Xlint:deprecation for details.
[INFO] 
[INFO] --- maven-resources-plugin:2.6:testResources (default-testResources) @ rdf-processing-toolkit-cli ---
[INFO] Using 'UTF-8' encoding to copy filtered resources.
[INFO] Copying 11 resources
[INFO] 
[INFO] --- maven-compiler-plugin:3.6.0:testCompile (default-testCompile) @ rdf-processing-toolkit-cli ---
[INFO] Changes detected - recompiling the module!
[INFO] Compiling 2 source files to /usr/share/tomcat8/.jenkins/jobs/RDF-Processing-Toolkit/workspace/rdf-processing-toolkit-cli/target/test-classes
[INFO] 
[INFO] --- maven-surefire-plugin:2.19:test (default-test) @ rdf-processing-toolkit-cli ---

-------------------------------------------------------
 T E S T S
-------------------------------------------------------
NOTE: Picked up JDK_JAVA_OPTIONS:  --add-opens=java.base/java.lang=ALL-UNNAMED --add-opens=java.base/java.io=ALL-UNNAMED --add-opens=java.rmi/sun.rmi.transport=ALL-UNNAMED
Running org.aksw.sparql_integrate.ngs.cli.main.TestCliNgs
Tests run: 1, Failures: 0, Errors: 0, Skipped: 0, Time elapsed: 0.012 sec - in org.aksw.sparql_integrate.ngs.cli.main.TestCliNgs
Running org.aksw.sparql_integrate.ngs.cli.main.TestSparqlBindingStreamOperators
java.lang.RuntimeException: java.lang.RuntimeException: No lang found for label txt
	at org.aksw.commons.util.exception.ExceptionUtilsAksw.rethrowUnless(ExceptionUtilsAksw.java:40)
	at org.aksw.commons.util.exception.ExceptionUtilsAksw.rethrowIfNotBrokenPipe(ExceptionUtilsAksw.java:81)
	at org.aksw.rdf_processing_toolkit.cli.cmd.CmdUtils.lambda$callCmd$0(CmdUtils.java:69)
	at picocli.CommandLine.execute(CommandLine.java:2088)
	at org.aksw.rdf_processing_toolkit.cli.cmd.CmdUtils.callCmd(CmdUtils.java:75)
	at org.aksw.rdf_processing_toolkit.cli.cmd.CmdUtils.callCmd(CmdUtils.java:39)
	at org.aksw.sparql_integrate.ngs.cli.main.TestSparqlBindingStreamOperators.test1(TestSparqlBindingStreamOperators.java:15)
	at java.base/jdk.internal.reflect.NativeMethodAccessorImpl.invoke0(Native Method)
	at java.base/jdk.internal.reflect.NativeMethodAccessorImpl.invoke(NativeMethodAccessorImpl.java:62)
	at java.base/jdk.internal.reflect.DelegatingMethodAccessorImpl.invoke(DelegatingMethodAccessorImpl.java:43)
	at java.base/java.lang.reflect.Method.invoke(Method.java:566)
	at org.junit.runners.model.FrameworkMethod$1.runReflectiveCall(FrameworkMethod.java:59)
	at org.junit.internal.runners.model.ReflectiveCallable.run(ReflectiveCallable.java:12)
	at org.junit.runners.model.FrameworkMethod.invokeExplosively(FrameworkMethod.java:56)
	at org.junit.internal.runners.statements.InvokeMethod.evaluate(InvokeMethod.java:17)
	at org.junit.runners.ParentRunner$3.evaluate(ParentRunner.java:306)
	at org.junit.runners.BlockJUnit4ClassRunner$1.evaluate(BlockJUnit4ClassRunner.java:100)
	at org.junit.runners.ParentRunner.runLeaf(ParentRunner.java:366)
	at org.junit.runners.BlockJUnit4ClassRunner.runChild(BlockJUnit4ClassRunner.java:103)
	at org.junit.runners.BlockJUnit4ClassRunner.runChild(BlockJUnit4ClassRunner.java:63)
	at org.junit.runners.ParentRunner$4.run(ParentRunner.java:331)
	at org.junit.runners.ParentRunner$1.schedule(ParentRunner.java:79)
	at org.junit.runners.ParentRunner.runChildren(ParentRunner.java:329)
	at org.junit.runners.ParentRunner.access$100(ParentRunner.java:66)
	at org.junit.runners.ParentRunner$2.evaluate(ParentRunner.java:293)
	at org.junit.runners.ParentRunner$3.evaluate(ParentRunner.java:306)
	at org.junit.runners.ParentRunner.run(ParentRunner.java:413)
	at org.apache.maven.surefire.junit4.JUnit4Provider.execute(JUnit4Provider.java:344)
	at org.apache.maven.surefire.junit4.JUnit4Provider.executeWithRerun(JUnit4Provider.java:269)
	at org.apache.maven.surefire.junit4.JUnit4Provider.executeTestSet(JUnit4Provider.java:240)
	at org.apache.maven.surefire.junit4.JUnit4Provider.invoke(JUnit4Provider.java:184)
	at org.apache.maven.surefire.booter.ForkedBooter.invokeProviderInSameClassLoader(ForkedBooter.java:286)
	at org.apache.maven.surefire.booter.ForkedBooter.runSuitesInProcess(ForkedBooter.java:240)
	at org.apache.maven.surefire.booter.ForkedBooter.main(ForkedBooter.java:121)
Caused by: java.lang.RuntimeException: No lang found for label txt
	at org.aksw.jena_sparql_api.rx.RDFLanguagesEx.lambda$findLang$6(RDFLanguagesEx.java:209)
	at java.base/java.util.Optional.orElseThrow(Optional.java:408)
	at org.aksw.jena_sparql_api.rx.RDFLanguagesEx.findLang(RDFLanguagesEx.java:209)
	at org.aksw.sparql_binding_stream.cli.main.SbsCmdImpls.query(SbsCmdImpls.java:201)
	at org.aksw.sparql_binding_stream.cli.cmd.CmdSbsMap.call(CmdSbsMap.java:37)
	at org.aksw.sparql_binding_stream.cli.cmd.CmdSbsMap.call(CmdSbsMap.java:13)
	at picocli.CommandLine.executeUserObject(CommandLine.java:1953)
	at picocli.CommandLine.access$1300(CommandLine.java:145)
	at picocli.CommandLine$RunLast.executeUserObjectOfLastSubcommandWithSameParent(CommandLine.java:2358)
	at picocli.CommandLine$RunLast.handle(CommandLine.java:2352)
	at picocli.CommandLine$RunLast.handle(CommandLine.java:2314)
	at picocli.CommandLine$AbstractParseResultHandler.execute(CommandLine.java:2179)
	at picocli.CommandLine$RunLast.execute(CommandLine.java:2316)
	at picocli.CommandLine.execute(CommandLine.java:2078)
	... 30 more
java.lang.RuntimeException: java.lang.RuntimeException: No lang found for label txt
	at org.aksw.commons.util.exception.ExceptionUtilsAksw.rethrowUnless(ExceptionUtilsAksw.java:40)
	at org.aksw.commons.util.exception.ExceptionUtilsAksw.rethrowIfNotBrokenPipe(ExceptionUtilsAksw.java:81)
	at org.aksw.rdf_processing_toolkit.cli.cmd.CmdUtils.lambda$callCmd$0(CmdUtils.java:69)
	at picocli.CommandLine.execute(CommandLine.java:2088)
	at org.aksw.rdf_processing_toolkit.cli.cmd.CmdUtils.callCmd(CmdUtils.java:75)
	at org.aksw.rdf_processing_toolkit.cli.cmd.CmdUtils.callCmd(CmdUtils.java:39)
	at org.aksw.sparql_integrate.ngs.cli.main.TestSparqlBindingStreamOperators.test1(TestSparqlBindingStreamOperators.java:16)
	at java.base/jdk.internal.reflect.NativeMethodAccessorImpl.invoke0(Native Method)
	at java.base/jdk.internal.reflect.NativeMethodAccessorImpl.invoke(NativeMethodAccessorImpl.java:62)
	at java.base/jdk.internal.reflect.DelegatingMethodAccessorImpl.invoke(DelegatingMethodAccessorImpl.java:43)
	at java.base/java.lang.reflect.Method.invoke(Method.java:566)
	at org.junit.runners.model.FrameworkMethod$1.runReflectiveCall(FrameworkMethod.java:59)
	at org.junit.internal.runners.model.ReflectiveCallable.run(ReflectiveCallable.java:12)
	at org.junit.runners.model.FrameworkMethod.invokeExplosively(FrameworkMethod.java:56)
	at org.junit.internal.runners.statements.InvokeMethod.evaluate(InvokeMethod.java:17)
	at org.junit.runners.ParentRunner$3.evaluate(ParentRunner.java:306)
	at org.junit.runners.BlockJUnit4ClassRunner$1.evaluate(BlockJUnit4ClassRunner.java:100)
	at org.junit.runners.ParentRunner.runLeaf(ParentRunner.java:366)
	at org.junit.runners.BlockJUnit4ClassRunner.runChild(BlockJUnit4ClassRunner.java:103)
	at org.junit.runners.BlockJUnit4ClassRunner.runChild(BlockJUnit4ClassRunner.java:63)
	at org.junit.runners.ParentRunner$4.run(ParentRunner.java:331)
	at org.junit.runners.ParentRunner$1.schedule(ParentRunner.java:79)
	at org.junit.runners.ParentRunner.runChildren(ParentRunner.java:329)
	at org.junit.runners.ParentRunner.access$100(ParentRunner.java:66)
	at org.junit.runners.ParentRunner$2.evaluate(ParentRunner.java:293)
	at org.junit.runners.ParentRunner$3.evaluate(ParentRunner.java:306)
	at org.junit.runners.ParentRunner.run(ParentRunner.java:413)
	at org.apache.maven.surefire.junit4.JUnit4Provider.execute(JUnit4Provider.java:344)
	at org.apache.maven.surefire.junit4.JUnit4Provider.executeWithRerun(JUnit4Provider.java:269)
	at org.apache.maven.surefire.junit4.JUnit4Provider.executeTestSet(JUnit4Provider.java:240)
	at org.apache.maven.surefire.junit4.JUnit4Provider.invoke(JUnit4Provider.java:184)
	at org.apache.maven.surefire.booter.ForkedBooter.invokeProviderInSameClassLoader(ForkedBooter.java:286)
	at org.apache.maven.surefire.booter.ForkedBooter.runSuitesInProcess(ForkedBooter.java:240)
	at org.apache.maven.surefire.booter.ForkedBooter.main(ForkedBooter.java:121)
Caused by: java.lang.RuntimeException: No lang found for label txt
	at org.aksw.jena_sparql_api.rx.RDFLanguagesEx.lambda$findLang$6(RDFLanguagesEx.java:209)
	at java.base/java.util.Optional.orElseThrow(Optional.java:408)
	at org.aksw.jena_sparql_api.rx.RDFLanguagesEx.findLang(RDFLanguagesEx.java:209)
	at org.aksw.sparql_binding_stream.cli.main.SbsCmdImpls.query(SbsCmdImpls.java:201)
	at org.aksw.sparql_binding_stream.cli.cmd.CmdSbsMap.call(CmdSbsMap.java:37)
	at org.aksw.sparql_binding_stream.cli.cmd.CmdSbsMap.call(CmdSbsMap.java:13)
	at picocli.CommandLine.executeUserObject(CommandLine.java:1953)
	at picocli.CommandLine.access$1300(CommandLine.java:145)
	at picocli.CommandLine$RunLast.executeUserObjectOfLastSubcommandWithSameParent(CommandLine.java:2358)
	at picocli.CommandLine$RunLast.handle(CommandLine.java:2352)
	at picocli.CommandLine$RunLast.handle(CommandLine.java:2314)
	at picocli.CommandLine$AbstractParseResultHandler.execute(CommandLine.java:2179)
	at picocli.CommandLine$RunLast.execute(CommandLine.java:2316)
	at picocli.CommandLine.execute(CommandLine.java:2078)
	... 30 more
java.lang.RuntimeException: java.lang.RuntimeException: No lang found for label txt
	at org.aksw.commons.util.exception.ExceptionUtilsAksw.rethrowUnless(ExceptionUtilsAksw.java:40)
	at org.aksw.commons.util.exception.ExceptionUtilsAksw.rethrowIfNotBrokenPipe(ExceptionUtilsAksw.java:81)
	at org.aksw.rdf_processing_toolkit.cli.cmd.CmdUtils.lambda$callCmd$0(CmdUtils.java:69)
	at picocli.CommandLine.execute(CommandLine.java:2088)
	at org.aksw.rdf_processing_toolkit.cli.cmd.CmdUtils.callCmd(CmdUtils.java:75)
	at org.aksw.rdf_processing_toolkit.cli.cmd.CmdUtils.callCmd(CmdUtils.java:39)
	at org.aksw.sparql_integrate.ngs.cli.main.TestSparqlBindingStreamOperators.test1(TestSparqlBindingStreamOperators.java:17)
	at java.base/jdk.internal.reflect.NativeMethodAccessorImpl.invoke0(Native Method)
	at java.base/jdk.internal.reflect.NativeMethodAccessorImpl.invoke(NativeMethodAccessorImpl.java:62)
	at java.base/jdk.internal.reflect.DelegatingMethodAccessorImpl.invoke(DelegatingMethodAccessorImpl.java:43)
	at java.base/java.lang.reflect.Method.invoke(Method.java:566)
	at org.junit.runners.model.FrameworkMethod$1.runReflectiveCall(FrameworkMethod.java:59)
	at org.junit.internal.runners.model.ReflectiveCallable.run(ReflectiveCallable.java:12)
	at org.junit.runners.model.FrameworkMethod.invokeExplosively(FrameworkMethod.java:56)
	at org.junit.internal.runners.statements.InvokeMethod.evaluate(InvokeMethod.java:17)
	at org.junit.runners.ParentRunner$3.evaluate(ParentRunner.java:306)
	at org.junit.runners.BlockJUnit4ClassRunner$1.evaluate(BlockJUnit4ClassRunner.java:100)
	at org.junit.runners.ParentRunner.runLeaf(ParentRunner.java:366)
	at org.junit.runners.BlockJUnit4ClassRunner.runChild(BlockJUnit4ClassRunner.java:103)
	at org.junit.runners.BlockJUnit4ClassRunner.runChild(BlockJUnit4ClassRunner.java:63)
	at org.junit.runners.ParentRunner$4.run(ParentRunner.java:331)
	at org.junit.runners.ParentRunner$1.schedule(ParentRunner.java:79)
	at org.junit.runners.ParentRunner.runChildren(ParentRunner.java:329)
	at org.junit.runners.ParentRunner.access$100(ParentRunner.java:66)
	at org.junit.runners.ParentRunner$2.evaluate(ParentRunner.java:293)
	at org.junit.runners.ParentRunner$3.evaluate(ParentRunner.java:306)
	at org.junit.runners.ParentRunner.run(ParentRunner.java:413)
	at org.apache.maven.surefire.junit4.JUnit4Provider.execute(JUnit4Provider.java:344)
	at org.apache.maven.surefire.junit4.JUnit4Provider.executeWithRerun(JUnit4Provider.java:269)
	at org.apache.maven.surefire.junit4.JUnit4Provider.executeTestSet(JUnit4Provider.java:240)
	at org.apache.maven.surefire.junit4.JUnit4Provider.invoke(JUnit4Provider.java:184)
	at org.apache.maven.surefire.booter.ForkedBooter.invokeProviderInSameClassLoader(ForkedBooter.java:286)
	at org.apache.maven.surefire.booter.ForkedBooter.runSuitesInProcess(ForkedBooter.java:240)
	at org.apache.maven.surefire.booter.ForkedBooter.main(ForkedBooter.java:121)
Caused by: java.lang.RuntimeException: No lang found for label txt
	at org.aksw.jena_sparql_api.rx.RDFLanguagesEx.lambda$findLang$6(RDFLanguagesEx.java:209)
	at java.base/java.util.Optional.orElseThrow(Optional.java:408)
	at org.aksw.jena_sparql_api.rx.RDFLanguagesEx.findLang(RDFLanguagesEx.java:209)
	at org.aksw.sparql_binding_stream.cli.main.SbsCmdImpls.query(SbsCmdImpls.java:201)
	at org.aksw.sparql_binding_stream.cli.cmd.CmdSbsMap.call(CmdSbsMap.java:37)
	at org.aksw.sparql_binding_stream.cli.cmd.CmdSbsMap.call(CmdSbsMap.java:13)
	at picocli.CommandLine.executeUserObject(CommandLine.java:1953)
	at picocli.CommandLine.access$1300(CommandLine.java:145)
	at picocli.CommandLine$RunLast.executeUserObjectOfLastSubcommandWithSameParent(CommandLine.java:2358)
	at picocli.CommandLine$RunLast.handle(CommandLine.java:2352)
	at picocli.CommandLine$RunLast.handle(CommandLine.java:2314)
	at picocli.CommandLine$AbstractParseResultHandler.execute(CommandLine.java:2179)
	at picocli.CommandLine$RunLast.execute(CommandLine.java:2316)
	at picocli.CommandLine.execute(CommandLine.java:2078)
	... 30 more
java.lang.RuntimeException: java.lang.RuntimeException: No lang found for label txt
	at org.aksw.commons.util.exception.ExceptionUtilsAksw.rethrowUnless(ExceptionUtilsAksw.java:40)
	at org.aksw.commons.util.exception.ExceptionUtilsAksw.rethrowIfNotBrokenPipe(ExceptionUtilsAksw.java:81)
	at org.aksw.rdf_processing_toolkit.cli.cmd.CmdUtils.lambda$callCmd$0(CmdUtils.java:69)
	at picocli.CommandLine.execute(CommandLine.java:2088)
	at org.aksw.rdf_processing_toolkit.cli.cmd.CmdUtils.callCmd(CmdUtils.java:75)
	at org.aksw.rdf_processing_toolkit.cli.cmd.CmdUtils.callCmd(CmdUtils.java:39)
	at org.aksw.sparql_integrate.ngs.cli.main.TestSparqlBindingStreamOperators.test1(TestSparqlBindingStreamOperators.java:18)
	at java.base/jdk.internal.reflect.NativeMethodAccessorImpl.invoke0(Native Method)
	at java.base/jdk.internal.reflect.NativeMethodAccessorImpl.invoke(NativeMethodAccessorImpl.java:62)
	at java.base/jdk.internal.reflect.DelegatingMethodAccessorImpl.invoke(DelegatingMethodAccessorImpl.java:43)
	at java.base/java.lang.reflect.Method.invoke(Method.java:566)
	at org.junit.runners.model.FrameworkMethod$1.runReflectiveCall(FrameworkMethod.java:59)
	at org.junit.internal.runners.model.ReflectiveCallable.run(ReflectiveCallable.java:12)
	at org.junit.runners.model.FrameworkMethod.invokeExplosively(FrameworkMethod.java:56)
	at org.junit.internal.runners.statements.InvokeMethod.evaluate(InvokeMethod.java:17)
	at org.junit.runners.ParentRunner$3.evaluate(ParentRunner.java:306)
	at org.junit.runners.BlockJUnit4ClassRunner$1.evaluate(BlockJUnit4ClassRunner.java:100)
	at org.junit.runners.ParentRunner.runLeaf(ParentRunner.java:366)
	at org.junit.runners.BlockJUnit4ClassRunner.runChild(BlockJUnit4ClassRunner.java:103)
	at org.junit.runners.BlockJUnit4ClassRunner.runChild(BlockJUnit4ClassRunner.java:63)
	at org.junit.runners.ParentRunner$4.run(ParentRunner.java:331)
	at org.junit.runners.ParentRunner$1.schedule(ParentRunner.java:79)
	at org.junit.runners.ParentRunner.runChildren(ParentRunner.java:329)
	at org.junit.runners.ParentRunner.access$100(ParentRunner.java:66)
	at org.junit.runners.ParentRunner$2.evaluate(ParentRunner.java:293)
	at org.junit.runners.ParentRunner$3.evaluate(ParentRunner.java:306)
	at org.junit.runners.ParentRunner.run(ParentRunner.java:413)
	at org.apache.maven.surefire.junit4.JUnit4Provider.execute(JUnit4Provider.java:344)
	at org.apache.maven.surefire.junit4.JUnit4Provider.executeWithRerun(JUnit4Provider.java:269)
	at org.apache.maven.surefire.junit4.JUnit4Provider.executeTestSet(JUnit4Provider.java:240)
	at org.apache.maven.surefire.junit4.JUnit4Provider.invoke(JUnit4Provider.java:184)
	at org.apache.maven.surefire.booter.ForkedBooter.invokeProviderInSameClassLoader(ForkedBooter.java:286)
	at org.apache.maven.surefire.booter.ForkedBooter.runSuitesInProcess(ForkedBooter.java:240)
	at org.apache.maven.surefire.booter.ForkedBooter.main(ForkedBooter.java:121)
Caused by: java.lang.RuntimeException: No lang found for label txt
	at org.aksw.jena_sparql_api.rx.RDFLanguagesEx.lambda$findLang$6(RDFLanguagesEx.java:209)
	at java.base/java.util.Optional.orElseThrow(Optional.java:408)
	at org.aksw.jena_sparql_api.rx.RDFLanguagesEx.findLang(RDFLanguagesEx.java:209)
	at org.aksw.sparql_binding_stream.cli.main.SbsCmdImpls.query(SbsCmdImpls.java:201)
	at org.aksw.sparql_binding_stream.cli.cmd.CmdSbsMap.call(CmdSbsMap.java:37)
	at org.aksw.sparql_binding_stream.cli.cmd.CmdSbsMap.call(CmdSbsMap.java:13)
	at picocli.CommandLine.executeUserObject(CommandLine.java:1953)
	at picocli.CommandLine.access$1300(CommandLine.java:145)
	at picocli.CommandLine$RunLast.executeUserObjectOfLastSubcommandWithSameParent(CommandLine.java:2358)
	at picocli.CommandLine$RunLast.handle(CommandLine.java:2352)
	at picocli.CommandLine$RunLast.handle(CommandLine.java:2314)
	at picocli.CommandLine$AbstractParseResultHandler.execute(CommandLine.java:2179)
	at picocli.CommandLine$RunLast.execute(CommandLine.java:2316)
	at picocli.CommandLine.execute(CommandLine.java:2078)
	... 30 more
java.lang.RuntimeException: java.lang.RuntimeException: No lang found for label txt
	at org.aksw.commons.util.exception.ExceptionUtilsAksw.rethrowUnless(ExceptionUtilsAksw.java:40)
	at org.aksw.commons.util.exception.ExceptionUtilsAksw.rethrowIfNotBrokenPipe(ExceptionUtilsAksw.java:81)
	at org.aksw.rdf_processing_toolkit.cli.cmd.CmdUtils.lambda$callCmd$0(CmdUtils.java:69)
	at picocli.CommandLine.execute(CommandLine.java:2088)
	at org.aksw.rdf_processing_toolkit.cli.cmd.CmdUtils.callCmd(CmdUtils.java:75)
	at org.aksw.rdf_processing_toolkit.cli.cmd.CmdUtils.callCmd(CmdUtils.java:39)
	at org.aksw.sparql_integrate.ngs.cli.main.TestSparqlBindingStreamOperators.test1(TestSparqlBindingStreamOperators.java:20)
	at java.base/jdk.internal.reflect.NativeMethodAccessorImpl.invoke0(Native Method)
	at java.base/jdk.internal.reflect.NativeMethodAccessorImpl.invoke(NativeMethodAccessorImpl.java:62)
	at java.base/jdk.internal.reflect.DelegatingMethodAccessorImpl.invoke(DelegatingMethodAccessorImpl.java:43)
	at java.base/java.lang.reflect.Method.invoke(Method.java:566)
	at org.junit.runners.model.FrameworkMethod$1.runReflectiveCall(FrameworkMethod.java:59)
	at org.junit.internal.runners.model.ReflectiveCallable.run(ReflectiveCallable.java:12)
	at org.junit.runners.model.FrameworkMethod.invokeExplosively(FrameworkMethod.java:56)
	at org.junit.internal.runners.statements.InvokeMethod.evaluate(InvokeMethod.java:17)
	at org.junit.runners.ParentRunner$3.evaluate(ParentRunner.java:306)
	at org.junit.runners.BlockJUnit4ClassRunner$1.evaluate(BlockJUnit4ClassRunner.java:100)
	at org.junit.runners.ParentRunner.runLeaf(ParentRunner.java:366)
	at org.junit.runners.BlockJUnit4ClassRunner.runChild(BlockJUnit4ClassRunner.java:103)
	at org.junit.runners.BlockJUnit4ClassRunner.runChild(BlockJUnit4ClassRunner.java:63)
	at org.junit.runners.ParentRunner$4.run(ParentRunner.java:331)
	at org.junit.runners.ParentRunner$1.schedule(ParentRunner.java:79)
	at org.junit.runners.ParentRunner.runChildren(ParentRunner.java:329)
	at org.junit.runners.ParentRunner.access$100(ParentRunner.java:66)
	at org.junit.runners.ParentRunner$2.evaluate(ParentRunner.java:293)
	at org.junit.runners.ParentRunner$3.evaluate(ParentRunner.java:306)
	at org.junit.runners.ParentRunner.run(ParentRunner.java:413)
	at org.apache.maven.surefire.junit4.JUnit4Provider.execute(JUnit4Provider.java:344)
	at org.apache.maven.surefire.junit4.JUnit4Provider.executeWithRerun(JUnit4Provider.java:269)
	at org.apache.maven.surefire.junit4.JUnit4Provider.executeTestSet(JUnit4Provider.java:240)
	at org.apache.maven.surefire.junit4.JUnit4Provider.invoke(JUnit4Provider.java:184)
	at org.apache.maven.surefire.booter.ForkedBooter.invokeProviderInSameClassLoader(ForkedBooter.java:286)
	at org.apache.maven.surefire.booter.ForkedBooter.runSuitesInProcess(ForkedBooter.java:240)
	at org.apache.maven.surefire.booter.ForkedBooter.main(ForkedBooter.java:121)
Caused by: java.lang.RuntimeException: No lang found for label txt
	at org.aksw.jena_sparql_api.rx.RDFLanguagesEx.lambda$findLang$6(RDFLanguagesEx.java:209)
	at java.base/java.util.Optional.orElseThrow(Optional.java:408)
	at org.aksw.jena_sparql_api.rx.RDFLanguagesEx.findLang(RDFLanguagesEx.java:209)
	at org.aksw.sparql_binding_stream.cli.main.SbsCmdImpls.query(SbsCmdImpls.java:201)
	at org.aksw.sparql_binding_stream.cli.cmd.CmdSbsMap.call(CmdSbsMap.java:37)
	at org.aksw.sparql_binding_stream.cli.cmd.CmdSbsMap.call(CmdSbsMap.java:13)
	at picocli.CommandLine.executeUserObject(CommandLine.java:1953)
	at picocli.CommandLine.access$1300(CommandLine.java:145)
	at picocli.CommandLine$RunLast.executeUserObjectOfLastSubcommandWithSameParent(CommandLine.java:2358)
	at picocli.CommandLine$RunLast.handle(CommandLine.java:2352)
	at picocli.CommandLine$RunLast.handle(CommandLine.java:2314)
	at picocli.CommandLine$AbstractParseResultHandler.execute(CommandLine.java:2179)
	at picocli.CommandLine$RunLast.execute(CommandLine.java:2316)
	at picocli.CommandLine.execute(CommandLine.java:2078)
	... 30 more
Tests run: 1, Failures: 0, Errors: 0, Skipped: 0, Time elapsed: 5.802 sec - in org.aksw.sparql_integrate.ngs.cli.main.TestSparqlBindingStreamOperators

Results :

Tests run: 2, Failures: 0, Errors: 0, Skipped: 0

[JENKINS] Recording test results
[INFO] 
[INFO] --- maven-jar-plugin:2.4:jar (default-jar) @ rdf-processing-toolkit-cli ---
[INFO] Building jar: /usr/share/tomcat8/.jenkins/jobs/RDF-Processing-Toolkit/workspace/rdf-processing-toolkit-cli/target/rdf-processing-toolkit-cli-1.9.1-SNAPSHOT.jar
[INFO] 
[INFO] --- maven-javadoc-plugin:2.9.1:jar (attach-javadocs) @ rdf-processing-toolkit-cli ---
[INFO] 
Loading source file /usr/share/tomcat8/.jenkins/jobs/RDF-Processing-Toolkit/workspace/rdf-processing-toolkit-cli/src/main/java/sbs.java...
Loading source file /usr/share/tomcat8/.jenkins/jobs/RDF-Processing-Toolkit/workspace/rdf-processing-toolkit-cli/src/main/java/rpt.java...
Loading source file /usr/share/tomcat8/.jenkins/jobs/RDF-Processing-Toolkit/workspace/rdf-processing-toolkit-cli/src/main/java/ngs.java...
Loading source file /usr/share/tomcat8/.jenkins/jobs/RDF-Processing-Toolkit/workspace/rdf-processing-toolkit-cli/src/main/java/integrate.java...
Loading source files for package org.aksw.named_graph_stream.cli.main...
Loading source files for package org.aksw.named_graph_stream.cli.cmd...
Loading source files for package org.aksw.sparql_integrate.cli...
Loading source files for package org.aksw.sparql_integrate.cli.main...
Loading source files for package org.aksw.sparql_integrate.cli.cmd...
Loading source files for package org.aksw.rdf_processing_toolkit.cli.main...
Loading source files for package org.aksw.rdf_processing_toolkit.cli.cmd...
Loading source files for package org.aksw.jena_sparql_api.rx.op.api...
Loading source files for package org.aksw.sparql_binding_stream.cli.main...
Loading source files for package org.aksw.sparql_binding_stream.cli.cmd...
Constructing Javadoc information...
Standard Doclet version 11.0.13
Building tree for all the packages and classes...
Generating /usr/share/tomcat8/.jenkins/jobs/RDF-Processing-Toolkit/workspace/rdf-processing-toolkit-cli/target/apidocs/integrate.html...
Generating /usr/share/tomcat8/.jenkins/jobs/RDF-Processing-Toolkit/workspace/rdf-processing-toolkit-cli/target/apidocs/ngs.html...
Generating /usr/share/tomcat8/.jenkins/jobs/RDF-Processing-Toolkit/workspace/rdf-processing-toolkit-cli/target/apidocs/rpt.html...
Generating /usr/share/tomcat8/.jenkins/jobs/RDF-Processing-Toolkit/workspace/rdf-processing-toolkit-cli/target/apidocs/sbs.html...
Generating /usr/share/tomcat8/.jenkins/jobs/RDF-Processing-Toolkit/workspace/rdf-processing-toolkit-cli/target/apidocs/org/aksw/jena_sparql_api/rx/op/api/OpConfigSort.html...
Generating /usr/share/tomcat8/.jenkins/jobs/RDF-Processing-Toolkit/workspace/rdf-processing-toolkit-cli/target/apidocs/org/aksw/named_graph_stream/cli/cmd/CmdNgJoin.html...
Generating /usr/share/tomcat8/.jenkins/jobs/RDF-Processing-Toolkit/workspace/rdf-processing-toolkit-cli/target/apidocs/org/aksw/named_graph_stream/cli/cmd/CmdNgsCat.html...
Generating /usr/share/tomcat8/.jenkins/jobs/RDF-Processing-Toolkit/workspace/rdf-processing-toolkit-cli/target/apidocs/org/aksw/named_graph_stream/cli/cmd/CmdNgsFilter.html...
Generating /usr/share/tomcat8/.jenkins/jobs/RDF-Processing-Toolkit/workspace/rdf-processing-toolkit-cli/target/apidocs/org/aksw/named_graph_stream/cli/cmd/CmdNgsGit.html...
Generating /usr/share/tomcat8/.jenkins/jobs/RDF-Processing-Toolkit/workspace/rdf-processing-toolkit-cli/target/apidocs/org/aksw/named_graph_stream/cli/cmd/CmdNgsHead.html...
Generating /usr/share/tomcat8/.jenkins/jobs/RDF-Processing-Toolkit/workspace/rdf-processing-toolkit-cli/target/apidocs/org/aksw/named_graph_stream/cli/cmd/CmdNgsMain.html...
Generating /usr/share/tomcat8/.jenkins/jobs/RDF-Processing-Toolkit/workspace/rdf-processing-toolkit-cli/target/apidocs/org/aksw/named_graph_stream/cli/cmd/CmdNgsMap.html...
Generating /usr/share/tomcat8/.jenkins/jobs/RDF-Processing-Toolkit/workspace/rdf-processing-toolkit-cli/target/apidocs/org/aksw/named_graph_stream/cli/cmd/CmdNgsMap.MapSpec.html...
Generating /usr/share/tomcat8/.jenkins/jobs/RDF-Processing-Toolkit/workspace/rdf-processing-toolkit-cli/target/apidocs/org/aksw/named_graph_stream/cli/cmd/CmdNgsMerge.html...
Generating /usr/share/tomcat8/.jenkins/jobs/RDF-Processing-Toolkit/workspace/rdf-processing-toolkit-cli/target/apidocs/org/aksw/named_graph_stream/cli/cmd/CmdNgsProbe.html...
Generating /usr/share/tomcat8/.jenkins/jobs/RDF-Processing-Toolkit/workspace/rdf-processing-toolkit-cli/target/apidocs/org/aksw/named_graph_stream/cli/cmd/CmdNgsSort.html...
Generating /usr/share/tomcat8/.jenkins/jobs/RDF-Processing-Toolkit/workspace/rdf-processing-toolkit-cli/target/apidocs/org/aksw/named_graph_stream/cli/cmd/CmdNgsSubjects.html...
Generating /usr/share/tomcat8/.jenkins/jobs/RDF-Processing-Toolkit/workspace/rdf-processing-toolkit-cli/target/apidocs/org/aksw/named_graph_stream/cli/cmd/CmdNgsTail.html...
Generating /usr/share/tomcat8/.jenkins/jobs/RDF-Processing-Toolkit/workspace/rdf-processing-toolkit-cli/target/apidocs/org/aksw/named_graph_stream/cli/cmd/CmdNgsUntil.html...
Generating /usr/share/tomcat8/.jenkins/jobs/RDF-Processing-Toolkit/workspace/rdf-processing-toolkit-cli/target/apidocs/org/aksw/named_graph_stream/cli/cmd/CmdNgsWc.html...
Generating /usr/share/tomcat8/.jenkins/jobs/RDF-Processing-Toolkit/workspace/rdf-processing-toolkit-cli/target/apidocs/org/aksw/named_graph_stream/cli/cmd/CmdNgsWhile.html...
Generating /usr/share/tomcat8/.jenkins/jobs/RDF-Processing-Toolkit/workspace/rdf-processing-toolkit-cli/target/apidocs/org/aksw/named_graph_stream/cli/cmd/IParameterConsumerFlaggedLong.html...
Generating /usr/share/tomcat8/.jenkins/jobs/RDF-Processing-Toolkit/workspace/rdf-processing-toolkit-cli/target/apidocs/org/aksw/named_graph_stream/cli/main/DatasetFlowOps.html...
Generating /usr/share/tomcat8/.jenkins/jobs/RDF-Processing-Toolkit/workspace/rdf-processing-toolkit-cli/target/apidocs/org/aksw/named_graph_stream/cli/main/MainCliNamedGraphStream.html...
Generating /usr/share/tomcat8/.jenkins/jobs/RDF-Processing-Toolkit/workspace/rdf-processing-toolkit-cli/target/apidocs/org/aksw/named_graph_stream/cli/main/MainPlaygroundScanTrig.html...
Generating /usr/share/tomcat8/.jenkins/jobs/RDF-Processing-Toolkit/workspace/rdf-processing-toolkit-cli/target/apidocs/org/aksw/named_graph_stream/cli/main/NamedGraphFluent.html...
Generating /usr/share/tomcat8/.jenkins/jobs/RDF-Processing-Toolkit/workspace/rdf-processing-toolkit-cli/target/apidocs/org/aksw/named_graph_stream/cli/main/NamedGraphStreamOps.html...
Generating /usr/share/tomcat8/.jenkins/jobs/RDF-Processing-Toolkit/workspace/rdf-processing-toolkit-cli/target/apidocs/org/aksw/named_graph_stream/cli/main/NgsCmdImpls.html...
Generating /usr/share/tomcat8/.jenkins/jobs/RDF-Processing-Toolkit/workspace/rdf-processing-toolkit-cli/target/apidocs/org/aksw/named_graph_stream/cli/main/NgsGitCmdImpls.html...
Generating /usr/share/tomcat8/.jenkins/jobs/RDF-Processing-Toolkit/workspace/rdf-processing-toolkit-cli/target/apidocs/org/aksw/named_graph_stream/cli/main/QueryEvaluatorForTuple.html...
Generating /usr/share/tomcat8/.jenkins/jobs/RDF-Processing-Toolkit/workspace/rdf-processing-toolkit-cli/target/apidocs/org/aksw/rdf_processing_toolkit/cli/cmd/CliUtils.html...
Generating /usr/share/tomcat8/.jenkins/jobs/RDF-Processing-Toolkit/workspace/rdf-processing-toolkit-cli/target/apidocs/org/aksw/rdf_processing_toolkit/cli/cmd/CmdCommonBase.html...
Generating /usr/share/tomcat8/.jenkins/jobs/RDF-Processing-Toolkit/workspace/rdf-processing-toolkit-cli/target/apidocs/org/aksw/rdf_processing_toolkit/cli/cmd/CmdRptMain.html...
Generating /usr/share/tomcat8/.jenkins/jobs/RDF-Processing-Toolkit/workspace/rdf-processing-toolkit-cli/target/apidocs/org/aksw/rdf_processing_toolkit/cli/cmd/CmdUtils.html...
Generating /usr/share/tomcat8/.jenkins/jobs/RDF-Processing-Toolkit/workspace/rdf-processing-toolkit-cli/target/apidocs/org/aksw/rdf_processing_toolkit/cli/cmd/HasDebugMode.html...
Generating /usr/share/tomcat8/.jenkins/jobs/RDF-Processing-Toolkit/workspace/rdf-processing-toolkit-cli/target/apidocs/org/aksw/rdf_processing_toolkit/cli/cmd/VersionProviderFromClasspathProperties.html...
Generating /usr/share/tomcat8/.jenkins/jobs/RDF-Processing-Toolkit/workspace/rdf-processing-toolkit-cli/target/apidocs/org/aksw/rdf_processing_toolkit/cli/cmd/VersionProviderRdfProcessingToolkit.html...
Generating /usr/share/tomcat8/.jenkins/jobs/RDF-Processing-Toolkit/workspace/rdf-processing-toolkit-cli/target/apidocs/org/aksw/rdf_processing_toolkit/cli/main/MainCliRdfProcessingToolkit.html...
Generating /usr/share/tomcat8/.jenkins/jobs/RDF-Processing-Toolkit/workspace/rdf-processing-toolkit-cli/target/apidocs/org/aksw/sparql_binding_stream/cli/cmd/CmdSbsFilter.html...
Generating /usr/share/tomcat8/.jenkins/jobs/RDF-Processing-Toolkit/workspace/rdf-processing-toolkit-cli/target/apidocs/org/aksw/sparql_binding_stream/cli/cmd/CmdSbsMain.html...
Generating /usr/share/tomcat8/.jenkins/jobs/RDF-Processing-Toolkit/workspace/rdf-processing-toolkit-cli/target/apidocs/org/aksw/sparql_binding_stream/cli/cmd/CmdSbsMap.html...
Generating /usr/share/tomcat8/.jenkins/jobs/RDF-Processing-Toolkit/workspace/rdf-processing-toolkit-cli/target/apidocs/org/aksw/sparql_binding_stream/cli/cmd/CmdSbsSplit.html...
Generating /usr/share/tomcat8/.jenkins/jobs/RDF-Processing-Toolkit/workspace/rdf-processing-toolkit-cli/target/apidocs/org/aksw/sparql_binding_stream/cli/main/MainCliSparqlBindingStream.html...
Generating /usr/share/tomcat8/.jenkins/jobs/RDF-Processing-Toolkit/workspace/rdf-processing-toolkit-cli/target/apidocs/org/aksw/sparql_binding_stream/cli/main/SbsCmdImpls.html...
Generating /usr/share/tomcat8/.jenkins/jobs/RDF-Processing-Toolkit/workspace/rdf-processing-toolkit-cli/target/apidocs/org/aksw/sparql_integrate/cli/CommandMain.html...
Generating /usr/share/tomcat8/.jenkins/jobs/RDF-Processing-Toolkit/workspace/rdf-processing-toolkit-cli/target/apidocs/org/aksw/sparql_integrate/cli/DerbyUtil.html...
Generating /usr/share/tomcat8/.jenkins/jobs/RDF-Processing-Toolkit/workspace/rdf-processing-toolkit-cli/target/apidocs/org/aksw/sparql_integrate/cli/MainCliSparqlIntegrateOld.html...
Generating /usr/share/tomcat8/.jenkins/jobs/RDF-Processing-Toolkit/workspace/rdf-processing-toolkit-cli/target/apidocs/org/aksw/sparql_integrate/cli/MainCliSparqlLoad.html...
Generating /usr/share/tomcat8/.jenkins/jobs/RDF-Processing-Toolkit/workspace/rdf-processing-toolkit-cli/target/apidocs/org/aksw/sparql_integrate/cli/SparqlStmtProcessor.html...
Generating /usr/share/tomcat8/.jenkins/jobs/RDF-Processing-Toolkit/workspace/rdf-processing-toolkit-cli/target/apidocs/org/aksw/sparql_integrate/cli/cmd/CmdSparqlIntegrateMain.html...
Generating /usr/share/tomcat8/.jenkins/jobs/RDF-Processing-Toolkit/workspace/rdf-processing-toolkit-cli/target/apidocs/org/aksw/sparql_integrate/cli/cmd/CmdSparqlIntegrateMain.OutputSpec.html...
Generating /usr/share/tomcat8/.jenkins/jobs/RDF-Processing-Toolkit/workspace/rdf-processing-toolkit-cli/target/apidocs/org/aksw/sparql_integrate/cli/main/MainCliSparqlIntegrate.html...
Generating /usr/share/tomcat8/.jenkins/jobs/RDF-Processing-Toolkit/workspace/rdf-processing-toolkit-cli/target/apidocs/org/aksw/sparql_integrate/cli/main/SparqlIntegrateCmdImpls.html...
Generating /usr/share/tomcat8/.jenkins/jobs/RDF-Processing-Toolkit/workspace/rdf-processing-toolkit-cli/target/apidocs/org/aksw/sparql_integrate/cli/main/SparqlIntegrateLegacyDataSources.html...
Generating /usr/share/tomcat8/.jenkins/jobs/RDF-Processing-Toolkit/workspace/rdf-processing-toolkit-cli/target/apidocs/package-summary.html...
Generating /usr/share/tomcat8/.jenkins/jobs/RDF-Processing-Toolkit/workspace/rdf-processing-toolkit-cli/target/apidocs/package-tree.html...
Generating /usr/share/tomcat8/.jenkins/jobs/RDF-Processing-Toolkit/workspace/rdf-processing-toolkit-cli/target/apidocs/org/aksw/jena_sparql_api/rx/op/api/package-summary.html...
Generating /usr/share/tomcat8/.jenkins/jobs/RDF-Processing-Toolkit/workspace/rdf-processing-toolkit-cli/target/apidocs/org/aksw/jena_sparql_api/rx/op/api/package-tree.html...
Generating /usr/share/tomcat8/.jenkins/jobs/RDF-Processing-Toolkit/workspace/rdf-processing-toolkit-cli/target/apidocs/org/aksw/named_graph_stream/cli/cmd/package-summary.html...
Generating /usr/share/tomcat8/.jenkins/jobs/RDF-Processing-Toolkit/workspace/rdf-processing-toolkit-cli/target/apidocs/org/aksw/named_graph_stream/cli/cmd/package-tree.html...
Generating /usr/share/tomcat8/.jenkins/jobs/RDF-Processing-Toolkit/workspace/rdf-processing-toolkit-cli/target/apidocs/org/aksw/named_graph_stream/cli/main/package-summary.html...
Generating /usr/share/tomcat8/.jenkins/jobs/RDF-Processing-Toolkit/workspace/rdf-processing-toolkit-cli/target/apidocs/org/aksw/named_graph_stream/cli/main/package-tree.html...
Generating /usr/share/tomcat8/.jenkins/jobs/RDF-Processing-Toolkit/workspace/rdf-processing-toolkit-cli/target/apidocs/org/aksw/rdf_processing_toolkit/cli/cmd/package-summary.html...
Generating /usr/share/tomcat8/.jenkins/jobs/RDF-Processing-Toolkit/workspace/rdf-processing-toolkit-cli/target/apidocs/org/aksw/rdf_processing_toolkit/cli/cmd/package-tree.html...
Generating /usr/share/tomcat8/.jenkins/jobs/RDF-Processing-Toolkit/workspace/rdf-processing-toolkit-cli/target/apidocs/org/aksw/rdf_processing_toolkit/cli/main/package-summary.html...
Generating /usr/share/tomcat8/.jenkins/jobs/RDF-Processing-Toolkit/workspace/rdf-processing-toolkit-cli/target/apidocs/org/aksw/rdf_processing_toolkit/cli/main/package-tree.html...
Generating /usr/share/tomcat8/.jenkins/jobs/RDF-Processing-Toolkit/workspace/rdf-processing-toolkit-cli/target/apidocs/org/aksw/sparql_binding_stream/cli/cmd/package-summary.html...
Generating /usr/share/tomcat8/.jenkins/jobs/RDF-Processing-Toolkit/workspace/rdf-processing-toolkit-cli/target/apidocs/org/aksw/sparql_binding_stream/cli/cmd/package-tree.html...
Generating /usr/share/tomcat8/.jenkins/jobs/RDF-Processing-Toolkit/workspace/rdf-processing-toolkit-cli/target/apidocs/org/aksw/sparql_binding_stream/cli/main/package-summary.html...
Generating /usr/share/tomcat8/.jenkins/jobs/RDF-Processing-Toolkit/workspace/rdf-processing-toolkit-cli/target/apidocs/org/aksw/sparql_binding_stream/cli/main/package-tree.html...
Generating /usr/share/tomcat8/.jenkins/jobs/RDF-Processing-Toolkit/workspace/rdf-processing-toolkit-cli/target/apidocs/org/aksw/sparql_integrate/cli/package-summary.html...
Generating /usr/share/tomcat8/.jenkins/jobs/RDF-Processing-Toolkit/workspace/rdf-processing-toolkit-cli/target/apidocs/org/aksw/sparql_integrate/cli/package-tree.html...
Generating /usr/share/tomcat8/.jenkins/jobs/RDF-Processing-Toolkit/workspace/rdf-processing-toolkit-cli/target/apidocs/org/aksw/sparql_integrate/cli/cmd/package-summary.html...
Generating /usr/share/tomcat8/.jenkins/jobs/RDF-Processing-Toolkit/workspace/rdf-processing-toolkit-cli/target/apidocs/org/aksw/sparql_integrate/cli/cmd/package-tree.html...
Generating /usr/share/tomcat8/.jenkins/jobs/RDF-Processing-Toolkit/workspace/rdf-processing-toolkit-cli/target/apidocs/org/aksw/sparql_integrate/cli/main/package-summary.html...
Generating /usr/share/tomcat8/.jenkins/jobs/RDF-Processing-Toolkit/workspace/rdf-processing-toolkit-cli/target/apidocs/org/aksw/sparql_integrate/cli/main/package-tree.html...
Generating /usr/share/tomcat8/.jenkins/jobs/RDF-Processing-Toolkit/workspace/rdf-processing-toolkit-cli/target/apidocs/constant-values.html...
Generating /usr/share/tomcat8/.jenkins/jobs/RDF-Processing-Toolkit/workspace/rdf-processing-toolkit-cli/target/apidocs/org/aksw/named_graph_stream/cli/main/class-use/NgsGitCmdImpls.html...
Generating /usr/share/tomcat8/.jenkins/jobs/RDF-Processing-Toolkit/workspace/rdf-processing-toolkit-cli/target/apidocs/org/aksw/named_graph_stream/cli/main/class-use/QueryEvaluatorForTuple.html...
Generating /usr/share/tomcat8/.jenkins/jobs/RDF-Processing-Toolkit/workspace/rdf-processing-toolkit-cli/target/apidocs/org/aksw/named_graph_stream/cli/main/class-use/NamedGraphStreamOps.html...
Generating /usr/share/tomcat8/.jenkins/jobs/RDF-Processing-Toolkit/workspace/rdf-processing-toolkit-cli/target/apidocs/org/aksw/named_graph_stream/cli/main/class-use/NamedGraphFluent.html...
Generating /usr/share/tomcat8/.jenkins/jobs/RDF-Processing-Toolkit/workspace/rdf-processing-toolkit-cli/target/apidocs/org/aksw/named_graph_stream/cli/main/class-use/MainPlaygroundScanTrig.html...
Generating /usr/share/tomcat8/.jenkins/jobs/RDF-Processing-Toolkit/workspace/rdf-processing-toolkit-cli/target/apidocs/org/aksw/named_graph_stream/cli/main/class-use/NgsCmdImpls.html...
Generating /usr/share/tomcat8/.jenkins/jobs/RDF-Processing-Toolkit/workspace/rdf-processing-toolkit-cli/target/apidocs/org/aksw/named_graph_stream/cli/main/class-use/DatasetFlowOps.html...
Generating /usr/share/tomcat8/.jenkins/jobs/RDF-Processing-Toolkit/workspace/rdf-processing-toolkit-cli/target/apidocs/org/aksw/named_graph_stream/cli/main/class-use/MainCliNamedGraphStream.html...
Generating /usr/share/tomcat8/.jenkins/jobs/RDF-Processing-Toolkit/workspace/rdf-processing-toolkit-cli/target/apidocs/org/aksw/named_graph_stream/cli/cmd/class-use/CmdNgsWhile.html...
Generating /usr/share/tomcat8/.jenkins/jobs/RDF-Processing-Toolkit/workspace/rdf-processing-toolkit-cli/target/apidocs/org/aksw/named_graph_stream/cli/cmd/class-use/CmdNgJoin.html...
Generating /usr/share/tomcat8/.jenkins/jobs/RDF-Processing-Toolkit/workspace/rdf-processing-toolkit-cli/target/apidocs/org/aksw/named_graph_stream/cli/cmd/class-use/CmdNgsMain.html...
Generating /usr/share/tomcat8/.jenkins/jobs/RDF-Processing-Toolkit/workspace/rdf-processing-toolkit-cli/target/apidocs/org/aksw/named_graph_stream/cli/cmd/class-use/CmdNgsMerge.html...
Generating /usr/share/tomcat8/.jenkins/jobs/RDF-Processing-Toolkit/workspace/rdf-processing-toolkit-cli/target/apidocs/org/aksw/named_graph_stream/cli/cmd/class-use/CmdNgsMap.html...
Generating /usr/share/tomcat8/.jenkins/jobs/RDF-Processing-Toolkit/workspace/rdf-processing-toolkit-cli/target/apidocs/org/aksw/named_graph_stream/cli/cmd/class-use/CmdNgsMap.MapSpec.html...
Generating /usr/share/tomcat8/.jenkins/jobs/RDF-Processing-Toolkit/workspace/rdf-processing-toolkit-cli/target/apidocs/org/aksw/named_graph_stream/cli/cmd/class-use/IParameterConsumerFlaggedLong.html...
Generating /usr/share/tomcat8/.jenkins/jobs/RDF-Processing-Toolkit/workspace/rdf-processing-toolkit-cli/target/apidocs/org/aksw/named_graph_stream/cli/cmd/class-use/CmdNgsSubjects.html...
Generating /usr/share/tomcat8/.jenkins/jobs/RDF-Processing-Toolkit/workspace/rdf-processing-toolkit-cli/target/apidocs/org/aksw/named_graph_stream/cli/cmd/class-use/CmdNgsUntil.html...
Generating /usr/share/tomcat8/.jenkins/jobs/RDF-Processing-Toolkit/workspace/rdf-processing-toolkit-cli/target/apidocs/org/aksw/named_graph_stream/cli/cmd/class-use/CmdNgsTail.html...
Generating /usr/share/tomcat8/.jenkins/jobs/RDF-Processing-Toolkit/workspace/rdf-processing-toolkit-cli/target/apidocs/org/aksw/named_graph_stream/cli/cmd/class-use/CmdNgsCat.html...
Generating /usr/share/tomcat8/.jenkins/jobs/RDF-Processing-Toolkit/workspace/rdf-processing-toolkit-cli/target/apidocs/org/aksw/named_graph_stream/cli/cmd/class-use/CmdNgsWc.html...
Generating /usr/share/tomcat8/.jenkins/jobs/RDF-Processing-Toolkit/workspace/rdf-processing-toolkit-cli/target/apidocs/org/aksw/named_graph_stream/cli/cmd/class-use/CmdNgsProbe.html...
Generating /usr/share/tomcat8/.jenkins/jobs/RDF-Processing-Toolkit/workspace/rdf-processing-toolkit-cli/target/apidocs/org/aksw/named_graph_stream/cli/cmd/class-use/CmdNgsGit.html...
Generating /usr/share/tomcat8/.jenkins/jobs/RDF-Processing-Toolkit/workspace/rdf-processing-toolkit-cli/target/apidocs/org/aksw/named_graph_stream/cli/cmd/class-use/CmdNgsHead.html...
Generating /usr/share/tomcat8/.jenkins/jobs/RDF-Processing-Toolkit/workspace/rdf-processing-toolkit-cli/target/apidocs/org/aksw/named_graph_stream/cli/cmd/class-use/CmdNgsFilter.html...
Generating /usr/share/tomcat8/.jenkins/jobs/RDF-Processing-Toolkit/workspace/rdf-processing-toolkit-cli/target/apidocs/org/aksw/named_graph_stream/cli/cmd/class-use/CmdNgsSort.html...
Generating /usr/share/tomcat8/.jenkins/jobs/RDF-Processing-Toolkit/workspace/rdf-processing-toolkit-cli/target/apidocs/org/aksw/sparql_integrate/cli/class-use/DerbyUtil.html...
Generating /usr/share/tomcat8/.jenkins/jobs/RDF-Processing-Toolkit/workspace/rdf-processing-toolkit-cli/target/apidocs/org/aksw/sparql_integrate/cli/class-use/MainCliSparqlIntegrateOld.html...
Generating /usr/share/tomcat8/.jenkins/jobs/RDF-Processing-Toolkit/workspace/rdf-processing-toolkit-cli/target/apidocs/org/aksw/sparql_integrate/cli/class-use/SparqlStmtProcessor.html...
Generating /usr/share/tomcat8/.jenkins/jobs/RDF-Processing-Toolkit/workspace/rdf-processing-toolkit-cli/target/apidocs/org/aksw/sparql_integrate/cli/class-use/MainCliSparqlLoad.html...
Generating /usr/share/tomcat8/.jenkins/jobs/RDF-Processing-Toolkit/workspace/rdf-processing-toolkit-cli/target/apidocs/org/aksw/sparql_integrate/cli/class-use/CommandMain.html...
Generating /usr/share/tomcat8/.jenkins/jobs/RDF-Processing-Toolkit/workspace/rdf-processing-toolkit-cli/target/apidocs/org/aksw/sparql_integrate/cli/main/class-use/SparqlIntegrateLegacyDataSources.html...
Generating /usr/share/tomcat8/.jenkins/jobs/RDF-Processing-Toolkit/workspace/rdf-processing-toolkit-cli/target/apidocs/org/aksw/sparql_integrate/cli/main/class-use/MainCliSparqlIntegrate.html...
Generating /usr/share/tomcat8/.jenkins/jobs/RDF-Processing-Toolkit/workspace/rdf-processing-toolkit-cli/target/apidocs/org/aksw/sparql_integrate/cli/main/class-use/SparqlIntegrateCmdImpls.html...
Generating /usr/share/tomcat8/.jenkins/jobs/RDF-Processing-Toolkit/workspace/rdf-processing-toolkit-cli/target/apidocs/org/aksw/sparql_integrate/cli/cmd/class-use/CmdSparqlIntegrateMain.html...
Generating /usr/share/tomcat8/.jenkins/jobs/RDF-Processing-Toolkit/workspace/rdf-processing-toolkit-cli/target/apidocs/org/aksw/sparql_integrate/cli/cmd/class-use/CmdSparqlIntegrateMain.OutputSpec.html...
Generating /usr/share/tomcat8/.jenkins/jobs/RDF-Processing-Toolkit/workspace/rdf-processing-toolkit-cli/target/apidocs/org/aksw/rdf_processing_toolkit/cli/main/class-use/MainCliRdfProcessingToolkit.html...
Generating /usr/share/tomcat8/.jenkins/jobs/RDF-Processing-Toolkit/workspace/rdf-processing-toolkit-cli/target/apidocs/org/aksw/rdf_processing_toolkit/cli/cmd/class-use/HasDebugMode.html...
Generating /usr/share/tomcat8/.jenkins/jobs/RDF-Processing-Toolkit/workspace/rdf-processing-toolkit-cli/target/apidocs/org/aksw/rdf_processing_toolkit/cli/cmd/class-use/CmdCommonBase.html...
Generating /usr/share/tomcat8/.jenkins/jobs/RDF-Processing-Toolkit/workspace/rdf-processing-toolkit-cli/target/apidocs/org/aksw/rdf_processing_toolkit/cli/cmd/class-use/VersionProviderRdfProcessingToolkit.html...
Generating /usr/share/tomcat8/.jenkins/jobs/RDF-Processing-Toolkit/workspace/rdf-processing-toolkit-cli/target/apidocs/org/aksw/rdf_processing_toolkit/cli/cmd/class-use/CliUtils.html...
Generating /usr/share/tomcat8/.jenkins/jobs/RDF-Processing-Toolkit/workspace/rdf-processing-toolkit-cli/target/apidocs/org/aksw/rdf_processing_toolkit/cli/cmd/class-use/CmdUtils.html...
Generating /usr/share/tomcat8/.jenkins/jobs/RDF-Processing-Toolkit/workspace/rdf-processing-toolkit-cli/target/apidocs/org/aksw/rdf_processing_toolkit/cli/cmd/class-use/CmdRptMain.html...
Generating /usr/share/tomcat8/.jenkins/jobs/RDF-Processing-Toolkit/workspace/rdf-processing-toolkit-cli/target/apidocs/org/aksw/rdf_processing_toolkit/cli/cmd/class-use/VersionProviderFromClasspathProperties.html...
Generating /usr/share/tomcat8/.jenkins/jobs/RDF-Processing-Toolkit/workspace/rdf-processing-toolkit-cli/target/apidocs/org/aksw/jena_sparql_api/rx/op/api/class-use/OpConfigSort.html...
Generating /usr/share/tomcat8/.jenkins/jobs/RDF-Processing-Toolkit/workspace/rdf-processing-toolkit-cli/target/apidocs/org/aksw/sparql_binding_stream/cli/main/class-use/SbsCmdImpls.html...
Generating /usr/share/tomcat8/.jenkins/jobs/RDF-Processing-Toolkit/workspace/rdf-processing-toolkit-cli/target/apidocs/org/aksw/sparql_binding_stream/cli/main/class-use/MainCliSparqlBindingStream.html...
Generating /usr/share/tomcat8/.jenkins/jobs/RDF-Processing-Toolkit/workspace/rdf-processing-toolkit-cli/target/apidocs/org/aksw/sparql_binding_stream/cli/cmd/class-use/CmdSbsMain.html...
Generating /usr/share/tomcat8/.jenkins/jobs/RDF-Processing-Toolkit/workspace/rdf-processing-toolkit-cli/target/apidocs/org/aksw/sparql_binding_stream/cli/cmd/class-use/CmdSbsMap.html...
Generating /usr/share/tomcat8/.jenkins/jobs/RDF-Processing-Toolkit/workspace/rdf-processing-toolkit-cli/target/apidocs/org/aksw/sparql_binding_stream/cli/cmd/class-use/CmdSbsSplit.html...
Generating /usr/share/tomcat8/.jenkins/jobs/RDF-Processing-Toolkit/workspace/rdf-processing-toolkit-cli/target/apidocs/org/aksw/sparql_binding_stream/cli/cmd/class-use/CmdSbsFilter.html...
Generating /usr/share/tomcat8/.jenkins/jobs/RDF-Processing-Toolkit/workspace/rdf-processing-toolkit-cli/target/apidocs/class-use/sbs.html...
Generating /usr/share/tomcat8/.jenkins/jobs/RDF-Processing-Toolkit/workspace/rdf-processing-toolkit-cli/target/apidocs/class-use/rpt.html...
Generating /usr/share/tomcat8/.jenkins/jobs/RDF-Processing-Toolkit/workspace/rdf-processing-toolkit-cli/target/apidocs/class-use/ngs.html...
Generating /usr/share/tomcat8/.jenkins/jobs/RDF-Processing-Toolkit/workspace/rdf-processing-toolkit-cli/target/apidocs/class-use/integrate.html...
Generating /usr/share/tomcat8/.jenkins/jobs/RDF-Processing-Toolkit/workspace/rdf-processing-toolkit-cli/target/apidocs/package-use.html...
Generating /usr/share/tomcat8/.jenkins/jobs/RDF-Processing-Toolkit/workspace/rdf-processing-toolkit-cli/target/apidocs/org/aksw/jena_sparql_api/rx/op/api/package-use.html...
Generating /usr/share/tomcat8/.jenkins/jobs/RDF-Processing-Toolkit/workspace/rdf-processing-toolkit-cli/target/apidocs/org/aksw/named_graph_stream/cli/cmd/package-use.html...
Generating /usr/share/tomcat8/.jenkins/jobs/RDF-Processing-Toolkit/workspace/rdf-processing-toolkit-cli/target/apidocs/org/aksw/named_graph_stream/cli/main/package-use.html...
Generating /usr/share/tomcat8/.jenkins/jobs/RDF-Processing-Toolkit/workspace/rdf-processing-toolkit-cli/target/apidocs/org/aksw/rdf_processing_toolkit/cli/cmd/package-use.html...
Generating /usr/share/tomcat8/.jenkins/jobs/RDF-Processing-Toolkit/workspace/rdf-processing-toolkit-cli/target/apidocs/org/aksw/rdf_processing_toolkit/cli/main/package-use.html...
Generating /usr/share/tomcat8/.jenkins/jobs/RDF-Processing-Toolkit/workspace/rdf-processing-toolkit-cli/target/apidocs/org/aksw/sparql_binding_stream/cli/cmd/package-use.html...
Generating /usr/share/tomcat8/.jenkins/jobs/RDF-Processing-Toolkit/workspace/rdf-processing-toolkit-cli/target/apidocs/org/aksw/sparql_binding_stream/cli/main/package-use.html...
Generating /usr/share/tomcat8/.jenkins/jobs/RDF-Processing-Toolkit/workspace/rdf-processing-toolkit-cli/target/apidocs/org/aksw/sparql_integrate/cli/package-use.html...
Generating /usr/share/tomcat8/.jenkins/jobs/RDF-Processing-Toolkit/workspace/rdf-processing-toolkit-cli/target/apidocs/org/aksw/sparql_integrate/cli/cmd/package-use.html...
Generating /usr/share/tomcat8/.jenkins/jobs/RDF-Processing-Toolkit/workspace/rdf-processing-toolkit-cli/target/apidocs/org/aksw/sparql_integrate/cli/main/package-use.html...
Building index for all the packages and classes...
Generating /usr/share/tomcat8/.jenkins/jobs/RDF-Processing-Toolkit/workspace/rdf-processing-toolkit-cli/target/apidocs/overview-tree.html...
Generating /usr/share/tomcat8/.jenkins/jobs/RDF-Processing-Toolkit/workspace/rdf-processing-toolkit-cli/target/apidocs/index-all.html...
Building index for all classes...
Generating /usr/share/tomcat8/.jenkins/jobs/RDF-Processing-Toolkit/workspace/rdf-processing-toolkit-cli/target/apidocs/allclasses-index.html...
Generating /usr/share/tomcat8/.jenkins/jobs/RDF-Processing-Toolkit/workspace/rdf-processing-toolkit-cli/target/apidocs/allpackages-index.html...
Generating /usr/share/tomcat8/.jenkins/jobs/RDF-Processing-Toolkit/workspace/rdf-processing-toolkit-cli/target/apidocs/deprecated-list.html...
Building index for all classes...
Generating /usr/share/tomcat8/.jenkins/jobs/RDF-Processing-Toolkit/workspace/rdf-processing-toolkit-cli/target/apidocs/allclasses.html...
Generating /usr/share/tomcat8/.jenkins/jobs/RDF-Processing-Toolkit/workspace/rdf-processing-toolkit-cli/target/apidocs/allclasses.html...
Generating /usr/share/tomcat8/.jenkins/jobs/RDF-Processing-Toolkit/workspace/rdf-processing-toolkit-cli/target/apidocs/index.html...
Generating /usr/share/tomcat8/.jenkins/jobs/RDF-Processing-Toolkit/workspace/rdf-processing-toolkit-cli/target/apidocs/overview-summary.html...
Generating /usr/share/tomcat8/.jenkins/jobs/RDF-Processing-Toolkit/workspace/rdf-processing-toolkit-cli/target/apidocs/help-doc.html...
100 warnings
[WARNING] Javadoc Warnings
[WARNING] javadoc: warning - The code being documented uses modules but the packages defined in http://docs.oracle.com/javase/7/docs/api/ are in the unnamed module.
[WARNING] javadoc: warning - The code being documented uses modules but the packages defined in http://docs.oracle.com/javase/7/docs/api/ are in the unnamed module.
[WARNING] javadoc: warning - The code being documented uses modules but the packages defined in http://docs.oracle.com/javase/7/docs/api/ are in the unnamed module.
[WARNING] javadoc: warning - The code being documented uses modules but the packages defined in http://docs.oracle.com/javase/7/docs/api/ are in the unnamed module.
[WARNING] javadoc: warning - The code being documented uses modules but the packages defined in http://docs.oracle.com/javase/7/docs/api/ are in the unnamed module.
[WARNING] javadoc: warning - The code being documented uses modules but the packages defined in http://docs.oracle.com/javase/7/docs/api/ are in the unnamed module.
[WARNING] javadoc: warning - The code being documented uses modules but the packages defined in http://docs.oracle.com/javase/7/docs/api/ are in the unnamed module.
[WARNING] javadoc: warning - The code being documented uses modules but the packages defined in http://docs.oracle.com/javase/7/docs/api/ are in the unnamed module.
[WARNING] javadoc: warning - The code being documented uses modules but the packages defined in http://docs.oracle.com/javase/7/docs/api/ are in the unnamed module.
[WARNING] javadoc: warning - The code being documented uses modules but the packages defined in http://docs.oracle.com/javase/7/docs/api/ are in the unnamed module.
[WARNING] javadoc: warning - The code being documented uses modules but the packages defined in http://docs.oracle.com/javase/7/docs/api/ are in the unnamed module.
[WARNING] javadoc: warning - The code being documented uses modules but the packages defined in http://docs.oracle.com/javase/7/docs/api/ are in the unnamed module.
[WARNING] javadoc: warning - The code being documented uses modules but the packages defined in http://docs.oracle.com/javase/7/docs/api/ are in the unnamed module.
[WARNING] javadoc: warning - The code being documented uses modules but the packages defined in http://docs.oracle.com/javase/7/docs/api/ are in the unnamed module.
[WARNING] javadoc: warning - The code being documented uses modules but the packages defined in http://docs.oracle.com/javase/7/docs/api/ are in the unnamed module.
[WARNING] javadoc: warning - The code being documented uses modules but the packages defined in http://docs.oracle.com/javase/7/docs/api/ are in the unnamed module.
[WARNING] javadoc: warning - The code being documented uses modules but the packages defined in http://docs.oracle.com/javase/7/docs/api/ are in the unnamed module.
[WARNING] javadoc: warning - The code being documented uses modules but the packages defined in http://docs.oracle.com/javase/7/docs/api/ are in the unnamed module.
[WARNING] javadoc: warning - The code being documented uses modules but the packages defined in http://docs.oracle.com/javase/7/docs/api/ are in the unnamed module.
[WARNING] javadoc: warning - The code being documented uses modules but the packages defined in http://docs.oracle.com/javase/7/docs/api/ are in the unnamed module.
[WARNING] javadoc: warning - The code being documented uses modules but the packages defined in http://docs.oracle.com/javase/7/docs/api/ are in the unnamed module.
[WARNING] javadoc: warning - The code being documented uses modules but the packages defined in http://docs.oracle.com/javase/7/docs/api/ are in the unnamed module.
[WARNING] javadoc: warning - The code being documented uses modules but the packages defined in http://docs.oracle.com/javase/7/docs/api/ are in the unnamed module.
[WARNING] javadoc: warning - The code being documented uses modules but the packages defined in http://docs.oracle.com/javase/7/docs/api/ are in the unnamed module.
[WARNING] javadoc: warning - The code being documented uses modules but the packages defined in http://docs.oracle.com/javase/7/docs/api/ are in the unnamed module.
[WARNING] javadoc: warning - The code being documented uses modules but the packages defined in http://docs.oracle.com/javase/7/docs/api/ are in the unnamed module.
[WARNING] javadoc: warning - The code being documented uses modules but the packages defined in http://docs.oracle.com/javase/7/docs/api/ are in the unnamed module.
[WARNING] javadoc: warning - The code being documented uses modules but the packages defined in http://docs.oracle.com/javase/7/docs/api/ are in the unnamed module.
[WARNING] javadoc: warning - The code being documented uses modules but the packages defined in http://docs.oracle.com/javase/7/docs/api/ are in the unnamed module.
[WARNING] javadoc: warning - The code being documented uses modules but the packages defined in http://docs.oracle.com/javase/7/docs/api/ are in the unnamed module.
[WARNING] javadoc: warning - The code being documented uses modules but the packages defined in http://docs.oracle.com/javase/7/docs/api/ are in the unnamed module.
[WARNING] javadoc: warning - The code being documented uses modules but the packages defined in http://docs.oracle.com/javase/7/docs/api/ are in the unnamed module.
[WARNING] javadoc: warning - The code being documented uses modules but the packages defined in http://docs.oracle.com/javase/7/docs/api/ are in the unnamed module.
[WARNING] javadoc: warning - The code being documented uses modules but the packages defined in http://docs.oracle.com/javase/7/docs/api/ are in the unnamed module.
[WARNING] javadoc: warning - The code being documented uses modules but the packages defined in http://docs.oracle.com/javase/7/docs/api/ are in the unnamed module.
[WARNING] javadoc: warning - The code being documented uses modules but the packages defined in http://docs.oracle.com/javase/7/docs/api/ are in the unnamed module.
[WARNING] javadoc: warning - The code being documented uses modules but the packages defined in http://docs.oracle.com/javase/7/docs/api/ are in the unnamed module.
[WARNING] javadoc: warning - The code being documented uses modules but the packages defined in http://docs.oracle.com/javase/7/docs/api/ are in the unnamed module.
[WARNING] javadoc: warning - The code being documented uses modules but the packages defined in http://docs.oracle.com/javase/7/docs/api/ are in the unnamed module.
[WARNING] javadoc: warning - The code being documented uses modules but the packages defined in http://docs.oracle.com/javase/7/docs/api/ are in the unnamed module.
[WARNING] javadoc: warning - The code being documented uses modules but the packages defined in http://docs.oracle.com/javase/7/docs/api/ are in the unnamed module.
[WARNING] javadoc: warning - The code being documented uses modules but the packages defined in http://docs.oracle.com/javase/7/docs/api/ are in the unnamed module.
[WARNING] javadoc: warning - The code being documented uses modules but the packages defined in http://docs.oracle.com/javase/7/docs/api/ are in the unnamed module.
[WARNING] javadoc: warning - The code being documented uses modules but the packages defined in http://docs.oracle.com/javase/7/docs/api/ are in the unnamed module.
[WARNING] javadoc: warning - The code being documented uses modules but the packages defined in http://docs.oracle.com/javase/7/docs/api/ are in the unnamed module.
[WARNING] javadoc: warning - The code being documented uses modules but the packages defined in http://docs.oracle.com/javase/7/docs/api/ are in the unnamed module.
[WARNING] javadoc: warning - The code being documented uses modules but the packages defined in http://docs.oracle.com/javase/7/docs/api/ are in the unnamed module.
[WARNING] javadoc: warning - The code being documented uses modules but the packages defined in http://docs.oracle.com/javase/7/docs/api/ are in the unnamed module.
[WARNING] javadoc: warning - The code being documented uses modules but the packages defined in http://docs.oracle.com/javase/7/docs/api/ are in the unnamed module.
[WARNING] javadoc: warning - The code being documented uses modules but the packages defined in http://docs.oracle.com/javase/7/docs/api/ are in the unnamed module.
[WARNING] javadoc: warning - The code being documented uses modules but the packages defined in http://docs.oracle.com/javase/7/docs/api/ are in the unnamed module.
[WARNING] javadoc: warning - The code being documented uses modules but the packages defined in http://docs.oracle.com/javase/7/docs/api/ are in the unnamed module.
[WARNING] javadoc: warning - The code being documented uses modules but the packages defined in http://docs.oracle.com/javase/7/docs/api/ are in the unnamed module.
[WARNING] javadoc: warning - The code being documented uses modules but the packages defined in http://docs.oracle.com/javase/7/docs/api/ are in the unnamed module.
[WARNING] javadoc: warning - The code being documented uses modules but the packages defined in http://docs.oracle.com/javase/7/docs/api/ are in the unnamed module.
[WARNING] javadoc: warning - The code being documented uses modules but the packages defined in http://docs.oracle.com/javase/7/docs/api/ are in the unnamed module.
[WARNING] javadoc: warning - The code being documented uses modules but the packages defined in http://docs.oracle.com/javase/7/docs/api/ are in the unnamed module.
[WARNING] javadoc: warning - The code being documented uses modules but the packages defined in http://docs.oracle.com/javase/7/docs/api/ are in the unnamed module.
[WARNING] javadoc: warning - The code being documented uses modules but the packages defined in http://docs.oracle.com/javase/7/docs/api/ are in the unnamed module.
[WARNING] javadoc: warning - The code being documented uses modules but the packages defined in http://docs.oracle.com/javase/7/docs/api/ are in the unnamed module.
[WARNING] javadoc: warning - The code being documented uses modules but the packages defined in http://docs.oracle.com/javase/7/docs/api/ are in the unnamed module.
[WARNING] javadoc: warning - The code being documented uses modules but the packages defined in http://docs.oracle.com/javase/7/docs/api/ are in the unnamed module.
[WARNING] javadoc: warning - The code being documented uses modules but the packages defined in http://docs.oracle.com/javase/7/docs/api/ are in the unnamed module.
[WARNING] javadoc: warning - The code being documented uses modules but the packages defined in http://docs.oracle.com/javase/7/docs/api/ are in the unnamed module.
[WARNING] javadoc: warning - The code being documented uses modules but the packages defined in http://docs.oracle.com/javase/7/docs/api/ are in the unnamed module.
[WARNING] javadoc: warning - The code being documented uses modules but the packages defined in http://docs.oracle.com/javase/7/docs/api/ are in the unnamed module.
[WARNING] javadoc: warning - The code being documented uses modules but the packages defined in http://docs.oracle.com/javase/7/docs/api/ are in the unnamed module.
[WARNING] javadoc: warning - The code being documented uses modules but the packages defined in http://docs.oracle.com/javase/7/docs/api/ are in the unnamed module.
[WARNING] javadoc: warning - The code being documented uses modules but the packages defined in http://docs.oracle.com/javase/7/docs/api/ are in the unnamed module.
[WARNING] javadoc: warning - The code being documented uses modules but the packages defined in http://docs.oracle.com/javase/7/docs/api/ are in the unnamed module.
[WARNING] javadoc: warning - The code being documented uses modules but the packages defined in http://docs.oracle.com/javase/7/docs/api/ are in the unnamed module.
[WARNING] javadoc: warning - The code being documented uses modules but the packages defined in http://docs.oracle.com/javase/7/docs/api/ are in the unnamed module.
[WARNING] javadoc: warning - The code being documented uses modules but the packages defined in http://docs.oracle.com/javase/7/docs/api/ are in the unnamed module.
[WARNING] javadoc: warning - The code being documented uses modules but the packages defined in http://docs.oracle.com/javase/7/docs/api/ are in the unnamed module.
[WARNING] javadoc: warning - The code being documented uses modules but the packages defined in http://docs.oracle.com/javase/7/docs/api/ are in the unnamed module.
[WARNING] javadoc: warning - The code being documented uses modules but the packages defined in http://docs.oracle.com/javase/7/docs/api/ are in the unnamed module.
[WARNING] javadoc: warning - The code being documented uses modules but the packages defined in http://docs.oracle.com/javase/7/docs/api/ are in the unnamed module.
[WARNING] javadoc: warning - The code being documented uses modules but the packages defined in http://docs.oracle.com/javase/7/docs/api/ are in the unnamed module.
[WARNING] javadoc: warning - The code being documented uses modules but the packages defined in http://docs.oracle.com/javase/7/docs/api/ are in the unnamed module.
[WARNING] javadoc: warning - The code being documented uses modules but the packages defined in http://docs.oracle.com/javase/7/docs/api/ are in the unnamed module.
[WARNING] javadoc: warning - The code being documented uses modules but the packages defined in http://docs.oracle.com/javase/7/docs/api/ are in the unnamed module.
[WARNING] javadoc: warning - The code being documented uses modules but the packages defined in http://docs.oracle.com/javase/7/docs/api/ are in the unnamed module.
[WARNING] javadoc: warning - The code being documented uses modules but the packages defined in http://docs.oracle.com/javase/7/docs/api/ are in the unnamed module.
[WARNING] javadoc: warning - The code being documented uses modules but the packages defined in http://docs.oracle.com/javase/7/docs/api/ are in the unnamed module.
[WARNING] javadoc: warning - The code being documented uses modules but the packages defined in http://docs.oracle.com/javase/7/docs/api/ are in the unnamed module.
[WARNING] javadoc: warning - The code being documented uses modules but the packages defined in http://docs.oracle.com/javase/7/docs/api/ are in the unnamed module.
[WARNING] javadoc: warning - The code being documented uses modules but the packages defined in http://docs.oracle.com/javase/7/docs/api/ are in the unnamed module.
[WARNING] javadoc: warning - The code being documented uses modules but the packages defined in http://docs.oracle.com/javase/7/docs/api/ are in the unnamed module.
[WARNING] javadoc: warning - The code being documented uses modules but the packages defined in http://docs.oracle.com/javase/7/docs/api/ are in the unnamed module.
[WARNING] javadoc: warning - The code being documented uses modules but the packages defined in http://docs.oracle.com/javase/7/docs/api/ are in the unnamed module.
[WARNING] javadoc: warning - The code being documented uses modules but the packages defined in http://docs.oracle.com/javase/7/docs/api/ are in the unnamed module.
[WARNING] javadoc: warning - The code being documented uses modules but the packages defined in http://docs.oracle.com/javase/7/docs/api/ are in the unnamed module.
[WARNING] javadoc: warning - The code being documented uses modules but the packages defined in http://docs.oracle.com/javase/7/docs/api/ are in the unnamed module.
[WARNING] javadoc: warning - The code being documented uses modules but the packages defined in http://docs.oracle.com/javase/7/docs/api/ are in the unnamed module.
[WARNING] javadoc: warning - The code being documented uses modules but the packages defined in http://docs.oracle.com/javase/7/docs/api/ are in the unnamed module.
[WARNING] javadoc: warning - The code being documented uses modules but the packages defined in http://docs.oracle.com/javase/7/docs/api/ are in the unnamed module.
[WARNING] javadoc: warning - The code being documented uses modules but the packages defined in http://docs.oracle.com/javase/7/docs/api/ are in the unnamed module.
[WARNING] javadoc: warning - The code being documented uses modules but the packages defined in http://docs.oracle.com/javase/7/docs/api/ are in the unnamed module.
[WARNING] javadoc: warning - The code being documented uses modules but the packages defined in http://docs.oracle.com/javase/7/docs/api/ are in the unnamed module.
[WARNING] javadoc: warning - The code being documented uses modules but the packages defined in http://docs.oracle.com/javase/7/docs/api/ are in the unnamed module.
[INFO] Building jar: /usr/share/tomcat8/.jenkins/jobs/RDF-Processing-Toolkit/workspace/rdf-processing-toolkit-cli/target/rdf-processing-toolkit-cli-1.9.1-SNAPSHOT-javadoc.jar
[INFO] 
[INFO] --- maven-source-plugin:3.0.1:jar-no-fork (attach-sources) @ rdf-processing-toolkit-cli ---
[INFO] Building jar: /usr/share/tomcat8/.jenkins/jobs/RDF-Processing-Toolkit/workspace/rdf-processing-toolkit-cli/target/rdf-processing-toolkit-cli-1.9.1-SNAPSHOT-sources.jar
[INFO] 
[INFO] --- maven-install-plugin:2.4:install (default-install) @ rdf-processing-toolkit-cli ---
[INFO] Installing /usr/share/tomcat8/.jenkins/jobs/RDF-Processing-Toolkit/workspace/rdf-processing-toolkit-cli/target/rdf-processing-toolkit-cli-1.9.1-SNAPSHOT.jar to /usr/share/tomcat8/.m2/repository/org/aksw/rdf-processing-toolkit/rdf-processing-toolkit-cli/1.9.1-SNAPSHOT/rdf-processing-toolkit-cli-1.9.1-SNAPSHOT.jar
[INFO] Installing /usr/share/tomcat8/.jenkins/jobs/RDF-Processing-Toolkit/workspace/rdf-processing-toolkit-cli/pom.xml to /usr/share/tomcat8/.m2/repository/org/aksw/rdf-processing-toolkit/rdf-processing-toolkit-cli/1.9.1-SNAPSHOT/rdf-processing-toolkit-cli-1.9.1-SNAPSHOT.pom
[INFO] Installing /usr/share/tomcat8/.jenkins/jobs/RDF-Processing-Toolkit/workspace/rdf-processing-toolkit-cli/target/rdf-processing-toolkit-cli-1.9.1-SNAPSHOT-javadoc.jar to /usr/share/tomcat8/.m2/repository/org/aksw/rdf-processing-toolkit/rdf-processing-toolkit-cli/1.9.1-SNAPSHOT/rdf-processing-toolkit-cli-1.9.1-SNAPSHOT-javadoc.jar
[INFO] Installing /usr/share/tomcat8/.jenkins/jobs/RDF-Processing-Toolkit/workspace/rdf-processing-toolkit-cli/target/rdf-processing-toolkit-cli-1.9.1-SNAPSHOT-sources.jar to /usr/share/tomcat8/.m2/repository/org/aksw/rdf-processing-toolkit/rdf-processing-toolkit-cli/1.9.1-SNAPSHOT/rdf-processing-toolkit-cli-1.9.1-SNAPSHOT-sources.jar