FailedConsole Output

Skipping 5 KB.. Full Log
-SNAPSHOT                        [2/10]
[INFO] --------------------------------[ jar ]---------------------------------
[INFO] 
[INFO] --- maven-clean-plugin:2.5:clean (default-clean) @ rdfunit-commons ---
[INFO] Deleting /usr/share/tomcat8/.jenkins/jobs/RDFUnit - build deb packages/workspace/rdfunit-commons/target
[INFO] 
[INFO] --------------------< org.aksw.rdfunit:rdfunit-io >---------------------
[INFO] Building RDFUnit - IO 0.8.22-SNAPSHOT                             [3/10]
[INFO] --------------------------------[ jar ]---------------------------------
[INFO] 
[INFO] --- maven-clean-plugin:2.5:clean (default-clean) @ rdfunit-io ---
[INFO] Deleting /usr/share/tomcat8/.jenkins/jobs/RDFUnit - build deb packages/workspace/rdfunit-io/target
[INFO] 
[INFO] ---------------< org.aksw.rdfunit:rdfunit-manual-tests >----------------
[INFO] Building RDFUnit - Manual Tests 0.8.22-SNAPSHOT                   [4/10]
[INFO] --------------------------------[ jar ]---------------------------------
[INFO] 
[INFO] --- maven-clean-plugin:2.5:clean (default-clean) @ rdfunit-manual-tests ---
[INFO] Deleting /usr/share/tomcat8/.jenkins/jobs/RDFUnit - build deb packages/workspace/rdfunit-manual-tests/target
[INFO] 
[INFO] -------------------< org.aksw.rdfunit:rdfunit-model >-------------------
[INFO] Building RDFUnit - Model 0.8.22-SNAPSHOT                          [5/10]
[INFO] --------------------------------[ jar ]---------------------------------
[INFO] 
[INFO] --- maven-clean-plugin:2.5:clean (default-clean) @ rdfunit-model ---
[INFO] Deleting /usr/share/tomcat8/.jenkins/jobs/RDFUnit - build deb packages/workspace/rdfunit-model/target
[INFO] 
[INFO] -------------------< org.aksw.rdfunit:rdfunit-core >--------------------
[INFO] Building RDFUnit - Core 0.8.22-SNAPSHOT                           [6/10]
[INFO] --------------------------------[ jar ]---------------------------------
[INFO] 
[INFO] --- maven-clean-plugin:2.5:clean (default-clean) @ rdfunit-core ---
[INFO] Deleting /usr/share/tomcat8/.jenkins/jobs/RDFUnit - build deb packages/workspace/rdfunit-core/target
[INFO] 
[INFO] -----------------< org.aksw.rdfunit:rdfunit-validate >------------------
[INFO] Building RDFUnit - Validate 0.8.22-SNAPSHOT                       [7/10]
[INFO] --------------------------------[ jar ]---------------------------------
Downloading from central: https://repo1.maven.org/maven2/org/apache/maven/plugins/maven-clean-plugin/3.1.0/maven-clean-plugin-3.1.0.pom
Progress (1): 1.4/5.2 kB
Progress (1): 2.7/5.2 kB
Progress (1): 4.1/5.2 kB
Progress (1): 5.2 kB    
                    
Downloaded from central: https://repo1.maven.org/maven2/org/apache/maven/plugins/maven-clean-plugin/3.1.0/maven-clean-plugin-3.1.0.pom (5.2 kB at 46 kB/s)
Downloading from central: https://repo1.maven.org/maven2/org/apache/maven/plugins/maven-clean-plugin/3.1.0/maven-clean-plugin-3.1.0.jar
Progress (1): 1.4/30 kB
Progress (1): 2.7/30 kB
Progress (1): 4.1/30 kB
Progress (1): 5.5/30 kB
Progress (1): 6.9/30 kB
Progress (1): 8.2/30 kB
Progress (1): 9.6/30 kB
Progress (1): 11/30 kB 
Progress (1): 12/30 kB
Progress (1): 14/30 kB
Progress (1): 15/30 kB
Progress (1): 16/30 kB
Progress (1): 18/30 kB
Progress (1): 19/30 kB
Progress (1): 21/30 kB
Progress (1): 22/30 kB
Progress (1): 23/30 kB
Progress (1): 25/30 kB
Progress (1): 26/30 kB
Progress (1): 27/30 kB
Progress (1): 29/30 kB
Progress (1): 30/30 kB
Progress (1): 30 kB   
                   
Downloaded from central: https://repo1.maven.org/maven2/org/apache/maven/plugins/maven-clean-plugin/3.1.0/maven-clean-plugin-3.1.0.jar (30 kB at 677 kB/s)
[INFO] 
[INFO] --- maven-clean-plugin:3.1.0:clean (default-clean) @ rdfunit-validate ---
[INFO] 
[INFO] -------------------< org.aksw.rdfunit:rdfunit-junit >-------------------
[INFO] Building RDFUnit - JUnit Integration 0.8.22-SNAPSHOT              [8/10]
[INFO] --------------------------------[ jar ]---------------------------------
[INFO] 
[INFO] --- maven-clean-plugin:2.5:clean (default-clean) @ rdfunit-junit ---
[INFO] 
[INFO] -----------------< org.aksw.rdfunit:rdfunit-examples >------------------
[INFO] Building RDFUnit - Examples 0.8.22-SNAPSHOT                       [9/10]
[INFO] --------------------------------[ jar ]---------------------------------
[INFO] 
[INFO] --- maven-clean-plugin:2.5:clean (default-clean) @ rdfunit-examples ---
[INFO] 
[INFO] ------------------< org.aksw.rdfunit:rdfunit-w3c-dqv >------------------
[INFO] Building RDFUnit - W3c DQV 0.8.22-SNAPSHOT                       [10/10]
[INFO] --------------------------------[ jar ]---------------------------------
[INFO] 
[INFO] --- maven-clean-plugin:2.5:clean (default-clean) @ rdfunit-w3c-dqv ---
[INFO] ------------------------------------------------------------------------
[INFO] Reactor Summary:
[INFO] 
[INFO] RDFUnit - Parent 0.8.22-SNAPSHOT ................... SUCCESS [  5.625 s]
[INFO] RDFUnit - Commons .................................. SUCCESS [  0.090 s]
[INFO] RDFUnit - IO ....................................... SUCCESS [  0.023 s]
[INFO] RDFUnit - Manual Tests ............................. SUCCESS [  0.034 s]
[INFO] RDFUnit - Model .................................... SUCCESS [  0.400 s]
[INFO] RDFUnit - Core ..................................... SUCCESS [  0.056 s]
[INFO] RDFUnit - Validate ................................. SUCCESS [  2.269 s]
[INFO] RDFUnit - JUnit Integration ........................ SUCCESS [  0.003 s]
[INFO] RDFUnit - Examples ................................. SUCCESS [  0.003 s]
[INFO] RDFUnit - W3c DQV 0.8.22-SNAPSHOT .................. SUCCESS [  0.003 s]
[INFO] ------------------------------------------------------------------------
[INFO] BUILD SUCCESS
[INFO] ------------------------------------------------------------------------
[INFO] Total time: 16.919 s
[INFO] Finished at: 2021-04-19T16:53:21+02:00
[INFO] ------------------------------------------------------------------------
+ mvn -pl rdfunit-validate -am install -Pdebpackage
[INFO] Scanning for projects...
[WARNING] 
[WARNING] Some problems were encountered while building the effective model for org.aksw.rdfunit:rdfunit-validate:jar:0.8.22-SNAPSHOT
[WARNING] 'build.plugins.plugin.version' for org.apache.maven.plugins:maven-shade-plugin is missing. @ org.aksw.rdfunit:rdfunit-validate:[unknown-version], /usr/share/tomcat8/.jenkins/jobs/RDFUnit - build deb packages/workspace/rdfunit-validate/pom.xml, line 173, column 19
[WARNING] 
[WARNING] It is highly recommended to fix these problems because they threaten the stability of your build.
[WARNING] 
[WARNING] For this reason, future Maven versions might no longer support building such malformed projects.
[WARNING] 
[INFO] Inspecting build with total of 7 modules...
[INFO] Installing Nexus Staging features:
[INFO]   ... total of 7 executions of maven-deploy-plugin replaced with nexus-staging-maven-plugin
[INFO] ------------------------------------------------------------------------
[INFO] Reactor Build Order:
[INFO] 
[INFO] RDFUnit - Parent                                                   [pom]
[INFO] RDFUnit - Commons                                                  [jar]
[INFO] RDFUnit - IO                                                       [jar]
[INFO] RDFUnit - Manual Tests                                             [jar]
[INFO] RDFUnit - Model                                                    [jar]
[INFO] RDFUnit - Core                                                     [jar]
[INFO] RDFUnit - Validate                                                 [jar]
[INFO] 
[INFO] ------------------< org.aksw.rdfunit:rdfunit-parent >-------------------
[INFO] Building RDFUnit - Parent 0.8.22-SNAPSHOT                          [1/7]
[INFO] --------------------------------[ pom ]---------------------------------
[INFO] 
[INFO] --- maven-enforcer-plugin:1.4.1:enforce (enforce-java) @ rdfunit-parent ---
[INFO] 
[INFO] --- maven-enforcer-plugin:1.4.1:enforce (enforce-maven) @ rdfunit-parent ---
[INFO] 
[INFO] --- jacoco-maven-plugin:0.8.5:prepare-agent (prepare-agent) @ rdfunit-parent ---
Downloading from central: https://repo1.maven.org/maven2/org/jacoco/org.jacoco.agent/0.8.5/org.jacoco.agent-0.8.5.pom
Progress (1): 1.4/3.5 kB
Progress (1): 2.7/3.5 kB
Progress (1): 3.5 kB    
                    
Downloaded from central: https://repo1.maven.org/maven2/org/jacoco/org.jacoco.agent/0.8.5/org.jacoco.agent-0.8.5.pom (3.5 kB at 13 kB/s)
Downloading from central: https://repo1.maven.org/maven2/org/jacoco/org.jacoco.core/0.8.5/org.jacoco.core-0.8.5.pom
Progress (1): 1.4/2.1 kB
Progress (1): 2.1 kB    
                    
Downloaded from central: https://repo1.maven.org/maven2/org/jacoco/org.jacoco.core/0.8.5/org.jacoco.core-0.8.5.pom (2.1 kB at 58 kB/s)
Downloading from central: https://repo1.maven.org/maven2/org/ow2/asm/asm-commons/7.2/asm-commons-7.2.pom
Progress (1): 1.4/3.7 kB
Progress (1): 2.7/3.7 kB
Progress (1): 3.7 kB    
                    
Downloaded from central: https://repo1.maven.org/maven2/org/ow2/asm/asm-commons/7.2/asm-commons-7.2.pom (3.7 kB at 97 kB/s)
Downloading from central: https://repo1.maven.org/maven2/org/ow2/asm/asm-tree/7.2/asm-tree-7.2.pom
Progress (1): 1.4/3.1 kB
Progress (1): 2.7/3.1 kB
Progress (1): 3.1 kB    
                    
Downloaded from central: https://repo1.maven.org/maven2/org/ow2/asm/asm-tree/7.2/asm-tree-7.2.pom (3.1 kB at 16 kB/s)
Downloading from central: https://repo1.maven.org/maven2/org/ow2/asm/asm-analysis/7.2/asm-analysis-7.2.pom
Progress (1): 1.4/3.2 kB
Progress (1): 2.7/3.2 kB
Progress (1): 3.2 kB    
                    
Downloaded from central: https://repo1.maven.org/maven2/org/ow2/asm/asm-analysis/7.2/asm-analysis-7.2.pom (3.2 kB at 85 kB/s)
Downloading from central: https://repo1.maven.org/maven2/org/jacoco/org.jacoco.report/0.8.5/org.jacoco.report-0.8.5.pom
Progress (1): 1.4/1.9 kB
Progress (1): 1.9 kB    
                    
Downloaded from central: https://repo1.maven.org/maven2/org/jacoco/org.jacoco.report/0.8.5/org.jacoco.report-0.8.5.pom (1.9 kB at 45 kB/s)
Downloading from central: https://repo1.maven.org/maven2/org/jacoco/org.jacoco.agent/0.8.5/org.jacoco.agent-0.8.5-runtime.jar
Downloading from central: https://repo1.maven.org/maven2/org/ow2/asm/asm-commons/7.2/asm-commons-7.2.jar
Downloading from central: https://repo1.maven.org/maven2/org/jacoco/org.jacoco.core/0.8.5/org.jacoco.core-0.8.5.jar
Downloading from central: https://repo1.maven.org/maven2/org/ow2/asm/asm-tree/7.2/asm-tree-7.2.jar
Downloading from central: https://repo1.maven.org/maven2/org/ow2/asm/asm-analysis/7.2/asm-analysis-7.2.jar
Progress (1): 1.4/282 kB
Progress (1): 2.7/282 kB
Progress (1): 4.1/282 kB
Progress (1): 5.5/282 kB
Progress (1): 6.9/282 kB
Progress (1): 8.2/282 kB
Progress (1): 9.6/282 kB
Progress (1): 11/282 kB 
Progress (1): 12/282 kB
Progress (1): 14/282 kB
Progress (1): 15/282 kB
Progress (1): 16/282 kB
Progress (1): 18/282 kB
Progress (1): 19/282 kB
Progress (1): 21/282 kB
Progress (1): 22/282 kB
Progress (1): 23/282 kB
Progress (1): 25/282 kB
Progress (1): 26/282 kB
Progress (1): 27/282 kB
Progress (1): 29/282 kB
Progress (1): 30/282 kB
Progress (1): 32/282 kB
Progress (1): 33/282 kB
Progress (1): 34/282 kB
Progress (1): 36/282 kB
Progress (1): 36/282 kB
Progress (1): 37/282 kB
Progress (1): 39/282 kB
Progress (1): 40/282 kB
Progress (1): 41/282 kB
Progress (1): 43/282 kB
Progress (1): 44/282 kB
Progress (1): 46/282 kB
Progress (1): 47/282 kB
Progress (1): 48/282 kB
Progress (1): 50/282 kB
Progress (1): 51/282 kB
Progress (1): 52/282 kB
Progress (1): 54/282 kB
Progress (1): 55/282 kB
Progress (1): 57/282 kB
Progress (1): 58/282 kB
Progress (1): 59/282 kB
Progress (1): 61/282 kB
Progress (1): 62/282 kB
Progress (1): 63/282 kB
Progress (1): 65/282 kB
Progress (1): 66/282 kB
Progress (1): 68/282 kB
Progress (1): 69/282 kB
Progress (1): 70/282 kB
Progress (1): 72/282 kB
Progress (1): 73/282 kB
Progress (2): 73/282 kB | 1.4/50 kB
Progress (2): 73/282 kB | 2.7/50 kB
Progress (2): 73/282 kB | 4.1/50 kB
Progress (3): 73/282 kB | 4.1/50 kB | 1.4/70 kB
Progress (3): 73/282 kB | 4.1/50 kB | 2.7/70 kB
Progress (4): 73/282 kB | 4.1/50 kB | 2.7/70 kB | 1.4/33 kB
Progress (4): 74/282 kB | 4.1/50 kB | 2.7/70 kB | 1.4/33 kB
Progress (4): 74/282 kB | 4.1/50 kB | 4.1/70 kB | 1.4/33 kB
Progress (5): 74/282 kB | 4.1/50 kB | 4.1/70 kB | 1.4/33 kB | 1.4/195 kB
Progress (5): 74/282 kB | 5.5/50 kB | 4.1/70 kB | 1.4/33 kB | 1.4/195 kB
Progress (5): 74/282 kB | 5.5/50 kB | 4.1/70 kB | 1.4/33 kB | 2.7/195 kB
Progress (5): 74/282 kB | 5.5/50 kB | 5.5/70 kB | 1.4/33 kB | 2.7/195 kB
Progress (5): 76/282 kB | 5.5/50 kB | 5.5/70 kB | 1.4/33 kB | 2.7/195 kB
Progress (5): 76/282 kB | 5.5/50 kB | 5.5/70 kB | 2.7/33 kB | 2.7/195 kB
Progress (5): 77/282 kB | 5.5/50 kB | 5.5/70 kB | 2.7/33 kB | 2.7/195 kB
Progress (5): 77/282 kB | 5.5/50 kB | 6.9/70 kB | 2.7/33 kB | 2.7/195 kB
Progress (5): 77/282 kB | 5.5/50 kB | 6.9/70 kB | 2.7/33 kB | 4.1/195 kB
Progress (5): 77/282 kB | 6.9/50 kB | 6.9/70 kB | 2.7/33 kB | 4.1/195 kB
Progress (5): 77/282 kB | 6.9/50 kB | 6.9/70 kB | 2.7/33 kB | 5.5/195 kB
Progress (5): 77/282 kB | 6.9/50 kB | 8.2/70 kB | 2.7/33 kB | 5.5/195 kB
Progress (5): 79/282 kB | 6.9/50 kB | 8.2/70 kB | 2.7/33 kB | 5.5/195 kB
Progress (5): 79/282 kB | 6.9/50 kB | 8.2/70 kB | 4.1/33 kB | 5.5/195 kB
Progress (5): 80/282 kB | 6.9/50 kB | 8.2/70 kB | 4.1/33 kB | 5.5/195 kB
Progress (5): 80/282 kB | 6.9/50 kB | 9.6/70 kB | 4.1/33 kB | 5.5/195 kB
Progress (5): 80/282 kB | 6.9/50 kB | 9.6/70 kB | 4.1/33 kB | 6.9/195 kB
Progress (5): 80/282 kB | 8.2/50 kB | 9.6/70 kB | 4.1/33 kB | 6.9/195 kB
Progress (5): 80/282 kB | 8.2/50 kB | 9.6/70 kB | 4.1/33 kB | 8.2/195 kB
Progress (5): 80/282 kB | 8.2/50 kB | 11/70 kB | 4.1/33 kB | 8.2/195 kB 
Progress (5): 81/282 kB | 8.2/50 kB | 11/70 kB | 4.1/33 kB | 8.2/195 kB
Progress (5): 81/282 kB | 8.2/50 kB | 11/70 kB | 5.5/33 kB | 8.2/195 kB
Progress (5): 83/282 kB | 8.2/50 kB | 11/70 kB | 5.5/33 kB | 8.2/195 kB
Progress (5): 83/282 kB | 8.2/50 kB | 12/70 kB | 5.5/33 kB | 8.2/195 kB
Progress (5): 83/282 kB | 8.2/50 kB | 12/70 kB | 5.5/33 kB | 9.6/195 kB
Progress (5): 83/282 kB | 9.6/50 kB | 12/70 kB | 5.5/33 kB | 9.6/195 kB
Progress (5): 83/282 kB | 9.6/50 kB | 12/70 kB | 5.5/33 kB | 11/195 kB 
Progress (5): 83/282 kB | 9.6/50 kB | 14/70 kB | 5.5/33 kB | 11/195 kB
Progress (5): 84/282 kB | 9.6/50 kB | 14/70 kB | 5.5/33 kB | 11/195 kB
Progress (5): 84/282 kB | 9.6/50 kB | 14/70 kB | 6.9/33 kB | 11/195 kB
Progress (5): 85/282 kB | 9.6/50 kB | 14/70 kB | 6.9/33 kB | 11/195 kB
Progress (5): 85/282 kB | 9.6/50 kB | 15/70 kB | 6.9/33 kB | 11/195 kB
Progress (5): 85/282 kB | 9.6/50 kB | 15/70 kB | 6.9/33 kB | 12/195 kB
Progress (5): 85/282 kB | 11/50 kB | 15/70 kB | 6.9/33 kB | 12/195 kB 
Progress (5): 85/282 kB | 11/50 kB | 15/70 kB | 6.9/33 kB | 14/195 kB
Progress (5): 85/282 kB | 11/50 kB | 16/70 kB | 6.9/33 kB | 14/195 kB
Progress (5): 87/282 kB | 11/50 kB | 16/70 kB | 6.9/33 kB | 14/195 kB
Progress (5): 87/282 kB | 11/50 kB | 16/70 kB | 8.2/33 kB | 14/195 kB
Progress (5): 88/282 kB | 11/50 kB | 16/70 kB | 8.2/33 kB | 14/195 kB
Progress (5): 88/282 kB | 11/50 kB | 18/70 kB | 8.2/33 kB | 14/195 kB
Progress (5): 88/282 kB | 11/50 kB | 18/70 kB | 8.2/33 kB | 15/195 kB
Progress (5): 88/282 kB | 12/50 kB | 18/70 kB | 8.2/33 kB | 15/195 kB
Progress (5): 88/282 kB | 12/50 kB | 18/70 kB | 8.2/33 kB | 16/195 kB
Progress (5): 88/282 kB | 12/50 kB | 19/70 kB | 8.2/33 kB | 16/195 kB
Progress (5): 89/282 kB | 12/50 kB | 19/70 kB | 8.2/33 kB | 16/195 kB
Progress (5): 89/282 kB | 12/50 kB | 19/70 kB | 9.6/33 kB | 16/195 kB
Progress (5): 91/282 kB | 12/50 kB | 19/70 kB | 9.6/33 kB | 16/195 kB
Progress (5): 91/282 kB | 12/50 kB | 21/70 kB | 9.6/33 kB | 16/195 kB
Progress (5): 91/282 kB | 12/50 kB | 21/70 kB | 9.6/33 kB | 18/195 kB
Progress (5): 91/282 kB | 14/50 kB | 21/70 kB | 9.6/33 kB | 18/195 kB
Progress (5): 91/282 kB | 14/50 kB | 21/70 kB | 9.6/33 kB | 19/195 kB
Progress (5): 91/282 kB | 14/50 kB | 22/70 kB | 9.6/33 kB | 19/195 kB
Progress (5): 92/282 kB | 14/50 kB | 22/70 kB | 9.6/33 kB | 19/195 kB
Progress (5): 92/282 kB | 14/50 kB | 22/70 kB | 11/33 kB | 19/195 kB 
Progress (5): 94/282 kB | 14/50 kB | 22/70 kB | 11/33 kB | 19/195 kB
Progress (5): 94/282 kB | 14/50 kB | 23/70 kB | 11/33 kB | 19/195 kB
Progress (5): 94/282 kB | 14/50 kB | 23/70 kB | 11/33 kB | 21/195 kB
Progress (5): 94/282 kB | 15/50 kB | 23/70 kB | 11/33 kB | 21/195 kB
Progress (5): 94/282 kB | 15/50 kB | 23/70 kB | 11/33 kB | 22/195 kB
Progress (5): 94/282 kB | 15/50 kB | 25/70 kB | 11/33 kB | 22/195 kB
Progress (5): 95/282 kB | 15/50 kB | 25/70 kB | 11/33 kB | 22/195 kB
Progress (5): 95/282 kB | 15/50 kB | 25/70 kB | 12/33 kB | 22/195 kB
Progress (5): 96/282 kB | 15/50 kB | 25/70 kB | 12/33 kB | 22/195 kB
Progress (5): 96/282 kB | 15/50 kB | 26/70 kB | 12/33 kB | 22/195 kB
Progress (5): 96/282 kB | 15/50 kB | 26/70 kB | 12/33 kB | 23/195 kB
Progress (5): 96/282 kB | 16/50 kB | 26/70 kB | 12/33 kB | 23/195 kB
Progress (5): 96/282 kB | 16/50 kB | 26/70 kB | 12/33 kB | 25/195 kB
Progress (5): 96/282 kB | 16/50 kB | 27/70 kB | 12/33 kB | 25/195 kB
Progress (5): 98/282 kB | 16/50 kB | 27/70 kB | 12/33 kB | 25/195 kB
Progress (5): 98/282 kB | 16/50 kB | 27/70 kB | 14/33 kB | 25/195 kB
Progress (5): 99/282 kB | 16/50 kB | 27/70 kB | 14/33 kB | 25/195 kB
Progress (5): 99/282 kB | 16/50 kB | 29/70 kB | 14/33 kB | 25/195 kB
Progress (5): 99/282 kB | 16/50 kB | 29/70 kB | 14/33 kB | 26/195 kB
Progress (5): 99/282 kB | 18/50 kB | 29/70 kB | 14/33 kB | 26/195 kB
Progress (5): 99/282 kB | 18/50 kB | 29/70 kB | 14/33 kB | 27/195 kB
Progress (5): 99/282 kB | 18/50 kB | 30/70 kB | 14/33 kB | 27/195 kB
Progress (5): 100/282 kB | 18/50 kB | 30/70 kB | 14/33 kB | 27/195 kB
Progress (5): 100/282 kB | 18/50 kB | 30/70 kB | 15/33 kB | 27/195 kB
Progress (5): 102/282 kB | 18/50 kB | 30/70 kB | 15/33 kB | 27/195 kB
Progress (5): 102/282 kB | 18/50 kB | 32/70 kB | 15/33 kB | 27/195 kB
Progress (5): 102/282 kB | 18/50 kB | 32/70 kB | 15/33 kB | 29/195 kB
Progress (5): 102/282 kB | 19/50 kB | 32/70 kB | 15/33 kB | 29/195 kB
Progress (5): 102/282 kB | 19/50 kB | 32/70 kB | 15/33 kB | 30/195 kB
Progress (5): 102/282 kB | 19/50 kB | 33/70 kB | 15/33 kB | 30/195 kB
Progress (5): 103/282 kB | 19/50 kB | 33/70 kB | 15/33 kB | 30/195 kB
Progress (5): 103/282 kB | 19/50 kB | 33/70 kB | 16/33 kB | 30/195 kB
Progress (5): 105/282 kB | 19/50 kB | 33/70 kB | 16/33 kB | 30/195 kB
Progress (5): 105/282 kB | 19/50 kB | 34/70 kB | 16/33 kB | 30/195 kB
Progress (5): 105/282 kB | 19/50 kB | 34/70 kB | 16/33 kB | 32/195 kB
Progress (5): 105/282 kB | 21/50 kB | 34/70 kB | 16/33 kB | 32/195 kB
Progress (5): 105/282 kB | 21/50 kB | 34/70 kB | 16/33 kB | 33/195 kB
Progress (5): 105/282 kB | 21/50 kB | 36/70 kB | 16/33 kB | 33/195 kB
Progress (5): 106/282 kB | 21/50 kB | 36/70 kB | 16/33 kB | 33/195 kB
Progress (5): 106/282 kB | 21/50 kB | 36/70 kB | 18/33 kB | 33/195 kB
Progress (5): 107/282 kB | 21/50 kB | 36/70 kB | 18/33 kB | 33/195 kB
Progress (5): 107/282 kB | 21/50 kB | 37/70 kB | 18/33 kB | 33/195 kB
Progress (5): 107/282 kB | 21/50 kB | 37/70 kB | 18/33 kB | 34/195 kB
Progress (5): 107/282 kB | 22/50 kB | 37/70 kB | 18/33 kB | 34/195 kB
Progress (5): 107/282 kB | 22/50 kB | 37/70 kB | 18/33 kB | 36/195 kB
Progress (5): 107/282 kB | 22/50 kB | 38/70 kB | 18/33 kB | 36/195 kB
Progress (5): 109/282 kB | 22/50 kB | 38/70 kB | 18/33 kB | 36/195 kB
Progress (5): 109/282 kB | 22/50 kB | 38/70 kB | 19/33 kB | 36/195 kB
Progress (5): 110/282 kB | 22/50 kB | 38/70 kB | 19/33 kB | 36/195 kB
Progress (5): 110/282 kB | 22/50 kB | 40/70 kB | 19/33 kB | 36/195 kB
Progress (5): 110/282 kB | 22/50 kB | 40/70 kB | 19/33 kB | 37/195 kB
Progress (5): 110/282 kB | 23/50 kB | 40/70 kB | 19/33 kB | 37/195 kB
Progress (5): 110/282 kB | 23/50 kB | 40/70 kB | 19/33 kB | 38/195 kB
Progress (5): 110/282 kB | 23/50 kB | 41/70 kB | 19/33 kB | 38/195 kB
Progress (5): 111/282 kB | 23/50 kB | 41/70 kB | 19/33 kB | 38/195 kB
Progress (5): 111/282 kB | 23/50 kB | 41/70 kB | 21/33 kB | 38/195 kB
Progress (5): 113/282 kB | 23/50 kB | 41/70 kB | 21/33 kB | 38/195 kB
Progress (5): 113/282 kB | 23/50 kB | 43/70 kB | 21/33 kB | 38/195 kB
Progress (5): 113/282 kB | 23/50 kB | 43/70 kB | 21/33 kB | 40/195 kB
Progress (5): 113/282 kB | 25/50 kB | 43/70 kB | 21/33 kB | 40/195 kB
Progress (5): 113/282 kB | 25/50 kB | 43/70 kB | 21/33 kB | 41/195 kB
Progress (5): 113/282 kB | 25/50 kB | 44/70 kB | 21/33 kB | 41/195 kB
Progress (5): 114/282 kB | 25/50 kB | 44/70 kB | 21/33 kB | 41/195 kB
Progress (5): 114/282 kB | 25/50 kB | 44/70 kB | 22/33 kB | 41/195 kB
Progress (5): 116/282 kB | 25/50 kB | 44/70 kB | 22/33 kB | 41/195 kB
Progress (5): 116/282 kB | 25/50 kB | 45/70 kB | 22/33 kB | 41/195 kB
Progress (5): 116/282 kB | 25/50 kB | 45/70 kB | 22/33 kB | 43/195 kB
Progress (5): 116/282 kB | 26/50 kB | 45/70 kB | 22/33 kB | 43/195 kB
Progress (5): 116/282 kB | 26/50 kB | 45/70 kB | 22/33 kB | 44/195 kB
Progress (5): 116/282 kB | 26/50 kB | 47/70 kB | 22/33 kB | 44/195 kB
Progress (5): 117/282 kB | 26/50 kB | 47/70 kB | 22/33 kB | 44/195 kB
Progress (5): 117/282 kB | 26/50 kB | 47/70 kB | 23/33 kB | 44/195 kB
Progress (5): 118/282 kB | 26/50 kB | 47/70 kB | 23/33 kB | 44/195 kB
Progress (5): 118/282 kB | 26/50 kB | 48/70 kB | 23/33 kB | 44/195 kB
Progress (5): 118/282 kB | 26/50 kB | 48/70 kB | 23/33 kB | 45/195 kB
Progress (5): 118/282 kB | 27/50 kB | 48/70 kB | 23/33 kB | 45/195 kB
Progress (5): 118/282 kB | 27/50 kB | 48/70 kB | 23/33 kB | 47/195 kB
Progress (5): 118/282 kB | 27/50 kB | 49/70 kB | 23/33 kB | 47/195 kB
Progress (5): 120/282 kB | 27/50 kB | 49/70 kB | 23/33 kB | 47/195 kB
Progress (5): 120/282 kB | 27/50 kB | 49/70 kB | 25/33 kB | 47/195 kB
Progress (5): 121/282 kB | 27/50 kB | 49/70 kB | 25/33 kB | 47/195 kB
Progress (5): 121/282 kB | 27/50 kB | 51/70 kB | 25/33 kB | 47/195 kB
Progress (5): 121/282 kB | 27/50 kB | 51/70 kB | 25/33 kB | 48/195 kB
Progress (5): 121/282 kB | 29/50 kB | 51/70 kB | 25/33 kB | 48/195 kB
Progress (5): 121/282 kB | 29/50 kB | 51/70 kB | 25/33 kB | 49/195 kB
Progress (5): 121/282 kB | 30/50 kB | 51/70 kB | 25/33 kB | 49/195 kB
Progress (5): 121/282 kB | 30/50 kB | 52/70 kB | 25/33 kB | 49/195 kB
Progress (5): 122/282 kB | 30/50 kB | 52/70 kB | 25/33 kB | 49/195 kB
Progress (5): 122/282 kB | 30/50 kB | 52/70 kB | 26/33 kB | 49/195 kB
Progress (5): 124/282 kB | 30/50 kB | 52/70 kB | 26/33 kB | 49/195 kB
Progress (5): 124/282 kB | 30/50 kB | 53/70 kB | 26/33 kB | 49/195 kB
Progress (5): 124/282 kB | 32/50 kB | 53/70 kB | 26/33 kB | 49/195 kB
Progress (5): 124/282 kB | 32/50 kB | 53/70 kB | 26/33 kB | 51/195 kB
Progress (5): 124/282 kB | 33/50 kB | 53/70 kB | 26/33 kB | 51/195 kB
Progress (5): 124/282 kB | 33/50 kB | 55/70 kB | 26/33 kB | 51/195 kB
Progress (5): 125/282 kB | 33/50 kB | 55/70 kB | 26/33 kB | 51/195 kB
Progress (5): 125/282 kB | 33/50 kB | 55/70 kB | 27/33 kB | 51/195 kB
Progress (5): 126/282 kB | 33/50 kB | 55/70 kB | 27/33 kB | 51/195 kB
Progress (5): 126/282 kB | 33/50 kB | 56/70 kB | 27/33 kB | 51/195 kB
Progress (5): 126/282 kB | 34/50 kB | 56/70 kB | 27/33 kB | 51/195 kB
Progress (5): 126/282 kB | 34/50 kB | 56/70 kB | 27/33 kB | 52/195 kB
Progress (5): 126/282 kB | 36/50 kB | 56/70 kB | 27/33 kB | 52/195 kB
Progress (5): 126/282 kB | 36/50 kB | 58/70 kB | 27/33 kB | 52/195 kB
Progress (5): 128/282 kB | 36/50 kB | 58/70 kB | 27/33 kB | 52/195 kB
Progress (5): 128/282 kB | 36/50 kB | 58/70 kB | 29/33 kB | 52/195 kB
Progress (5): 129/282 kB | 36/50 kB | 58/70 kB | 29/33 kB | 52/195 kB
Progress (5): 129/282 kB | 36/50 kB | 59/70 kB | 29/33 kB | 52/195 kB
Progress (5): 129/282 kB | 37/50 kB | 59/70 kB | 29/33 kB | 52/195 kB
Progress (5): 129/282 kB | 37/50 kB | 59/70 kB | 29/33 kB | 53/195 kB
Progress (5): 129/282 kB | 38/50 kB | 59/70 kB | 29/33 kB | 53/195 kB
Progress (5): 129/282 kB | 38/50 kB | 60/70 kB | 29/33 kB | 53/195 kB
Progress (5): 131/282 kB | 38/50 kB | 60/70 kB | 29/33 kB | 53/195 kB
Progress (5): 131/282 kB | 38/50 kB | 60/70 kB | 30/33 kB | 53/195 kB
Progress (5): 132/282 kB | 38/50 kB | 60/70 kB | 30/33 kB | 53/195 kB
Progress (5): 132/282 kB | 38/50 kB | 62/70 kB | 30/33 kB | 53/195 kB
Progress (5): 132/282 kB | 40/50 kB | 62/70 kB | 30/33 kB | 53/195 kB
Progress (5): 132/282 kB | 40/50 kB | 62/70 kB | 30/33 kB | 55/195 kB
Progress (5): 132/282 kB | 41/50 kB | 62/70 kB | 30/33 kB | 55/195 kB
Progress (5): 132/282 kB | 41/50 kB | 63/70 kB | 30/33 kB | 55/195 kB
Progress (5): 133/282 kB | 41/50 kB | 63/70 kB | 30/33 kB | 55/195 kB
Progress (5): 133/282 kB | 41/50 kB | 63/70 kB | 32/33 kB | 55/195 kB
Progress (5): 135/282 kB | 41/50 kB | 63/70 kB | 32/33 kB | 55/195 kB
Progress (5): 135/282 kB | 41/50 kB | 64/70 kB | 32/33 kB | 55/195 kB
Progress (5): 135/282 kB | 43/50 kB | 64/70 kB | 32/33 kB | 55/195 kB
Progress (5): 135/282 kB | 43/50 kB | 64/70 kB | 32/33 kB | 56/195 kB
Progress (5): 135/282 kB | 44/50 kB | 64/70 kB | 32/33 kB | 56/195 kB
Progress (5): 135/282 kB | 44/50 kB | 66/70 kB | 32/33 kB | 56/195 kB
Progress (5): 136/282 kB | 44/50 kB | 66/70 kB | 32/33 kB | 56/195 kB
Progress (5): 136/282 kB | 44/50 kB | 66/70 kB | 33/33 kB | 56/195 kB
Progress (5): 137/282 kB | 44/50 kB | 66/70 kB | 33/33 kB | 56/195 kB
Progress (5): 137/282 kB | 44/50 kB | 66/70 kB | 33 kB | 56/195 kB   
Progress (5): 137/282 kB | 44/50 kB | 67/70 kB | 33 kB | 56/195 kB
Progress (5): 137/282 kB | 45/50 kB | 67/70 kB | 33 kB | 56/195 kB
Progress (5): 137/282 kB | 45/50 kB | 67/70 kB | 33 kB | 58/195 kB
Progress (5): 137/282 kB | 47/50 kB | 67/70 kB | 33 kB | 58/195 kB
Progress (5): 137/282 kB | 47/50 kB | 67/70 kB | 33 kB | 59/195 kB
Progress (5): 137/282 kB | 47/50 kB | 69/70 kB | 33 kB | 59/195 kB
Progress (5): 139/282 kB | 47/50 kB | 69/70 kB | 33 kB | 59/195 kB
Progress (5): 139/282 kB | 47/50 kB | 70/70 kB | 33 kB | 59/195 kB
Progress (5): 139/282 kB | 47/50 kB | 70/70 kB | 33 kB | 60/195 kB
Progress (5): 139/282 kB | 48/50 kB | 70/70 kB | 33 kB | 60/195 kB
Progress (5): 139/282 kB | 48/50 kB | 70/70 kB | 33 kB | 62/195 kB
Progress (5): 139/282 kB | 48/50 kB | 70 kB | 33 kB | 62/195 kB   
Progress (5): 140/282 kB | 48/50 kB | 70 kB | 33 kB | 62/195 kB
Progress (5): 140/282 kB | 48/50 kB | 70 kB | 33 kB | 63/195 kB
Progress (5): 140/282 kB | 49/50 kB | 70 kB | 33 kB | 63/195 kB
Progress (5): 140/282 kB | 50 kB | 70 kB | 33 kB | 63/195 kB   
Progress (5): 140/282 kB | 50 kB | 70 kB | 33 kB | 64/195 kB
Progress (5): 142/282 kB | 50 kB | 70 kB | 33 kB | 64/195 kB
Progress (5): 142/282 kB | 50 kB | 70 kB | 33 kB | 66/195 kB
Progress (5): 143/282 kB | 50 kB | 70 kB | 33 kB | 66/195 kB
Progress (5): 143/282 kB | 50 kB | 70 kB | 33 kB | 67/195 kB
Progress (5): 144/282 kB | 50 kB | 70 kB | 33 kB | 67/195 kB
Progress (5): 144/282 kB | 50 kB | 70 kB | 33 kB | 69/195 kB
Progress (5): 146/282 kB | 50 kB | 70 kB | 33 kB | 69/195 kB
Progress (5): 146/282 kB | 50 kB | 70 kB | 33 kB | 70/195 kB
Progress (5): 147/282 kB | 50 kB | 70 kB | 33 kB | 70/195 kB
Progress (5): 147/282 kB | 50 kB | 70 kB | 33 kB | 71/195 kB
Progress (5): 148/282 kB | 50 kB | 70 kB | 33 kB | 71/195 kB
Progress (5): 148/282 kB | 50 kB | 70 kB | 33 kB | 73/195 kB
Progress (5): 150/282 kB | 50 kB | 70 kB | 33 kB | 73/195 kB
Progress (5): 150/282 kB | 50 kB | 70 kB | 33 kB | 74/195 kB
Progress (5): 151/282 kB | 50 kB | 70 kB | 33 kB | 74/195 kB
Progress (5): 151/282 kB | 50 kB | 70 kB | 33 kB | 75/195 kB
Progress (5): 153/282 kB | 50 kB | 70 kB | 33 kB | 75/195 kB
Progress (5): 153/282 kB | 50 kB | 70 kB | 33 kB | 77/195 kB
Progress (5): 154/282 kB | 50 kB | 70 kB | 33 kB | 77/195 kB
Progress (5): 154/282 kB | 50 kB | 70 kB | 33 kB | 78/195 kB
Progress (5): 155/282 kB | 50 kB | 70 kB | 33 kB | 78/195 kB
Progress (5): 155/282 kB | 50 kB | 70 kB | 33 kB | 80/195 kB
Progress (5): 157/282 kB | 50 kB | 70 kB | 33 kB | 80/195 kB
Progress (5): 157/282 kB | 50 kB | 70 kB | 33 kB | 81/195 kB
Progress (5): 158/282 kB | 50 kB | 70 kB | 33 kB | 81/195 kB
Progress (5): 158/282 kB | 50 kB | 70 kB | 33 kB | 82/195 kB
Progress (5): 159/282 kB | 50 kB | 70 kB | 33 kB | 82/195 kB
Progress (5): 159/282 kB | 50 kB | 70 kB | 33 kB | 84/195 kB
Progress (5): 161/282 kB | 50 kB | 70 kB | 33 kB | 84/195 kB
Progress (5): 161/282 kB | 50 kB | 70 kB | 33 kB | 85/195 kB
Progress (5): 162/282 kB | 50 kB | 70 kB | 33 kB | 85/195 kB
Progress (5): 162/282 kB | 50 kB | 70 kB | 33 kB | 86/195 kB
Progress (5): 164/282 kB | 50 kB | 70 kB | 33 kB | 86/195 kB
Progress (5): 164/282 kB | 50 kB | 70 kB | 33 kB | 88/195 kB
Progress (5): 165/282 kB | 50 kB | 70 kB | 33 kB | 88/195 kB
Progress (5): 165/282 kB | 50 kB | 70 kB | 33 kB | 89/195 kB
Progress (5): 166/282 kB | 50 kB | 70 kB | 33 kB | 89/195 kB
Progress (5): 166/282 kB | 50 kB | 70 kB | 33 kB | 90/195 kB
Progress (5): 168/282 kB | 50 kB | 70 kB | 33 kB | 90/195 kB
Progress (5): 168/282 kB | 50 kB | 70 kB | 33 kB | 92/195 kB
Progress (5): 169/282 kB | 50 kB | 70 kB | 33 kB | 92/195 kB
Progress (5): 169/282 kB | 50 kB | 70 kB | 33 kB | 93/195 kB
Progress (5): 170/282 kB | 50 kB | 70 kB | 33 kB | 93/195 kB
Progress (5): 170/282 kB | 50 kB | 70 kB | 33 kB | 95/195 kB
Progress (5): 172/282 kB | 50 kB | 70 kB | 33 kB | 95/195 kB
Progress (5): 172/282 kB | 50 kB | 70 kB | 33 kB | 96/195 kB
Progress (5): 173/282 kB | 50 kB | 70 kB | 33 kB | 96/195 kB
Progress (5): 173/282 kB | 50 kB | 70 kB | 33 kB | 97/195 kB
Progress (5): 174/282 kB | 50 kB | 70 kB | 33 kB | 97/195 kB
Progress (5): 174/282 kB | 50 kB | 70 kB | 33 kB | 99/195 kB
Progress (5): 176/282 kB | 50 kB | 70 kB | 33 kB | 99/195 kB
Progress (5): 176/282 kB | 50 kB | 70 kB | 33 kB | 100/195 kB
Progress (5): 177/282 kB | 50 kB | 70 kB | 33 kB | 100/195 kB
Progress (5): 177/282 kB | 50 kB | 70 kB | 33 kB | 101/195 kB
Progress (5): 179/282 kB | 50 kB | 70 kB | 33 kB | 101/195 kB
Progress (5): 179/282 kB | 50 kB | 70 kB | 33 kB | 103/195 kB
Progress (5): 180/282 kB | 50 kB | 70 kB | 33 kB | 103/195 kB
Progress (5): 180/282 kB | 50 kB | 70 kB | 33 kB | 104/195 kB
Progress (5): 181/282 kB | 50 kB | 70 kB | 33 kB | 104/195 kB
Progress (5): 181/282 kB | 50 kB | 70 kB | 33 kB | 106/195 kB
Progress (5): 183/282 kB | 50 kB | 70 kB | 33 kB | 106/195 kB
Progress (5): 183/282 kB | 50 kB | 70 kB | 33 kB | 107/195 kB
Progress (5): 184/282 kB | 50 kB | 70 kB | 33 kB | 107/195 kB
Progress (5): 184/282 kB | 50 kB | 70 kB | 33 kB | 108/195 kB
Progress (5): 185/282 kB | 50 kB | 70 kB | 33 kB | 108/195 kB
Progress (5): 185/282 kB | 50 kB | 70 kB | 33 kB | 110/195 kB
Progress (5): 187/282 kB | 50 kB | 70 kB | 33 kB | 110/195 kB
Progress (5): 187/282 kB | 50 kB | 70 kB | 33 kB | 111/195 kB
                                                             
Downloaded from central: https://repo1.maven.org/maven2/org/ow2/asm/asm-analysis/7.2/asm-analysis-7.2.jar (33 kB at 192 kB/s)
Progress (4): 187/282 kB | 50 kB | 70 kB | 112/195 kB
Progress (4): 188/282 kB | 50 kB | 70 kB | 112/195 kB
Progress (4): 188/282 kB | 50 kB | 70 kB | 114/195 kB
                                                     
Downloaded from central: https://repo1.maven.org/maven2/org/ow2/asm/asm-tree/7.2/asm-tree-7.2.jar (50 kB at 289 kB/s)
Downloading from central: https://repo1.maven.org/maven2/org/jacoco/org.jacoco.report/0.8.5/org.jacoco.report-0.8.5.jar
Progress (3): 188/282 kB | 70 kB | 115/195 kB
                                             
Downloaded from central: https://repo1.maven.org/maven2/org/ow2/asm/asm-commons/7.2/asm-commons-7.2.jar (70 kB at 396 kB/s)
Progress (2): 190/282 kB | 115/195 kB
Progress (2): 190/282 kB | 117/195 kB
Progress (2): 191/282 kB | 117/195 kB
Progress (2): 191/282 kB | 118/195 kB
Progress (2): 192/282 kB | 118/195 kB
Progress (2): 192/282 kB | 119/195 kB
Progress (2): 194/282 kB | 119/195 kB
Progress (2): 194/282 kB | 121/195 kB
Progress (2): 195/282 kB | 121/195 kB
Progress (2): 195/282 kB | 122/195 kB
Progress (2): 196/282 kB | 122/195 kB
Progress (2): 196/282 kB | 123/195 kB
Progress (2): 198/282 kB | 123/195 kB
Progress (2): 198/282 kB | 125/195 kB
Progress (2): 199/282 kB | 125/195 kB
Progress (2): 199/282 kB | 126/195 kB
Progress (2): 201/282 kB | 126/195 kB
Progress (2): 201/282 kB | 128/195 kB
Progress (2): 202/282 kB | 128/195 kB
Progress (2): 202/282 kB | 129/195 kB
Progress (2): 203/282 kB | 129/195 kB
Progress (2): 203/282 kB | 130/195 kB
Progress (2): 205/282 kB | 130/195 kB
Progress (2): 205/282 kB | 132/195 kB
Progress (2): 206/282 kB | 132/195 kB
Progress (2): 206/282 kB | 133/195 kB
Progress (2): 207/282 kB | 133/195 kB
Progress (2): 207/282 kB | 134/195 kB
Progress (2): 209/282 kB | 134/195 kB
Progress (2): 209/282 kB | 136/195 kB
Progress (2): 210/282 kB | 136/195 kB
Progress (2): 210/282 kB | 137/195 kB
Progress (2): 211/282 kB | 137/195 kB
Progress (2): 211/282 kB | 138/195 kB
Progress (2): 213/282 kB | 138/195 kB
Progress (2): 213/282 kB | 140/195 kB
Progress (2): 214/282 kB | 140/195 kB
Progress (2): 214/282 kB | 141/195 kB
Progress (2): 216/282 kB | 141/195 kB
Progress (2): 216/282 kB | 143/195 kB
Progress (2): 217/282 kB | 143/195 kB
Progress (2): 217/282 kB | 144/195 kB
Progress (2): 218/282 kB | 144/195 kB
Progress (2): 218/282 kB | 145/195 kB
Progress (2): 220/282 kB | 145/195 kB
Progress (2): 220/282 kB | 147/195 kB
Progress (2): 221/282 kB | 147/195 kB
Progress (2): 221/282 kB | 148/195 kB
Progress (2): 222/282 kB | 148/195 kB
Progress (2): 222/282 kB | 149/195 kB
Progress (2): 224/282 kB | 149/195 kB
Progress (2): 225/282 kB | 149/195 kB
Progress (2): 225/282 kB | 151/195 kB
Progress (2): 227/282 kB | 151/195 kB
Progress (2): 227/282 kB | 152/195 kB
Progress (2): 228/282 kB | 152/195 kB
Progress (2): 228/282 kB | 154/195 kB
Progress (2): 229/282 kB | 154/195 kB
Progress (2): 229/282 kB | 155/195 kB
Progress (2): 231/282 kB | 155/195 kB
Progress (2): 231/282 kB | 156/195 kB
Progress (2): 232/282 kB | 156/195 kB
Progress (2): 232/282 kB | 158/195 kB
Progress (2): 233/282 kB | 158/195 kB
Progress (2): 233/282 kB | 159/195 kB
Progress (2): 235/282 kB | 159/195 kB
Progress (2): 235/282 kB | 160/195 kB
Progress (2): 236/282 kB | 160/195 kB
Progress (2): 236/282 kB | 162/195 kB
Progress (2): 238/282 kB | 162/195 kB
Progress (2): 238/282 kB | 163/195 kB
Progress (2): 239/282 kB | 163/195 kB
Progress (2): 239/282 kB | 165/195 kB
Progress (2): 240/282 kB | 165/195 kB
Progress (2): 240/282 kB | 166/195 kB
Progress (2): 242/282 kB | 166/195 kB
Progress (2): 242/282 kB | 167/195 kB
Progress (2): 243/282 kB | 167/195 kB
Progress (2): 243/282 kB | 169/195 kB
Progress (2): 244/282 kB | 169/195 kB
Progress (2): 244/282 kB | 170/195 kB
Progress (2): 246/282 kB | 170/195 kB
Progress (2): 246/282 kB | 171/195 kB
Progress (2): 247/282 kB | 171/195 kB
Progress (2): 247/282 kB | 173/195 kB
Progress (2): 249/282 kB | 173/195 kB
Progress (2): 249/282 kB | 174/195 kB
Progress (2): 250/282 kB | 174/195 kB
Progress (2): 250/282 kB | 175/195 kB
Progress (2): 251/282 kB | 175/195 kB
Progress (2): 251/282 kB | 177/195 kB
Progress (2): 253/282 kB | 177/195 kB
Progress (2): 253/282 kB | 178/195 kB
Progress (2): 254/282 kB | 178/195 kB
Progress (2): 254/282 kB | 180/195 kB
Progress (2): 254/282 kB | 181/195 kB
Progress (2): 255/282 kB | 181/195 kB
Progress (2): 255/282 kB | 182/195 kB
Progress (2): 255/282 kB | 184/195 kB
Progress (3): 255/282 kB | 184/195 kB | 1.4/129 kB
Progress (3): 257/282 kB | 184/195 kB | 1.4/129 kB
Progress (3): 257/282 kB | 185/195 kB | 1.4/129 kB
Progress (3): 258/282 kB | 185/195 kB | 1.4/129 kB
Progress (3): 258/282 kB | 185/195 kB | 2.7/129 kB
Progress (3): 259/282 kB | 185/195 kB | 2.7/129 kB
Progress (3): 259/282 kB | 185/195 kB | 4.1/129 kB
Progress (3): 261/282 kB | 185/195 kB | 4.1/129 kB
Progress (3): 261/282 kB | 186/195 kB | 4.1/129 kB
Progress (3): 262/282 kB | 186/195 kB | 4.1/129 kB
Progress (3): 262/282 kB | 186/195 kB | 5.5/129 kB
Progress (3): 262/282 kB | 188/195 kB | 5.5/129 kB
Progress (3): 262/282 kB | 188/195 kB | 6.9/129 kB
Progress (3): 264/282 kB | 188/195 kB | 6.9/129 kB
Progress (3): 264/282 kB | 188/195 kB | 8.2/129 kB
Progress (3): 264/282 kB | 189/195 kB | 8.2/129 kB
Progress (3): 264/282 kB | 189/195 kB | 9.6/129 kB
Progress (3): 264/282 kB | 191/195 kB | 9.6/129 kB
Progress (3): 265/282 kB | 191/195 kB | 9.6/129 kB
Progress (3): 265/282 kB | 192/195 kB | 9.6/129 kB
Progress (3): 265/282 kB | 192/195 kB | 11/129 kB 
Progress (3): 265/282 kB | 193/195 kB | 11/129 kB
Progress (3): 265/282 kB | 193/195 kB | 12/129 kB
Progress (3): 265/282 kB | 195/195 kB | 12/129 kB
Progress (3): 266/282 kB | 195/195 kB | 12/129 kB
Progress (3): 266/282 kB | 195/195 kB | 14/129 kB
Progress (3): 266/282 kB | 195 kB | 14/129 kB    
Progress (3): 266/282 kB | 195 kB | 15/129 kB
Progress (3): 266/282 kB | 195 kB | 16/129 kB
Progress (3): 266/282 kB | 195 kB | 18/129 kB
Progress (3): 266/282 kB | 195 kB | 19/129 kB
Progress (3): 266/282 kB | 195 kB | 21/129 kB
Progress (3): 266/282 kB | 195 kB | 22/129 kB
Progress (3): 266/282 kB | 195 kB | 23/129 kB
Progress (3): 266/282 kB | 195 kB | 25/129 kB
Progress (3): 266/282 kB | 195 kB | 26/129 kB
Progress (3): 266/282 kB | 195 kB | 27/129 kB
Progress (3): 266/282 kB | 195 kB | 29/129 kB
Progress (3): 266/282 kB | 195 kB | 30/129 kB
Progress (3): 266/282 kB | 195 kB | 32/129 kB
Progress (3): 266/282 kB | 195 kB | 33/129 kB
Progress (3): 266/282 kB | 195 kB | 34/129 kB
Progress (3): 266/282 kB | 195 kB | 36/129 kB
Progress (3): 266/282 kB | 195 kB | 37/129 kB
Progress (3): 266/282 kB | 195 kB | 38/129 kB
Progress (3): 266/282 kB | 195 kB | 40/129 kB
Progress (3): 266/282 kB | 195 kB | 41/129 kB
Progress (3): 266/282 kB | 195 kB | 43/129 kB
Progress (3): 266/282 kB | 195 kB | 44/129 kB
Progress (3): 266/282 kB | 195 kB | 45/129 kB
Progress (3): 266/282 kB | 195 kB | 47/129 kB
Progress (3): 268/282 kB | 195 kB | 47/129 kB
Progress (3): 268/282 kB | 195 kB | 48/129 kB
Progress (3): 269/282 kB | 195 kB | 48/129 kB
Progress (3): 269/282 kB | 195 kB | 49/129 kB
Progress (3): 270/282 kB | 195 kB | 49/129 kB
Progress (3): 270/282 kB | 195 kB | 51/129 kB
Progress (3): 272/282 kB | 195 kB | 51/129 kB
Progress (3): 272/282 kB | 195 kB | 52/129 kB
Progress (3): 273/282 kB | 195 kB | 52/129 kB
Progress (3): 273/282 kB | 195 kB | 53/129 kB
Progress (3): 275/282 kB | 195 kB | 53/129 kB
Progress (3): 275/282 kB | 195 kB | 55/129 kB
Progress (3): 276/282 kB | 195 kB | 55/129 kB
Progress (3): 276/282 kB | 195 kB | 56/129 kB
Progress (3): 277/282 kB | 195 kB | 56/129 kB
Progress (3): 277/282 kB | 195 kB | 58/129 kB
Progress (3): 279/282 kB | 195 kB | 58/129 kB
Progress (3): 279/282 kB | 195 kB | 59/129 kB
Progress (3): 280/282 kB | 195 kB | 59/129 kB
Progress (3): 280/282 kB | 195 kB | 60/129 kB
Progress (3): 281/282 kB | 195 kB | 60/129 kB
Progress (3): 281/282 kB | 195 kB | 62/129 kB
Progress (3): 282 kB | 195 kB | 62/129 kB    
Progress (3): 282 kB | 195 kB | 63/129 kB
Progress (3): 282 kB | 195 kB | 64/129 kB
Progress (3): 282 kB | 195 kB | 66/129 kB
Progress (3): 282 kB | 195 kB | 67/129 kB
Progress (3): 282 kB | 195 kB | 69/129 kB
Progress (3): 282 kB | 195 kB | 70/129 kB
Progress (3): 282 kB | 195 kB | 71/129 kB
Progress (3): 282 kB | 195 kB | 73/129 kB
Progress (3): 282 kB | 195 kB | 74/129 kB
Progress (3): 282 kB | 195 kB | 75/129 kB
Progress (3): 282 kB | 195 kB | 77/129 kB
Progress (3): 282 kB | 195 kB | 78/129 kB
Progress (3): 282 kB | 195 kB | 80/129 kB
Progress (3): 282 kB | 195 kB | 81/129 kB
Progress (3): 282 kB | 195 kB | 82/129 kB
Progress (3): 282 kB | 195 kB | 84/129 kB
Progress (3): 282 kB | 195 kB | 85/129 kB
Progress (3): 282 kB | 195 kB | 86/129 kB
Progress (3): 282 kB | 195 kB | 88/129 kB
Progress (3): 282 kB | 195 kB | 89/129 kB
Progress (3): 282 kB | 195 kB | 90/129 kB
Progress (3): 282 kB | 195 kB | 92/129 kB
Progress (3): 282 kB | 195 kB | 93/129 kB
Progress (3): 282 kB | 195 kB | 95/129 kB
Progress (3): 282 kB | 195 kB | 96/129 kB
Progress (3): 282 kB | 195 kB | 97/129 kB
Progress (3): 282 kB | 195 kB | 99/129 kB
Progress (3): 282 kB | 195 kB | 100/129 kB
Progress (3): 282 kB | 195 kB | 101/129 kB
Progress (3): 282 kB | 195 kB | 103/129 kB
                                          
Downloaded from central: https://repo1.maven.org/maven2/org/jacoco/org.jacoco.core/0.8.5/org.jacoco.core-0.8.5.jar (195 kB at 873 kB/s)
Progress (2): 282 kB | 104/129 kB
Progress (2): 282 kB | 106/129 kB
Progress (2): 282 kB | 107/129 kB
Progress (2): 282 kB | 108/129 kB
Progress (2): 282 kB | 110/129 kB
Progress (2): 282 kB | 111/129 kB
Progress (2): 282 kB | 112/129 kB
Progress (2): 282 kB | 114/129 kB
Progress (2): 282 kB | 115/129 kB
Progress (2): 282 kB | 117/129 kB
Progress (2): 282 kB | 118/129 kB
Progress (2): 282 kB | 119/129 kB
Progress (2): 282 kB | 121/129 kB
Progress (2): 282 kB | 122/129 kB
Progress (2): 282 kB | 123/129 kB
Progress (2): 282 kB | 125/129 kB
Progress (2): 282 kB | 126/129 kB
Progress (2): 282 kB | 128/129 kB
Progress (2): 282 kB | 129/129 kB
Progress (2): 282 kB | 129 kB    
                             
Downloaded from central: https://repo1.maven.org/maven2/org/jacoco/org.jacoco.agent/0.8.5/org.jacoco.agent-0.8.5-runtime.jar (282 kB at 1.2 MB/s)
Downloaded from central: https://repo1.maven.org/maven2/org/jacoco/org.jacoco.report/0.8.5/org.jacoco.report-0.8.5.jar (129 kB at 526 kB/s)
[INFO] argLine set to "-javaagent:/usr/share/tomcat8/.m2/repository/org/jacoco/org.jacoco.agent/0.8.5/org.jacoco.agent-0.8.5-runtime.jar=destfile=/usr/share/tomcat8/.jenkins/jobs/RDFUnit - build deb packages/workspace/target/jacoco.exec"
[INFO] 
[INFO] --- maven-install-plugin:2.4:install (default-install) @ rdfunit-parent ---
[INFO] Installing /usr/share/tomcat8/.jenkins/jobs/RDFUnit - build deb packages/workspace/pom.xml to /usr/share/tomcat8/.m2/repository/org/aksw/rdfunit/rdfunit-parent/0.8.22-SNAPSHOT/rdfunit-parent-0.8.22-SNAPSHOT.pom
[INFO] 
[INFO] ------------------< org.aksw.rdfunit:rdfunit-commons >------------------
[INFO] Building RDFUnit - Commons 0.8.22-SNAPSHOT                         [2/7]
[INFO] --------------------------------[ jar ]---------------------------------
Downloading from central: https://repo1.maven.org/maven2/org/apache/maven/plugins/maven-surefire-plugin/2.22.2/maven-surefire-plugin-2.22.2.pom
Progress (1): 1.4/5.0 kB
Progress (1): 2.7/5.0 kB
Progress (1): 4.1/5.0 kB
Progress (1): 5.0 kB    
                    
Downloaded from central: https://repo1.maven.org/maven2/org/apache/maven/plugins/maven-surefire-plugin/2.22.2/maven-surefire-plugin-2.22.2.pom (5.0 kB at 106 kB/s)
Downloading from central: https://repo1.maven.org/maven2/org/apache/maven/surefire/surefire/2.22.2/surefire-2.22.2.pom
Progress (1): 4.1/26 kB
Progress (1): 8.2/26 kB
Progress (1): 12/26 kB 
Progress (1): 16/26 kB
Progress (1): 20/26 kB
Progress (1): 25/26 kB
Progress (1): 26 kB   
                   
Downloaded from central: https://repo1.maven.org/maven2/org/apache/maven/surefire/surefire/2.22.2/surefire-2.22.2.pom (26 kB at 697 kB/s)
Downloading from central: https://repo1.maven.org/maven2/org/apache/maven/plugins/maven-surefire-plugin/2.22.2/maven-surefire-plugin-2.22.2.jar
Progress (1): 4.1/41 kB
Progress (1): 8.2/41 kB
Progress (1): 12/41 kB 
Progress (1): 16/41 kB
Progress (1): 20/41 kB
Progress (1): 25/41 kB
Progress (1): 29/41 kB
Progress (1): 33/41 kB
Progress (1): 37/41 kB
Progress (1): 41 kB   
                   
Downloaded from central: https://repo1.maven.org/maven2/org/apache/maven/plugins/maven-surefire-plugin/2.22.2/maven-surefire-plugin-2.22.2.jar (41 kB at 764 kB/s)
Downloading from central: https://repo.maven.apache.org/maven2/net/java/jvnet-parent/3/jvnet-parent-3.pom
Downloaded from central: https://repo.maven.apache.org/maven2/net/java/jvnet-parent/3/jvnet-parent-3.pom (0 B at 0 B/s)
Downloading from central: https://repo.maven.apache.org/maven2/net/java/jvnet-parent/5/jvnet-parent-5.pom
Downloaded from central: https://repo.maven.apache.org/maven2/net/java/jvnet-parent/5/jvnet-parent-5.pom (0 B at 0 B/s)
Downloading from central: https://repo.maven.apache.org/maven2/org/assertj/assertj-core/3.18.1/assertj-core-3.18.1.pom
Progress (1): 1.4/24 kB
Progress (1): 2.7/24 kB
Progress (1): 4.1/24 kB
Progress (1): 5.5/24 kB
Progress (1): 6.9/24 kB
Progress (1): 8.2/24 kB
Progress (1): 9.6/24 kB
Progress (1): 11/24 kB 
Progress (1): 12/24 kB
Progress (1): 14/24 kB
Progress (1): 15/24 kB
Progress (1): 16/24 kB
Progress (1): 18/24 kB
Progress (1): 19/24 kB
Progress (1): 21/24 kB
Progress (1): 22/24 kB
Progress (1): 23/24 kB
Progress (1): 24 kB   
                   
Downloaded from central: https://repo.maven.apache.org/maven2/org/assertj/assertj-core/3.18.1/assertj-core-3.18.1.pom (24 kB at 303 kB/s)
Downloading from central: https://repo.maven.apache.org/maven2/org/assertj/assertj-parent-pom/2.2.8/assertj-parent-pom-2.2.8.pom
Progress (1): 1.4/24 kB
Progress (1): 2.7/24 kB
Progress (1): 4.1/24 kB
Progress (1): 5.5/24 kB
Progress (1): 6.9/24 kB
Progress (1): 8.2/24 kB
Progress (1): 9.6/24 kB
Progress (1): 11/24 kB 
Progress (1): 12/24 kB
Progress (1): 14/24 kB
Progress (1): 15/24 kB
Progress (1): 16/24 kB
Progress (1): 18/24 kB
Progress (1): 19/24 kB
Progress (1): 21/24 kB
Progress (1): 22/24 kB
Progress (1): 23/24 kB
Progress (1): 24 kB   
                   
Downloaded from central: https://repo.maven.apache.org/maven2/org/assertj/assertj-parent-pom/2.2.8/assertj-parent-pom-2.2.8.pom (24 kB at 239 kB/s)
Downloading from central: https://repo.maven.apache.org/maven2/org/junit/junit-bom/5.6.3/junit-bom-5.6.3.pom
Progress (1): 1.4/4.9 kB
Progress (1): 2.7/4.9 kB
Progress (1): 4.1/4.9 kB
Progress (1): 4.9 kB    
                    
Downloaded from central: https://repo.maven.apache.org/maven2/org/junit/junit-bom/5.6.3/junit-bom-5.6.3.pom (4.9 kB at 150 kB/s)
Downloading from central: https://repo.maven.apache.org/maven2/org/assertj/assertj-core/3.18.1/assertj-core-3.18.1.jar
Progress (1): 0/4.8 MB
Progress (1): 0/4.8 MB
Progress (1): 0/4.8 MB
Progress (1): 0/4.8 MB
Progress (1): 0/4.8 MB
Progress (1): 0/4.8 MB
Progress (1): 0/4.8 MB
Progress (1): 0/4.8 MB
Progress (1): 0/4.8 MB
Progress (1): 0/4.8 MB
Progress (1): 0/4.8 MB
Progress (1): 0/4.8 MB
Progress (1): 0/4.8 MB
Progress (1): 0/4.8 MB
Progress (1): 0/4.8 MB
Progress (1): 0/4.8 MB
Progress (1): 0/4.8 MB
Progress (1): 0/4.8 MB
Progress (1): 0/4.8 MB
Progress (1): 0/4.8 MB
Progress (1): 0/4.8 MB
Progress (1): 0/4.8 MB
Progress (1): 0/4.8 MB
Progress (1): 0/4.8 MB
Progress (1): 0/4.8 MB
Progress (1): 0/4.8 MB
Progress (1): 0/4.8 MB
Progress (1): 0/4.8 MB
Progress (1): 0/4.8 MB
Progress (1): 0/4.8 MB
Progress (1): 0/4.8 MB
Progress (1): 0/4.8 MB
Progress (1): 0/4.8 MB
Progress (1): 0/4.8 MB
Progress (1): 0/4.8 MB
Progress (1): 0/4.8 MB
Progress (1): 0.1/4.8 MB
Progress (1): 0.1/4.8 MB
Progress (1): 0.1/4.8 MB
Progress (1): 0.1/4.8 MB
Progress (1): 0.1/4.8 MB
Progress (1): 0.1/4.8 MB
Progress (1): 0.1/4.8 MB
Progress (1): 0.1/4.8 MB
Progress (1): 0.1/4.8 MB
Progress (1): 0.1/4.8 MB
Progress (1): 0.1/4.8 MB
Progress (1): 0.1/4.8 MB
Progress (1): 0.1/4.8 MB
Progress (1): 0.1/4.8 MB
Progress (1): 0.1/4.8 MB
Progress (1): 0.1/4.8 MB
Progress (1): 0.1/4.8 MB
Progress (1): 0.1/4.8 MB
Progress (1): 0.1/4.8 MB
Progress (1): 0.1/4.8 MB
Progress (1): 0.1/4.8 MB
Progress (1): 0.1/4.8 MB
Progress (1): 0.1/4.8 MB
Progress (1): 0.1/4.8 MB
Progress (1): 0.1/4.8 MB
Progress (1): 0.1/4.8 MB
Progress (1): 0.1/4.8 MB
Progress (1): 0.1/4.8 MB
Progress (1): 0.1/4.8 MB
Progress (1): 0.1/4.8 MB
Progress (1): 0.1/4.8 MB
Progress (1): 0.1/4.8 MB
Progress (1): 0.1/4.8 MB
Progress (1): 0.1/4.8 MB
Progress (1): 0.1/4.8 MB
Progress (1): 0.1/4.8 MB
Progress (1): 0.1/4.8 MB
Progress (1): 0.1/4.8 MB
Progress (1): 0.1/4.8 MB
Progress (1): 0.1/4.8 MB
Progress (1): 0.1/4.8 MB
Progress (1): 0.1/4.8 MB
Progress (1): 0.1/4.8 MB
Progress (1): 0.1/4.8 MB
Progress (1): 0.1/4.8 MB
Progress (1): 0.1/4.8 MB
Progress (1): 0.1/4.8 MB
Progress (1): 0.1/4.8 MB
Progress (1): 0.1/4.8 MB
Progress (1): 0.1/4.8 MB
Progress (1): 0.1/4.8 MB
Progress (1): 0.1/4.8 MB
Progress (1): 0.1/4.8 MB
Progress (1): 0.1/4.8 MB
Progress (1): 0.1/4.8 MB
Progress (1): 0.1/4.8 MB
Progress (1): 0.1/4.8 MB
Progress (1): 0.1/4.8 MB
Progress (1): 0.1/4.8 MB
Progress (1): 0.1/4.8 MB
Progress (1): 0.1/4.8 MB
Progress (1): 0.1/4.8 MB
Progress (1): 0.1/4.8 MB
Progress (1): 0.1/4.8 MB
Progress (1): 0.1/4.8 MB
Progress (1): 0.1/4.8 MB
Progress (1): 0.1/4.8 MB
Progress (1): 0.1/4.8 MB
Progress (1): 0.1/4.8 MB
Progress (1): 0.1/4.8 MB
Progress (1): 0.1/4.8 MB
Progress (1): 0.1/4.8 MB
Progress (1): 0.1/4.8 MB
Progress (1): 0.2/4.8 MB
Progress (1): 0.2/4.8 MB
Progress (1): 0.2/4.8 MB
Progress (1): 0.2/4.8 MB
Progress (1): 0.2/4.8 MB
Progress (1): 0.2/4.8 MB
Progress (1): 0.2/4.8 MB
Progress (1): 0.2/4.8 MB
Progress (1): 0.2/4.8 MB
Progress (1): 0.2/4.8 MB
Progress (1): 0.2/4.8 MB
Progress (1): 0.2/4.8 MB
Progress (1): 0.2/4.8 MB
Progress (1): 0.2/4.8 MB
Progress (1): 0.2/4.8 MB
Progress (1): 0.2/4.8 MB
Progress (1): 0.2/4.8 MB
Progress (1): 0.2/4.8 MB
Progress (1): 0.2/4.8 MB
Progress (1): 0.2/4.8 MB
Progress (1): 0.2/4.8 MB
Progress (1): 0.2/4.8 MB
Progress (1): 0.2/4.8 MB
Progress (1): 0.2/4.8 MB
Progress (1): 0.2/4.8 MB
Progress (1): 0.2/4.8 MB
Progress (1): 0.2/4.8 MB
Progress (1): 0.2/4.8 MB
Progress (1): 0.2/4.8 MB
Progress (1): 0.2/4.8 MB
Progress (1): 0.2/4.8 MB
Progress (1): 0.2/4.8 MB
Progress (1): 0.2/4.8 MB
Progress (1): 0.2/4.8 MB
Progress (1): 0.2/4.8 MB
Progress (1): 0.2/4.8 MB
Progress (1): 0.2/4.8 MB
Progress (1): 0.2/4.8 MB
Progress (1): 0.2/4.8 MB
Progress (1): 0.2/4.8 MB
Progress (1): 0.2/4.8 MB
Progress (1): 0.2/4.8 MB
Progress (1): 0.2/4.8 MB
Progress (1): 0.2/4.8 MB
Progress (1): 0.2/4.8 MB
Progress (1): 0.2/4.8 MB
Progress (1): 0.2/4.8 MB
Progress (1): 0.2/4.8 MB
Progress (1): 0.2/4.8 MB
Progress (1): 0.2/4.8 MB
Progress (1): 0.2/4.8 MB
Progress (1): 0.2/4.8 MB
Progress (1): 0.2/4.8 MB
Progress (1): 0.2/4.8 MB
Progress (1): 0.2/4.8 MB
Progress (1): 0.2/4.8 MB
Progress (1): 0.2/4.8 MB
Progress (1): 0.2/4.8 MB
Progress (1): 0.2/4.8 MB
Progress (1): 0.2/4.8 MB
Progress (1): 0.2/4.8 MB
Progress (1): 0.2/4.8 MB
Progress (1): 0.2/4.8 MB
Progress (1): 0.2/4.8 MB
Progress (1): 0.2/4.8 MB
Progress (1): 0.2/4.8 MB
Progress (1): 0.2/4.8 MB
Progress (1): 0.2/4.8 MB
Progress (1): 0.2/4.8 MB
Progress (1): 0.2/4.8 MB
Progress (1): 0.2/4.8 MB
Progress (1): 0.2/4.8 MB
Progress (1): 0.2/4.8 MB
Progress (1): 0.3/4.8 MB
Progress (1): 0.3/4.8 MB
Progress (1): 0.3/4.8 MB
Progress (1): 0.3/4.8 MB
Progress (1): 0.3/4.8 MB
Progress (1): 0.3/4.8 MB
Progress (1): 0.3/4.8 MB
Progress (1): 0.3/4.8 MB
Progress (1): 0.3/4.8 MB
Progress (1): 0.3/4.8 MB
Progress (1): 0.3/4.8 MB
Progress (1): 0.3/4.8 MB
Progress (1): 0.3/4.8 MB
Progress (1): 0.3/4.8 MB
Progress (1): 0.3/4.8 MB
Progress (1): 0.3/4.8 MB
Progress (1): 0.3/4.8 MB
Progress (1): 0.3/4.8 MB
Progress (1): 0.3/4.8 MB
Progress (1): 0.3/4.8 MB
Progress (1): 0.3/4.8 MB
Progress (1): 0.3/4.8 MB
Progress (1): 0.3/4.8 MB
Progress (1): 0.3/4.8 MB
Progress (1): 0.3/4.8 MB
Progress (1): 0.3/4.8 MB
Progress (1): 0.3/4.8 MB
Progress (1): 0.3/4.8 MB
Progress (1): 0.3/4.8 MB
Progress (1): 0.3/4.8 MB
Progress (1): 0.3/4.8 MB
Progress (1): 0.3/4.8 MB
Progress (1): 0.3/4.8 MB
Progress (1): 0.3/4.8 MB
Progress (1): 0.3/4.8 MB
Progress (1): 0.3/4.8 MB
Progress (1): 0.3/4.8 MB
Progress (1): 0.3/4.8 MB
Progress (1): 0.3/4.8 MB
Progress (1): 0.3/4.8 MB
Progress (1): 0.3/4.8 MB
Progress (1): 0.3/4.8 MB
Progress (1): 0.3/4.8 MB
Progress (1): 0.3/4.8 MB
Progress (1): 0.3/4.8 MB
Progress (1): 0.3/4.8 MB
Progress (1): 0.3/4.8 MB
Progress (1): 0.3/4.8 MB
Progress (1): 0.3/4.8 MB
Progress (1): 0.3/4.8 MB
Progress (1): 0.3/4.8 MB
Progress (1): 0.3/4.8 MB
Progress (1): 0.3/4.8 MB
Progress (1): 0.3/4.8 MB
Progress (1): 0.3/4.8 MB
Progress (1): 0.3/4.8 MB
Progress (1): 0.3/4.8 MB
Progress (1): 0.3/4.8 MB
Progress (1): 0.3/4.8 MB
Progress (1): 0.3/4.8 MB
Progress (1): 0.3/4.8 MB
Progress (1): 0.3/4.8 MB
Progress (1): 0.3/4.8 MB
Progress (1): 0.4/4.8 MB
Progress (1): 0.4/4.8 MB
Progress (1): 0.4/4.8 MB
Progress (1): 0.4/4.8 MB
Progress (1): 0.4/4.8 MB
Progress (1): 0.4/4.8 MB
Progress (1): 0.4/4.8 MB
Progress (1): 0.4/4.8 MB
Progress (1): 0.4/4.8 MB
Progress (1): 0.4/4.8 MB
Progress (1): 0.4/4.8 MB
Progress (1): 0.4/4.8 MB
Progress (1): 0.4/4.8 MB
Progress (1): 0.4/4.8 MB
Progress (1): 0.4/4.8 MB
Progress (1): 0.4/4.8 MB
Progress (1): 0.4/4.8 MB
Progress (1): 0.4/4.8 MB
Progress (1): 0.4/4.8 MB
Progress (1): 0.4/4.8 MB
Progress (1): 0.4/4.8 MB
Progress (1): 0.4/4.8 MB
Progress (1): 0.4/4.8 MB
Progress (1): 0.4/4.8 MB
Progress (1): 0.5/4.8 MB
Progress (1): 0.5/4.8 MB
Progress (1): 0.5/4.8 MB
Progress (1): 0.5/4.8 MB
Progress (1): 0.5/4.8 MB
Progress (1): 0.5/4.8 MB
Progress (1): 0.5/4.8 MB
Progress (1): 0.5/4.8 MB
Progress (1): 0.5/4.8 MB
Progress (1): 0.5/4.8 MB
Progress (1): 0.5/4.8 MB
Progress (1): 0.5/4.8 MB
Progress (1): 0.5/4.8 MB
Progress (1): 0.5/4.8 MB
Progress (1): 0.5/4.8 MB
Progress (1): 0.5/4.8 MB
Progress (1): 0.5/4.8 MB
Progress (1): 0.5/4.8 MB
Progress (1): 0.5/4.8 MB
Progress (1): 0.5/4.8 MB
Progress (1): 0.5/4.8 MB
Progress (1): 0.5/4.8 MB
Progress (1): 0.5/4.8 MB
Progress (1): 0.5/4.8 MB
Progress (1): 0.5/4.8 MB
Progress (1): 0.6/4.8 MB
Progress (1): 0.6/4.8 MB
Progress (1): 0.6/4.8 MB
Progress (1): 0.6/4.8 MB
Progress (1): 0.6/4.8 MB
Progress (1): 0.6/4.8 MB
Progress (1): 0.6/4.8 MB
Progress (1): 0.6/4.8 MB
Progress (1): 0.6/4.8 MB
Progress (1): 0.6/4.8 MB
Progress (1): 0.6/4.8 MB
Progress (1): 0.6/4.8 MB
Progress (1): 0.6/4.8 MB
Progress (1): 0.6/4.8 MB
Progress (1): 0.6/4.8 MB
Progress (1): 0.6/4.8 MB
Progress (1): 0.6/4.8 MB
Progress (1): 0.6/4.8 MB
Progress (1): 0.6/4.8 MB
Progress (1): 0.6/4.8 MB
Progress (1): 0.6/4.8 MB
Progress (1): 0.6/4.8 MB
Progress (1): 0.6/4.8 MB
Progress (1): 0.6/4.8 MB
Progress (1): 0.7/4.8 MB
Progress (1): 0.7/4.8 MB
Progress (1): 0.7/4.8 MB
Progress (1): 0.7/4.8 MB
Progress (1): 0.7/4.8 MB
Progress (1): 0.7/4.8 MB
Progress (1): 0.7/4.8 MB
Progress (1): 0.7/4.8 MB
Progress (1): 0.7/4.8 MB
Progress (1): 0.7/4.8 MB
Progress (1): 0.7/4.8 MB
Progress (1): 0.7/4.8 MB
Progress (1): 0.7/4.8 MB
Progress (1): 0.7/4.8 MB
Progress (1): 0.7/4.8 MB
Progress (1): 0.7/4.8 MB
Progress (1): 0.7/4.8 MB
Progress (1): 0.7/4.8 MB
Progress (1): 0.7/4.8 MB
Progress (1): 0.7/4.8 MB
Progress (1): 0.7/4.8 MB
Progress (1): 0.7/4.8 MB
Progress (1): 0.7/4.8 MB
Progress (1): 0.7/4.8 MB
Progress (1): 0.7/4.8 MB
Progress (1): 0.8/4.8 MB
Progress (1): 0.8/4.8 MB
Progress (1): 0.8/4.8 MB
Progress (1): 0.8/4.8 MB
Progress (1): 0.8/4.8 MB
Progress (1): 0.8/4.8 MB
Progress (1): 0.8/4.8 MB
Progress (1): 0.8/4.8 MB
Progress (1): 0.8/4.8 MB
Progress (1): 0.8/4.8 MB
Progress (1): 0.8/4.8 MB
Progress (1): 0.8/4.8 MB
Progress (1): 0.8/4.8 MB
Progress (1): 0.8/4.8 MB
Progress (1): 0.8/4.8 MB
Progress (1): 0.8/4.8 MB
Progress (1): 0.8/4.8 MB
Progress (1): 0.8/4.8 MB
Progress (1): 0.8/4.8 MB
Progress (1): 0.8/4.8 MB
Progress (1): 0.8/4.8 MB
Progress (1): 0.8/4.8 MB
Progress (1): 0.8/4.8 MB
Progress (1): 0.8/4.8 MB
Progress (1): 0.8/4.8 MB
Progress (1): 0.9/4.8 MB
Progress (1): 0.9/4.8 MB
Progress (1): 0.9/4.8 MB
Progress (1): 0.9/4.8 MB
Progress (1): 0.9/4.8 MB
Progress (1): 0.9/4.8 MB
Progress (1): 0.9/4.8 MB
Progress (1): 0.9/4.8 MB
Progress (1): 0.9/4.8 MB
Progress (1): 0.9/4.8 MB
Progress (1): 0.9/4.8 MB
Progress (1): 0.9/4.8 MB
Progress (1): 0.9/4.8 MB
Progress (1): 0.9/4.8 MB
Progress (1): 0.9/4.8 MB
Progress (1): 0.9/4.8 MB
Progress (1): 0.9/4.8 MB
Progress (1): 0.9/4.8 MB
Progress (1): 0.9/4.8 MB
Progress (1): 0.9/4.8 MB
Progress (1): 0.9/4.8 MB
Progress (1): 0.9/4.8 MB
Progress (1): 0.9/4.8 MB
Progress (1): 0.9/4.8 MB
Progress (1): 1.0/4.8 MB
Progress (1): 1.0/4.8 MB
Progress (1): 1.0/4.8 MB
Progress (1): 1.0/4.8 MB
Progress (1): 1.0/4.8 MB
Progress (1): 1.0/4.8 MB
Progress (1): 1.0/4.8 MB
Progress (1): 1.0/4.8 MB
Progress (1): 1.0/4.8 MB
Progress (1): 1.0/4.8 MB
Progress (1): 1.0/4.8 MB
Progress (1): 1.0/4.8 MB
Progress (1): 1.0/4.8 MB
Progress (1): 1.0/4.8 MB
Progress (1): 1.0/4.8 MB
Progress (1): 1.0/4.8 MB
Progress (1): 1.0/4.8 MB
Progress (1): 1.0/4.8 MB
Progress (1): 1.0/4.8 MB
Progress (1): 1.0/4.8 MB
Progress (1): 1.0/4.8 MB
Progress (1): 1.0/4.8 MB
Progress (1): 1.0/4.8 MB
Progress (1): 1.0/4.8 MB
Progress (1): 1.0/4.8 MB
Progress (1): 1.1/4.8 MB
Progress (1): 1.1/4.8 MB
Progress (1): 1.1/4.8 MB
Progress (1): 1.1/4.8 MB
Progress (1): 1.1/4.8 MB
Progress (1): 1.1/4.8 MB
Progress (1): 1.1/4.8 MB
Progress (1): 1.1/4.8 MB
Progress (1): 1.1/4.8 MB
Progress (1): 1.1/4.8 MB
Progress (1): 1.1/4.8 MB
Progress (1): 1.1/4.8 MB
Progress (1): 1.1/4.8 MB
Progress (1): 1.1/4.8 MB
Progress (1): 1.1/4.8 MB
Progress (1): 1.1/4.8 MB
Progress (1): 1.1/4.8 MB
Progress (1): 1.1/4.8 MB
Progress (1): 1.1/4.8 MB
Progress (1): 1.1/4.8 MB
Progress (1): 1.1/4.8 MB
Progress (1): 1.1/4.8 MB
Progress (1): 1.1/4.8 MB
Progress (1): 1.1/4.8 MB
Progress (1): 1.2/4.8 MB
Progress (1): 1.2/4.8 MB
Progress (1): 1.2/4.8 MB
Progress (1): 1.2/4.8 MB
Progress (1): 1.2/4.8 MB
Progress (1): 1.2/4.8 MB
Progress (1): 1.2/4.8 MB
Progress (1): 1.2/4.8 MB
Progress (1): 1.2/4.8 MB
Progress (1): 1.2/4.8 MB
Progress (1): 1.2/4.8 MB
Progress (1): 1.2/4.8 MB
Progress (1): 1.2/4.8 MB
Progress (1): 1.2/4.8 MB
Progress (1): 1.2/4.8 MB
Progress (1): 1.2/4.8 MB
Progress (1): 1.2/4.8 MB
Progress (1): 1.2/4.8 MB
Progress (1): 1.2/4.8 MB
Progress (1): 1.2/4.8 MB
Progress (1): 1.2/4.8 MB
Progress (1): 1.2/4.8 MB
Progress (1): 1.2/4.8 MB
Progress (1): 1.2/4.8 MB
Progress (1): 1.3/4.8 MB
Progress (1): 1.3/4.8 MB
Progress (1): 1.3/4.8 MB
Progress (1): 1.3/4.8 MB
Progress (1): 1.3/4.8 MB
Progress (1): 1.3/4.8 MB
Progress (1): 1.3/4.8 MB
Progress (1): 1.3/4.8 MB
Progress (1): 1.3/4.8 MB
Progress (1): 1.3/4.8 MB
Progress (1): 1.3/4.8 MB
Progress (1): 1.3/4.8 MB
Progress (1): 1.3/4.8 MB
Progress (1): 1.3/4.8 MB
Progress (1): 1.3/4.8 MB
Progress (1): 1.3/4.8 MB
Progress (1): 1.3/4.8 MB
Progress (1): 1.3/4.8 MB
Progress (1): 1.3/4.8 MB
Progress (1): 1.3/4.8 MB
Progress (1): 1.3/4.8 MB
Progress (1): 1.3/4.8 MB
Progress (1): 1.3/4.8 MB
Progress (1): 1.3/4.8 MB
Progress (1): 1.3/4.8 MB
Progress (1): 1.4/4.8 MB
Progress (1): 1.4/4.8 MB
Progress (1): 1.4/4.8 MB
Progress (1): 1.4/4.8 MB
Progress (1): 1.4/4.8 MB
Progress (1): 1.4/4.8 MB
Progress (1): 1.4/4.8 MB
Progress (1): 1.4/4.8 MB
Progress (1): 1.4/4.8 MB
Progress (1): 1.4/4.8 MB
Progress (1): 1.4/4.8 MB
Progress (1): 1.4/4.8 MB
Progress (1): 1.4/4.8 MB
Progress (1): 1.4/4.8 MB
Progress (1): 1.4/4.8 MB
Progress (1): 1.4/4.8 MB
Progress (1): 1.4/4.8 MB
Progress (1): 1.4/4.8 MB
Progress (1): 1.4/4.8 MB
Progress (1): 1.4/4.8 MB
Progress (1): 1.4/4.8 MB
Progress (1): 1.4/4.8 MB
Progress (1): 1.4/4.8 MB
Progress (1): 1.4/4.8 MB
Progress (1): 1.5/4.8 MB
Progress (1): 1.5/4.8 MB
Progress (1): 1.5/4.8 MB
Progress (1): 1.5/4.8 MB
Progress (1): 1.5/4.8 MB
Progress (1): 1.5/4.8 MB
Progress (1): 1.5/4.8 MB
Progress (1): 1.5/4.8 MB
Progress (1): 1.5/4.8 MB
Progress (1): 1.5/4.8 MB
Progress (1): 1.5/4.8 MB
Progress (1): 1.5/4.8 MB
Progress (1): 1.5/4.8 MB
Progress (1): 1.5/4.8 MB
Progress (1): 1.5/4.8 MB
Progress (1): 1.5/4.8 MB
Progress (1): 1.5/4.8 MB
Progress (1): 1.5/4.8 MB
Progress (1): 1.5/4.8 MB
Progress (1): 1.5/4.8 MB
Progress (1): 1.5/4.8 MB
Progress (1): 1.5/4.8 MB
Progress (1): 1.5/4.8 MB
Progress (1): 1.5/4.8 MB
Progress (1): 1.5/4.8 MB
Progress (1): 1.6/4.8 MB
Progress (1): 1.6/4.8 MB
Progress (1): 1.6/4.8 MB
Progress (1): 1.6/4.8 MB
Progress (1): 1.6/4.8 MB
Progress (1): 1.6/4.8 MB
Progress (1): 1.6/4.8 MB
Progress (1): 1.6/4.8 MB
Progress (1): 1.6/4.8 MB
Progress (1): 1.6/4.8 MB
Progress (1): 1.6/4.8 MB
Progress (1): 1.6/4.8 MB
Progress (1): 1.6/4.8 MB
Progress (1): 1.6/4.8 MB
Progress (1): 1.6/4.8 MB
Progress (1): 1.6/4.8 MB
Progress (1): 1.6/4.8 MB
Progress (1): 1.6/4.8 MB
Progress (1): 1.6/4.8 MB
Progress (1): 1.6/4.8 MB
Progress (1): 1.6/4.8 MB
Progress (1): 1.6/4.8 MB
Progress (1): 1.6/4.8 MB
Progress (1): 1.6/4.8 MB
Progress (1): 1.6/4.8 MB
Progress (1): 1.7/4.8 MB
Progress (1): 1.7/4.8 MB
Progress (1): 1.7/4.8 MB
Progress (1): 1.7/4.8 MB
Progress (1): 1.7/4.8 MB
Progress (1): 1.7/4.8 MB
Progress (1): 1.7/4.8 MB
Progress (1): 1.7/4.8 MB
Progress (1): 1.7/4.8 MB
Progress (1): 1.7/4.8 MB
Progress (1): 1.7/4.8 MB
Progress (1): 1.7/4.8 MB
Progress (1): 1.7/4.8 MB
Progress (1): 1.7/4.8 MB
Progress (1): 1.7/4.8 MB
Progress (1): 1.7/4.8 MB
Progress (1): 1.7/4.8 MB
Progress (1): 1.7/4.8 MB
Progress (1): 1.7/4.8 MB
Progress (1): 1.7/4.8 MB
Progress (1): 1.7/4.8 MB
Progress (1): 1.7/4.8 MB
Progress (1): 1.7/4.8 MB
Progress (1): 1.7/4.8 MB
Progress (1): 1.8/4.8 MB
Progress (1): 1.8/4.8 MB
Progress (1): 1.8/4.8 MB
Progress (1): 1.8/4.8 MB
Progress (1): 1.8/4.8 MB
Progress (1): 1.8/4.8 MB
Progress (1): 1.8/4.8 MB
Progress (1): 1.8/4.8 MB
Progress (1): 1.8/4.8 MB
Progress (1): 1.8/4.8 MB
Progress (1): 1.8/4.8 MB
Progress (1): 1.8/4.8 MB
Progress (1): 1.8/4.8 MB
Progress (1): 1.8/4.8 MB
Progress (1): 1.8/4.8 MB
Progress (1): 1.8/4.8 MB
Progress (1): 1.8/4.8 MB
Progress (1): 1.8/4.8 MB
Progress (1): 1.8/4.8 MB
Progress (1): 1.8/4.8 MB
Progress (1): 1.8/4.8 MB
Progress (1): 1.8/4.8 MB
Progress (1): 1.8/4.8 MB
Progress (1): 1.8/4.8 MB
Progress (1): 1.8/4.8 MB
Progress (1): 1.9/4.8 MB
Progress (1): 1.9/4.8 MB
Progress (1): 1.9/4.8 MB
Progress (1): 1.9/4.8 MB
Progress (1): 1.9/4.8 MB
Progress (1): 1.9/4.8 MB
Progress (1): 1.9/4.8 MB
Progress (1): 1.9/4.8 MB
Progress (1): 1.9/4.8 MB
Progress (1): 1.9/4.8 MB
Progress (1): 1.9/4.8 MB
Progress (1): 1.9/4.8 MB
Progress (1): 1.9/4.8 MB
Progress (1): 1.9/4.8 MB
Progress (1): 1.9/4.8 MB
Progress (1): 1.9/4.8 MB
Progress (1): 1.9/4.8 MB
Progress (1): 1.9/4.8 MB
Progress (1): 1.9/4.8 MB
Progress (1): 1.9/4.8 MB
Progress (1): 1.9/4.8 MB
Progress (1): 1.9/4.8 MB
Progress (1): 1.9/4.8 MB
Progress (1): 1.9/4.8 MB
Progress (1): 1.9/4.8 MB
Progress (1): 2.0/4.8 MB
Progress (1): 2.0/4.8 MB
Progress (1): 2.0/4.8 MB
Progress (1): 2.0/4.8 MB
Progress (1): 2.0/4.8 MB
Progress (1): 2.0/4.8 MB
Progress (1): 2.0/4.8 MB
Progress (1): 2.0/4.8 MB
Progress (1): 2.0/4.8 MB
Progress (1): 2.0/4.8 MB
Progress (1): 2.0/4.8 MB
Progress (1): 2.0/4.8 MB
Progress (1): 2.0/4.8 MB
Progress (1): 2.0/4.8 MB
Progress (1): 2.0/4.8 MB
Progress (1): 2.0/4.8 MB
Progress (1): 2.0/4.8 MB
Progress (1): 2.0/4.8 MB
Progress (1): 2.0/4.8 MB
Progress (1): 2.0/4.8 MB
Progress (1): 2.0/4.8 MB
Progress (1): 2.0/4.8 MB
Progress (1): 2.0/4.8 MB
Progress (1): 2.0/4.8 MB
Progress (1): 2.1/4.8 MB
Progress (1): 2.1/4.8 MB
Progress (1): 2.1/4.8 MB
Progress (1): 2.1/4.8 MB
Progress (1): 2.1/4.8 MB
Progress (1): 2.1/4.8 MB
Progress (1): 2.1/4.8 MB
Progress (1): 2.1/4.8 MB
Progress (1): 2.1/4.8 MB
Progress (1): 2.1/4.8 MB
Progress (1): 2.1/4.8 MB
Progress (1): 2.1/4.8 MB
Progress (1): 2.1/4.8 MB
Progress (1): 2.1/4.8 MB
Progress (1): 2.1/4.8 MB
Progress (1): 2.1/4.8 MB
Progress (1): 2.1/4.8 MB
Progress (1): 2.1/4.8 MB
Progress (1): 2.1/4.8 MB
Progress (1): 2.1/4.8 MB
Progress (1): 2.1/4.8 MB
Progress (1): 2.1/4.8 MB
Progress (1): 2.1/4.8 MB
Progress (1): 2.1/4.8 MB
Progress (1): 2.1/4.8 MB
Progress (1): 2.2/4.8 MB
Progress (1): 2.2/4.8 MB
Progress (1): 2.2/4.8 MB
Progress (1): 2.2/4.8 MB
Progress (1): 2.2/4.8 MB
Progress (1): 2.2/4.8 MB
Progress (1): 2.2/4.8 MB
Progress (1): 2.2/4.8 MB
Progress (1): 2.2/4.8 MB
Progress (1): 2.2/4.8 MB
Progress (1): 2.2/4.8 MB
Progress (1): 2.2/4.8 MB
Progress (1): 2.2/4.8 MB
Progress (1): 2.2/4.8 MB
Progress (1): 2.2/4.8 MB
Progress (1): 2.2/4.8 MB
Progress (1): 2.2/4.8 MB
Progress (1): 2.2/4.8 MB
Progress (1): 2.2/4.8 MB
Progress (1): 2.2/4.8 MB
Progress (1): 2.2/4.8 MB
Progress (1): 2.2/4.8 MB
Progress (1): 2.2/4.8 MB
Progress (1): 2.2/4.8 MB
Progress (1): 2.3/4.8 MB
Progress (1): 2.3/4.8 MB
Progress (1): 2.3/4.8 MB
Progress (1): 2.3/4.8 MB
Progress (1): 2.3/4.8 MB
Progress (1): 2.3/4.8 MB
Progress (1): 2.3/4.8 MB
Progress (1): 2.3/4.8 MB
Progress (1): 2.3/4.8 MB
Progress (1): 2.3/4.8 MB
Progress (1): 2.3/4.8 MB
Progress (1): 2.3/4.8 MB
Progress (1): 2.3/4.8 MB
Progress (1): 2.3/4.8 MB
Progress (1): 2.3/4.8 MB
Progress (1): 2.3/4.8 MB
Progress (1): 2.3/4.8 MB
Progress (1): 2.3/4.8 MB
Progress (1): 2.3/4.8 MB
Progress (1): 2.3/4.8 MB
Progress (1): 2.3/4.8 MB
Progress (1): 2.3/4.8 MB
Progress (1): 2.3/4.8 MB
Progress (1): 2.3/4.8 MB
Progress (1): 2.3/4.8 MB
Progress (1): 2.4/4.8 MB
Progress (1): 2.4/4.8 MB
Progress (1): 2.4/4.8 MB
Progress (1): 2.4/4.8 MB
Progress (1): 2.4/4.8 MB
Progress (1): 2.4/4.8 MB
Progress (1): 2.4/4.8 MB
Progress (1): 2.4/4.8 MB
Progress (1): 2.4/4.8 MB
Progress (1): 2.4/4.8 MB
Progress (1): 2.4/4.8 MB
Progress (1): 2.4/4.8 MB
Progress (1): 2.4/4.8 MB
Progress (1): 2.4/4.8 MB
Progress (1): 2.4/4.8 MB
Progress (1): 2.4/4.8 MB
Progress (1): 2.4/4.8 MB
Progress (1): 2.4/4.8 MB
Progress (1): 2.4/4.8 MB
Progress (1): 2.4/4.8 MB
Progress (1): 2.4/4.8 MB
Progress (1): 2.4/4.8 MB
Progress (1): 2.4/4.8 MB
Progress (1): 2.4/4.8 MB
Progress (1): 2.4/4.8 MB
Progress (1): 2.5/4.8 MB
Progress (1): 2.5/4.8 MB
Progress (1): 2.5/4.8 MB
Progress (1): 2.5/4.8 MB
Progress (1): 2.5/4.8 MB
Progress (1): 2.5/4.8 MB
Progress (1): 2.5/4.8 MB
Progress (1): 2.5/4.8 MB
Progress (1): 2.5/4.8 MB
Progress (1): 2.5/4.8 MB
Progress (1): 2.5/4.8 MB
Progress (1): 2.5/4.8 MB
Progress (1): 2.5/4.8 MB
Progress (1): 2.5/4.8 MB
Progress (1): 2.5/4.8 MB
Progress (1): 2.5/4.8 MB
Progress (1): 2.5/4.8 MB
Progress (1): 2.5/4.8 MB
Progress (1): 2.5/4.8 MB
Progress (1): 2.5/4.8 MB
Progress (1): 2.5/4.8 MB
Progress (1): 2.5/4.8 MB
Progress (1): 2.5/4.8 MB
Progress (1): 2.5/4.8 MB
Progress (1): 2.6/4.8 MB
Progress (1): 2.6/4.8 MB
Progress (1): 2.6/4.8 MB
Progress (1): 2.6/4.8 MB
Progress (1): 2.6/4.8 MB
Progress (1): 2.6/4.8 MB
Progress (1): 2.6/4.8 MB
Progress (1): 2.6/4.8 MB
Progress (1): 2.6/4.8 MB
Progress (1): 2.6/4.8 MB
Progress (1): 2.6/4.8 MB
Progress (1): 2.6/4.8 MB
Progress (1): 2.6/4.8 MB
Progress (1): 2.6/4.8 MB
Progress (1): 2.6/4.8 MB
Progress (1): 2.6/4.8 MB
Progress (1): 2.6/4.8 MB
Progress (1): 2.6/4.8 MB
Progress (1): 2.6/4.8 MB
Progress (1): 2.6/4.8 MB
Progress (1): 2.6/4.8 MB
Progress (1): 2.6/4.8 MB
Progress (1): 2.6/4.8 MB
Progress (1): 2.6/4.8 MB
Progress (1): 2.6/4.8 MB
Progress (1): 2.7/4.8 MB
Progress (1): 2.7/4.8 MB
Progress (1): 2.7/4.8 MB
Progress (1): 2.7/4.8 MB
Progress (1): 2.7/4.8 MB
Progress (1): 2.7/4.8 MB
Progress (1): 2.7/4.8 MB
Progress (1): 2.7/4.8 MB
Progress (1): 2.7/4.8 MB
Progress (1): 2.7/4.8 MB
Progress (1): 2.7/4.8 MB
Progress (1): 2.7/4.8 MB
Progress (1): 2.7/4.8 MB
Progress (1): 2.7/4.8 MB
Progress (1): 2.7/4.8 MB
Progress (1): 2.7/4.8 MB
Progress (1): 2.7/4.8 MB
Progress (1): 2.7/4.8 MB
Progress (1): 2.7/4.8 MB
Progress (1): 2.7/4.8 MB
Progress (1): 2.7/4.8 MB
Progress (1): 2.7/4.8 MB
Progress (1): 2.7/4.8 MB
Progress (1): 2.7/4.8 MB
Progress (1): 2.8/4.8 MB
Progress (1): 2.8/4.8 MB
Progress (1): 2.8/4.8 MB
Progress (1): 2.8/4.8 MB
Progress (1): 2.8/4.8 MB
Progress (1): 2.8/4.8 MB
Progress (1): 2.8/4.8 MB
Progress (1): 2.8/4.8 MB
Progress (1): 2.8/4.8 MB
Progress (1): 2.8/4.8 MB
Progress (1): 2.8/4.8 MB
Progress (1): 2.8/4.8 MB
Progress (1): 2.8/4.8 MB
Progress (1): 2.8/4.8 MB
Progress (1): 2.8/4.8 MB
Progress (1): 2.8/4.8 MB
Progress (1): 2.8/4.8 MB
Progress (1): 2.8/4.8 MB
Progress (1): 2.8/4.8 MB
Progress (1): 2.8/4.8 MB
Progress (1): 2.8/4.8 MB
Progress (1): 2.8/4.8 MB
Progress (1): 2.8/4.8 MB
Progress (1): 2.8/4.8 MB
Progress (1): 2.8/4.8 MB
Progress (1): 2.9/4.8 MB
Progress (1): 2.9/4.8 MB
Progress (1): 2.9/4.8 MB
Progress (1): 2.9/4.8 MB
Progress (1): 2.9/4.8 MB
Progress (1): 2.9/4.8 MB
Progress (1): 2.9/4.8 MB
Progress (1): 2.9/4.8 MB
Progress (1): 2.9/4.8 MB
Progress (1): 2.9/4.8 MB
Progress (1): 2.9/4.8 MB
Progress (1): 2.9/4.8 MB
Progress (1): 2.9/4.8 MB
Progress (1): 2.9/4.8 MB
Progress (1): 2.9/4.8 MB
Progress (1): 2.9/4.8 MB
Progress (1): 2.9/4.8 MB
Progress (1): 2.9/4.8 MB
Progress (1): 2.9/4.8 MB
Progress (1): 2.9/4.8 MB
Progress (1): 2.9/4.8 MB
Progress (1): 2.9/4.8 MB
Progress (1): 2.9/4.8 MB
Progress (1): 2.9/4.8 MB
Progress (1): 2.9/4.8 MB
Progress (1): 3.0/4.8 MB
Progress (1): 3.0/4.8 MB
Progress (1): 3.0/4.8 MB
Progress (1): 3.0/4.8 MB
Progress (1): 3.0/4.8 MB
Progress (1): 3.0/4.8 MB
Progress (1): 3.0/4.8 MB
Progress (1): 3.0/4.8 MB
Progress (1): 3.0/4.8 MB
Progress (1): 3.0/4.8 MB
Progress (1): 3.0/4.8 MB
Progress (1): 3.0/4.8 MB
Progress (1): 3.0/4.8 MB
Progress (1): 3.0/4.8 MB
Progress (1): 3.0/4.8 MB
Progress (1): 3.0/4.8 MB
Progress (1): 3.0/4.8 MB
Progress (1): 3.0/4.8 MB
Progress (1): 3.0/4.8 MB
Progress (1): 3.0/4.8 MB
Progress (1): 3.0/4.8 MB
Progress (1): 3.0/4.8 MB
Progress (1): 3.0/4.8 MB
Progress (1): 3.0/4.8 MB
Progress (1): 3.0/4.8 MB
Progress (1): 3.1/4.8 MB
Progress (1): 3.1/4.8 MB
Progress (1): 3.1/4.8 MB
Progress (1): 3.1/4.8 MB
Progress (1): 3.1/4.8 MB
Progress (1): 3.1/4.8 MB
Progress (1): 3.1/4.8 MB
Progress (1): 3.1/4.8 MB
Progress (1): 3.1/4.8 MB
Progress (1): 3.1/4.8 MB
Progress (1): 3.1/4.8 MB
Progress (1): 3.1/4.8 MB
Progress (1): 3.1/4.8 MB
Progress (1): 3.1/4.8 MB
Progress (1): 3.1/4.8 MB
Progress (1): 3.1/4.8 MB
Progress (1): 3.1/4.8 MB
Progress (1): 3.1/4.8 MB
Progress (1): 3.1/4.8 MB
Progress (1): 3.1/4.8 MB
Progress (1): 3.1/4.8 MB
Progress (1): 3.1/4.8 MB
Progress (1): 3.1/4.8 MB
Progress (1): 3.1/4.8 MB
Progress (1): 3.2/4.8 MB
Progress (1): 3.2/4.8 MB
Progress (1): 3.2/4.8 MB
Progress (1): 3.2/4.8 MB
Progress (1): 3.2/4.8 MB
Progress (1): 3.2/4.8 MB
Progress (1): 3.2/4.8 MB
Progress (1): 3.2/4.8 MB
Progress (1): 3.2/4.8 MB
Progress (1): 3.2/4.8 MB
Progress (1): 3.2/4.8 MB
Progress (1): 3.2/4.8 MB
Progress (1): 3.2/4.8 MB
Progress (1): 3.2/4.8 MB
Progress (1): 3.2/4.8 MB
Progress (1): 3.2/4.8 MB
Progress (1): 3.2/4.8 MB
Progress (1): 3.2/4.8 MB
Progress (1): 3.2/4.8 MB
Progress (1): 3.2/4.8 MB
Progress (1): 3.2/4.8 MB
Progress (1): 3.2/4.8 MB
Progress (1): 3.2/4.8 MB
Progress (1): 3.2/4.8 MB
Progress (1): 3.2/4.8 MB
Progress (1): 3.3/4.8 MB
Progress (1): 3.3/4.8 MB
Progress (1): 3.3/4.8 MB
Progress (1): 3.3/4.8 MB
Progress (1): 3.3/4.8 MB
Progress (1): 3.3/4.8 MB
Progress (1): 3.3/4.8 MB
Progress (1): 3.3/4.8 MB
Progress (1): 3.3/4.8 MB
Progress (1): 3.3/4.8 MB
Progress (1): 3.3/4.8 MB
Progress (1): 3.3/4.8 MB
Progress (1): 3.3/4.8 MB
Progress (1): 3.3/4.8 MB
Progress (1): 3.3/4.8 MB
Progress (1): 3.3/4.8 MB
Progress (1): 3.3/4.8 MB
Progress (1): 3.3/4.8 MB
Progress (1): 3.3/4.8 MB
Progress (1): 3.3/4.8 MB
Progress (1): 3.3/4.8 MB
Progress (1): 3.3/4.8 MB
Progress (1): 3.3/4.8 MB
Progress (1): 3.3/4.8 MB
Progress (1): 3.4/4.8 MB
Progress (1): 3.4/4.8 MB
Progress (1): 3.4/4.8 MB
Progress (1): 3.4/4.8 MB
Progress (1): 3.4/4.8 MB
Progress (1): 3.4/4.8 MB
Progress (1): 3.4/4.8 MB
Progress (1): 3.4/4.8 MB
Progress (1): 3.4/4.8 MB
Progress (1): 3.4/4.8 MB
Progress (1): 3.4/4.8 MB
Progress (1): 3.4/4.8 MB
Progress (1): 3.4/4.8 MB
Progress (1): 3.4/4.8 MB
Progress (1): 3.4/4.8 MB
Progress (1): 3.4/4.8 MB
Progress (1): 3.4/4.8 MB
Progress (1): 3.4/4.8 MB
Progress (1): 3.4/4.8 MB
Progress (1): 3.4/4.8 MB
Progress (1): 3.4/4.8 MB
Progress (1): 3.4/4.8 MB
Progress (1): 3.4/4.8 MB
Progress (1): 3.4/4.8 MB
Progress (1): 3.4/4.8 MB
Progress (1): 3.5/4.8 MB
Progress (1): 3.5/4.8 MB
Progress (1): 3.5/4.8 MB
Progress (1): 3.5/4.8 MB
Progress (1): 3.5/4.8 MB
Progress (1): 3.5/4.8 MB
Progress (1): 3.5/4.8 MB
Progress (1): 3.5/4.8 MB
Progress (1): 3.5/4.8 MB
Progress (1): 3.5/4.8 MB
Progress (1): 3.5/4.8 MB
Progress (1): 3.5/4.8 MB
Progress (1): 3.5/4.8 MB
Progress (1): 3.5/4.8 MB
Progress (1): 3.5/4.8 MB
Progress (1): 3.5/4.8 MB
Progress (1): 3.5/4.8 MB
Progress (1): 3.5/4.8 MB
Progress (1): 3.5/4.8 MB
Progress (1): 3.5/4.8 MB
Progress (1): 3.5/4.8 MB
Progress (1): 3.5/4.8 MB
Progress (1): 3.5/4.8 MB
Progress (1): 3.5/4.8 MB
Progress (1): 3.6/4.8 MB
Progress (1): 3.6/4.8 MB
Progress (1): 3.6/4.8 MB
Progress (1): 3.6/4.8 MB
Progress (1): 3.6/4.8 MB
Progress (1): 3.6/4.8 MB
Progress (1): 3.6/4.8 MB
Progress (1): 3.6/4.8 MB
Progress (1): 3.6/4.8 MB
Progress (1): 3.6/4.8 MB
Progress (1): 3.6/4.8 MB
Progress (1): 3.6/4.8 MB
Progress (1): 3.6/4.8 MB
Progress (1): 3.6/4.8 MB
Progress (1): 3.6/4.8 MB
Progress (1): 3.6/4.8 MB
Progress (1): 3.6/4.8 MB
Progress (1): 3.6/4.8 MB
Progress (1): 3.6/4.8 MB
Progress (1): 3.6/4.8 MB
Progress (1): 3.6/4.8 MB
Progress (1): 3.6/4.8 MB
Progress (1): 3.6/4.8 MB
Progress (1): 3.6/4.8 MB
Progress (1): 3.6/4.8 MB
Progress (1): 3.7/4.8 MB
Progress (1): 3.7/4.8 MB
Progress (1): 3.7/4.8 MB
Progress (1): 3.7/4.8 MB
Progress (1): 3.7/4.8 MB
Progress (1): 3.7/4.8 MB
Progress (1): 3.7/4.8 MB
Progress (1): 3.7/4.8 MB
Progress (1): 3.7/4.8 MB
Progress (1): 3.7/4.8 MB
Progress (1): 3.7/4.8 MB
Progress (1): 3.7/4.8 MB
Progress (1): 3.7/4.8 MB
Progress (1): 3.7/4.8 MB
Progress (1): 3.7/4.8 MB
Progress (1): 3.7/4.8 MB
Progress (1): 3.7/4.8 MB
Progress (1): 3.7/4.8 MB
Progress (1): 3.7/4.8 MB
Progress (1): 3.7/4.8 MB
Progress (1): 3.7/4.8 MB
Progress (1): 3.7/4.8 MB
Progress (1): 3.7/4.8 MB
Progress (1): 3.7/4.8 MB
Progress (1): 3.8/4.8 MB
Progress (1): 3.8/4.8 MB
Progress (1): 3.8/4.8 MB
Progress (1): 3.8/4.8 MB
Progress (1): 3.8/4.8 MB
Progress (1): 3.8/4.8 MB
Progress (1): 3.8/4.8 MB
Progress (1): 3.8/4.8 MB
Progress (1): 3.8/4.8 MB
Progress (1): 3.8/4.8 MB
Progress (1): 3.8/4.8 MB
Progress (1): 3.8/4.8 MB
Progress (1): 3.8/4.8 MB
Progress (1): 3.8/4.8 MB
Progress (1): 3.8/4.8 MB
Progress (1): 3.8/4.8 MB
Progress (1): 3.8/4.8 MB
Progress (1): 3.8/4.8 MB
Progress (1): 3.8/4.8 MB
Progress (1): 3.8/4.8 MB
Progress (1): 3.8/4.8 MB
Progress (1): 3.8/4.8 MB
Progress (1): 3.8/4.8 MB
Progress (1): 3.8/4.8 MB
Progress (1): 3.9/4.8 MB
Progress (1): 3.9/4.8 MB
Progress (1): 3.9/4.8 MB
Progress (1): 3.9/4.8 MB
Progress (1): 3.9/4.8 MB
Progress (1): 3.9/4.8 MB
Progress (1): 3.9/4.8 MB
Progress (1): 3.9/4.8 MB
Progress (1): 3.9/4.8 MB
Progress (1): 3.9/4.8 MB
Progress (1): 3.9/4.8 MB
Progress (1): 3.9/4.8 MB
Progress (1): 3.9/4.8 MB
Progress (1): 3.9/4.8 MB
Progress (1): 3.9/4.8 MB
Progress (1): 3.9/4.8 MB
Progress (1): 3.9/4.8 MB
Progress (1): 3.9/4.8 MB
Progress (1): 3.9/4.8 MB
Progress (1): 3.9/4.8 MB
Progress (1): 3.9/4.8 MB
Progress (1): 3.9/4.8 MB
Progress (1): 3.9/4.8 MB
Progress (1): 3.9/4.8 MB
Progress (1): 3.9/4.8 MB
Progress (1): 4.0/4.8 MB
Progress (1): 4.0/4.8 MB
Progress (1): 4.0/4.8 MB
Progress (1): 4.0/4.8 MB
Progress (1): 4.0/4.8 MB
Progress (1): 4.0/4.8 MB
Progress (1): 4.0/4.8 MB
Progress (1): 4.0/4.8 MB
Progress (1): 4.0/4.8 MB
Progress (1): 4.0/4.8 MB
Progress (1): 4.0/4.8 MB
Progress (1): 4.0/4.8 MB
Progress (1): 4.0/4.8 MB
Progress (1): 4.0/4.8 MB
Progress (1): 4.0/4.8 MB
Progress (1): 4.0/4.8 MB
Progress (1): 4.0/4.8 MB
Progress (1): 4.0/4.8 MB
Progress (1): 4.0/4.8 MB
Progress (1): 4.0/4.8 MB
Progress (1): 4.0/4.8 MB
Progress (1): 4.0/4.8 MB
Progress (1): 4.0/4.8 MB
Progress (1): 4.0/4.8 MB
Progress (1): 4.0/4.8 MB
Progress (1): 4.1/4.8 MB
Progress (1): 4.1/4.8 MB
Progress (1): 4.1/4.8 MB
Progress (1): 4.1/4.8 MB
Progress (1): 4.1/4.8 MB
Progress (1): 4.1/4.8 MB
Progress (1): 4.1/4.8 MB
Progress (1): 4.1/4.8 MB
Progress (1): 4.1/4.8 MB
Progress (1): 4.1/4.8 MB
Progress (1): 4.1/4.8 MB
Progress (1): 4.1/4.8 MB
Progress (1): 4.1/4.8 MB
Progress (1): 4.1/4.8 MB
Progress (1): 4.1/4.8 MB
Progress (1): 4.1/4.8 MB
Progress (1): 4.1/4.8 MB
Progress (1): 4.1/4.8 MB
Progress (1): 4.1/4.8 MB
Progress (1): 4.1/4.8 MB
Progress (1): 4.1/4.8 MB
Progress (1): 4.1/4.8 MB
Progress (1): 4.1/4.8 MB
Progress (1): 4.1/4.8 MB
Progress (1): 4.1/4.8 MB
Progress (1): 4.2/4.8 MB
Progress (1): 4.2/4.8 MB
Progress (1): 4.2/4.8 MB
Progress (1): 4.2/4.8 MB
Progress (1): 4.2/4.8 MB
Progress (1): 4.2/4.8 MB
Progress (1): 4.2/4.8 MB
Progress (1): 4.2/4.8 MB
Progress (1): 4.2/4.8 MB
Progress (1): 4.2/4.8 MB
Progress (1): 4.2/4.8 MB
Progress (1): 4.2/4.8 MB
Progress (1): 4.2/4.8 MB
Progress (1): 4.2/4.8 MB
Progress (1): 4.2/4.8 MB
Progress (1): 4.2/4.8 MB
Progress (1): 4.2/4.8 MB
Progress (1): 4.2/4.8 MB
Progress (1): 4.2/4.8 MB
Progress (1): 4.2/4.8 MB
Progress (1): 4.2/4.8 MB
Progress (1): 4.2/4.8 MB
Progress (1): 4.2/4.8 MB
Progress (1): 4.2/4.8 MB
Progress (1): 4.3/4.8 MB
Progress (1): 4.3/4.8 MB
Progress (1): 4.3/4.8 MB
Progress (1): 4.3/4.8 MB
Progress (1): 4.3/4.8 MB
Progress (1): 4.3/4.8 MB
Progress (1): 4.3/4.8 MB
Progress (1): 4.3/4.8 MB
Progress (1): 4.3/4.8 MB
Progress (1): 4.3/4.8 MB
Progress (1): 4.3/4.8 MB
Progress (1): 4.3/4.8 MB
Progress (1): 4.3/4.8 MB
Progress (1): 4.3/4.8 MB
Progress (1): 4.3/4.8 MB
Progress (1): 4.3/4.8 MB
Progress (1): 4.3/4.8 MB
Progress (1): 4.3/4.8 MB
Progress (1): 4.3/4.8 MB
Progress (1): 4.3/4.8 MB
Progress (1): 4.3/4.8 MB
Progress (1): 4.3/4.8 MB
Progress (1): 4.3/4.8 MB
Progress (1): 4.3/4.8 MB
Progress (1): 4.3/4.8 MB
Progress (1): 4.4/4.8 MB
Progress (1): 4.4/4.8 MB
Progress (1): 4.4/4.8 MB
Progress (1): 4.4/4.8 MB
Progress (1): 4.4/4.8 MB
Progress (1): 4.4/4.8 MB
Progress (1): 4.4/4.8 MB
Progress (1): 4.4/4.8 MB
Progress (1): 4.4/4.8 MB
Progress (1): 4.4/4.8 MB
Progress (1): 4.4/4.8 MB
Progress (1): 4.4/4.8 MB
Progress (1): 4.4/4.8 MB
Progress (1): 4.4/4.8 MB
Progress (1): 4.4/4.8 MB
Progress (1): 4.4/4.8 MB
Progress (1): 4.4/4.8 MB
Progress (1): 4.4/4.8 MB
Progress (1): 4.4/4.8 MB
Progress (1): 4.4/4.8 MB
Progress (1): 4.4/4.8 MB
Progress (1): 4.4/4.8 MB
Progress (1): 4.4/4.8 MB
Progress (1): 4.4/4.8 MB
Progress (1): 4.5/4.8 MB
Progress (1): 4.5/4.8 MB
Progress (1): 4.5/4.8 MB
Progress (1): 4.5/4.8 MB
Progress (1): 4.5/4.8 MB
Progress (1): 4.5/4.8 MB
Progress (1): 4.5/4.8 MB
Progress (1): 4.5/4.8 MB
Progress (1): 4.5/4.8 MB
Progress (1): 4.5/4.8 MB
Progress (1): 4.5/4.8 MB
Progress (1): 4.5/4.8 MB
Progress (1): 4.5/4.8 MB
Progress (1): 4.5/4.8 MB
Progress (1): 4.5/4.8 MB
Progress (1): 4.5/4.8 MB
Progress (1): 4.5/4.8 MB
Progress (1): 4.5/4.8 MB
Progress (1): 4.5/4.8 MB
Progress (1): 4.5/4.8 MB
Progress (1): 4.5/4.8 MB
Progress (1): 4.5/4.8 MB
Progress (1): 4.5/4.8 MB
Progress (1): 4.5/4.8 MB
Progress (1): 4.5/4.8 MB
Progress (1): 4.6/4.8 MB
Progress (1): 4.6/4.8 MB
Progress (1): 4.6/4.8 MB
Progress (1): 4.6/4.8 MB
Progress (1): 4.6/4.8 MB
Progress (1): 4.6/4.8 MB
Progress (1): 4.6/4.8 MB
Progress (1): 4.6/4.8 MB
Progress (1): 4.6/4.8 MB
Progress (1): 4.6/4.8 MB
Progress (1): 4.6/4.8 MB
Progress (1): 4.6/4.8 MB
Progress (1): 4.6/4.8 MB
Progress (1): 4.6/4.8 MB
Progress (1): 4.6/4.8 MB
Progress (1): 4.6/4.8 MB
Progress (1): 4.6/4.8 MB
Progress (1): 4.6/4.8 MB
Progress (1): 4.6/4.8 MB
Progress (1): 4.6/4.8 MB
Progress (1): 4.6/4.8 MB
Progress (1): 4.6/4.8 MB
Progress (1): 4.6/4.8 MB
Progress (1): 4.6/4.8 MB
Progress (1): 4.6/4.8 MB
Progress (1): 4.7/4.8 MB
Progress (1): 4.7/4.8 MB
Progress (1): 4.7/4.8 MB
Progress (1): 4.7/4.8 MB
Progress (1): 4.7/4.8 MB
Progress (1): 4.7/4.8 MB
Progress (1): 4.7/4.8 MB
Progress (1): 4.7/4.8 MB
Progress (1): 4.7/4.8 MB
Progress (1): 4.7/4.8 MB
Progress (1): 4.7/4.8 MB
Progress (1): 4.7/4.8 MB
Progress (1): 4.7/4.8 MB
Progress (1): 4.7/4.8 MB
Progress (1): 4.7/4.8 MB
Progress (1): 4.7/4.8 MB
Progress (1): 4.7/4.8 MB
Progress (1): 4.7/4.8 MB
Progress (1): 4.7/4.8 MB
Progress (1): 4.7/4.8 MB
Progress (1): 4.7/4.8 MB
Progress (1): 4.7/4.8 MB
Progress (1): 4.7/4.8 MB
Progress (1): 4.7/4.8 MB
Progress (1): 4.8/4.8 MB
Progress (1): 4.8/4.8 MB
Progress (1): 4.8/4.8 MB
Progress (1): 4.8/4.8 MB
Progress (1): 4.8/4.8 MB
Progress (1): 4.8/4.8 MB
Progress (1): 4.8/4.8 MB
Progress (1): 4.8/4.8 MB
Progress (1): 4.8/4.8 MB
Progress (1): 4.8 MB    
                    
Downloaded from central: https://repo.maven.apache.org/maven2/org/assertj/assertj-core/3.18.1/assertj-core-3.18.1.jar (4.8 MB at 10 MB/s)
[INFO] 
[INFO] --- maven-enforcer-plugin:1.4.1:enforce (enforce-java) @ rdfunit-commons ---
[INFO] 
[INFO] --- maven-enforcer-plugin:1.4.1:enforce (enforce-maven) @ rdfunit-commons ---
[INFO] 
[INFO] --- jacoco-maven-plugin:0.8.5:prepare-agent (prepare-agent) @ rdfunit-commons ---
[INFO] argLine set to "-javaagent:/usr/share/tomcat8/.m2/repository/org/jacoco/org.jacoco.agent/0.8.5/org.jacoco.agent-0.8.5-runtime.jar=destfile=/usr/share/tomcat8/.jenkins/jobs/RDFUnit - build deb packages/workspace/rdfunit-commons/target/jacoco.exec"
[INFO] 
[INFO] --- maven-resources-plugin:2.6:resources (default-resources) @ rdfunit-commons ---
[INFO] Using 'UTF-8' encoding to copy filtered resources.
[INFO] Copying 20 resources
[INFO] 
[INFO] --- maven-compiler-plugin:3.8.1:compile (default-compile) @ rdfunit-commons ---
[INFO] Changes detected - recompiling the module!
[INFO] Compiling 6 source files to /usr/share/tomcat8/.jenkins/jobs/RDFUnit - build deb packages/workspace/rdfunit-commons/target/classes
[INFO] 
[INFO] --- maven-resources-plugin:2.6:testResources (default-testResources) @ rdfunit-commons ---
[INFO] Using 'UTF-8' encoding to copy filtered resources.
[INFO] skip non existing resourceDirectory /usr/share/tomcat8/.jenkins/jobs/RDFUnit - build deb packages/workspace/rdfunit-commons/src/test/resources
[INFO] 
[INFO] --- maven-compiler-plugin:3.8.1:testCompile (default-testCompile) @ rdfunit-commons ---
[INFO] Changes detected - recompiling the module!
[INFO] Compiling 1 source file to /usr/share/tomcat8/.jenkins/jobs/RDFUnit - build deb packages/workspace/rdfunit-commons/target/test-classes
[INFO] 
[INFO] --- maven-surefire-plugin:2.22.2:test (default-test) @ rdfunit-commons ---
Downloading from central: https://repo1.maven.org/maven2/org/apache/maven/surefire/maven-surefire-common/2.22.2/maven-surefire-common-2.22.2.pom
Progress (1): 4.1/11 kB
Progress (1): 8.2/11 kB
Progress (1): 11 kB    
                   
Downloaded from central: https://repo1.maven.org/maven2/org/apache/maven/surefire/maven-surefire-common/2.22.2/maven-surefire-common-2.22.2.pom (11 kB at 286 kB/s)
Downloading from central: https://repo1.maven.org/maven2/org/apache/maven/surefire/surefire-api/2.22.2/surefire-api-2.22.2.pom
Progress (1): 3.5 kB
                    
Downloaded from central: https://repo1.maven.org/maven2/org/apache/maven/surefire/surefire-api/2.22.2/surefire-api-2.22.2.pom (3.5 kB at 101 kB/s)
Downloading from central: https://repo1.maven.org/maven2/org/apache/maven/surefire/surefire-logger-api/2.22.2/surefire-logger-api-2.22.2.pom
Progress (1): 2.0 kB
                    
Downloaded from central: https://repo1.maven.org/maven2/org/apache/maven/surefire/surefire-logger-api/2.22.2/surefire-logger-api-2.22.2.pom (2.0 kB at 61 kB/s)
Downloading from central: https://repo1.maven.org/maven2/org/apache/maven/surefire/surefire-booter/2.22.2/surefire-booter-2.22.2.pom
Progress (1): 4.1/7.5 kB
Progress (1): 7.5 kB    
                    
Downloaded from central: https://repo1.maven.org/maven2/org/apache/maven/surefire/surefire-booter/2.22.2/surefire-booter-2.22.2.pom (7.5 kB at 182 kB/s)
Downloading from central: https://repo1.maven.org/maven2/org/apache/maven/surefire/maven-surefire-common/2.22.2/maven-surefire-common-2.22.2.jar
Downloading from central: https://repo1.maven.org/maven2/org/apache/maven/surefire/surefire-api/2.22.2/surefire-api-2.22.2.jar
Downloading from central: https://repo1.maven.org/maven2/org/apache/maven/surefire/surefire-logger-api/2.22.2/surefire-logger-api-2.22.2.jar
Downloading from central: https://repo1.maven.org/maven2/org/apache/maven/surefire/surefire-booter/2.22.2/surefire-booter-2.22.2.jar
Progress (1): 4.1/528 kB
Progress (1): 8.2/528 kB
Progress (1): 12/528 kB 
Progress (1): 16/528 kB
Progress (2): 16/528 kB | 1.4/13 kB
Progress (2): 20/528 kB | 1.4/13 kB
Progress (2): 25/528 kB | 1.4/13 kB
Progress (2): 25/528 kB | 2.7/13 kB
Progress (2): 29/528 kB | 2.7/13 kB
Progress (2): 29/528 kB | 4.1/13 kB
Progress (2): 33/528 kB | 4.1/13 kB
Progress (2): 33/528 kB | 5.5/13 kB
Progress (3): 33/528 kB | 5.5/13 kB | 1.4/186 kB
Progress (3): 33/528 kB | 6.9/13 kB | 1.4/186 kB
Progress (3): 33/528 kB | 6.9/13 kB | 2.7/186 kB
Progress (3): 33/528 kB | 8.2/13 kB | 2.7/186 kB
Progress (3): 33/528 kB | 8.2/13 kB | 4.1/186 kB
Progress (3): 37/528 kB | 8.2/13 kB | 4.1/186 kB
Progress (3): 37/528 kB | 8.2/13 kB | 5.5/186 kB
Progress (3): 37/528 kB | 9.6/13 kB | 5.5/186 kB
Progress (3): 37/528 kB | 9.6/13 kB | 6.9/186 kB
Progress (3): 41/528 kB | 9.6/13 kB | 6.9/186 kB
Progress (3): 41/528 kB | 9.6/13 kB | 8.2/186 kB
Progress (3): 41/528 kB | 11/13 kB | 8.2/186 kB 
Progress (3): 41/528 kB | 11/13 kB | 9.6/186 kB
Progress (3): 45/528 kB | 11/13 kB | 9.6/186 kB
Progress (4): 45/528 kB | 11/13 kB | 9.6/186 kB | 4.1/274 kB
Progress (4): 45/528 kB | 11/13 kB | 11/186 kB | 4.1/274 kB 
Progress (4): 45/528 kB | 12/13 kB | 11/186 kB | 4.1/274 kB
Progress (4): 45/528 kB | 12/13 kB | 12/186 kB | 4.1/274 kB
Progress (4): 45/528 kB | 12/13 kB | 12/186 kB | 8.2/274 kB
Progress (4): 49/528 kB | 12/13 kB | 12/186 kB | 8.2/274 kB
Progress (4): 49/528 kB | 12/13 kB | 12/186 kB | 12/274 kB 
Progress (4): 49/528 kB | 12/13 kB | 14/186 kB | 12/274 kB
Progress (4): 49/528 kB | 13 kB | 14/186 kB | 12/274 kB   
Progress (4): 49/528 kB | 13 kB | 15/186 kB | 12/274 kB
Progress (4): 49/528 kB | 13 kB | 15/186 kB | 16/274 kB
Progress (4): 49/528 kB | 13 kB | 16/186 kB | 16/274 kB
Progress (4): 53/528 kB | 13 kB | 16/186 kB | 16/274 kB
Progress (4): 53/528 kB | 13 kB | 18/186 kB | 16/274 kB
Progress (4): 57/528 kB | 13 kB | 18/186 kB | 16/274 kB
Progress (4): 57/528 kB | 13 kB | 19/186 kB | 16/274 kB
Progress (4): 61/528 kB | 13 kB | 19/186 kB | 16/274 kB
Progress (4): 61/528 kB | 13 kB | 21/186 kB | 16/274 kB
Progress (4): 61/528 kB | 13 kB | 22/186 kB | 16/274 kB
Progress (4): 61/528 kB | 13 kB | 23/186 kB | 16/274 kB
Progress (4): 61/528 kB | 13 kB | 25/186 kB | 16/274 kB
Progress (4): 66/528 kB | 13 kB | 25/186 kB | 16/274 kB
Progress (4): 66/528 kB | 13 kB | 26/186 kB | 16/274 kB
Progress (4): 66/528 kB | 13 kB | 26/186 kB | 20/274 kB
Progress (4): 66/528 kB | 13 kB | 27/186 kB | 20/274 kB
Progress (4): 66/528 kB | 13 kB | 27/186 kB | 25/274 kB
Progress (4): 66/528 kB | 13 kB | 29/186 kB | 25/274 kB
Progress (4): 70/528 kB | 13 kB | 29/186 kB | 25/274 kB
Progress (4): 70/528 kB | 13 kB | 29/186 kB | 29/274 kB
Progress (4): 74/528 kB | 13 kB | 29/186 kB | 29/274 kB
Progress (4): 74/528 kB | 13 kB | 30/186 kB | 29/274 kB
Progress (4): 78/528 kB | 13 kB | 30/186 kB | 29/274 kB
Progress (4): 78/528 kB | 13 kB | 30/186 kB | 33/274 kB
Progress (4): 82/528 kB | 13 kB | 30/186 kB | 33/274 kB
Progress (4): 82/528 kB | 13 kB | 32/186 kB | 33/274 kB
Progress (4): 82/528 kB | 13 kB | 33/186 kB | 33/274 kB
Progress (4): 82/528 kB | 13 kB | 34/186 kB | 33/274 kB
Progress (4): 86/528 kB | 13 kB | 34/186 kB | 33/274 kB
Progress (4): 86/528 kB | 13 kB | 36/186 kB | 33/274 kB
Progress (4): 90/528 kB | 13 kB | 36/186 kB | 33/274 kB
Progress (4): 90/528 kB | 13 kB | 36/186 kB | 37/274 kB
Progress (4): 90/528 kB | 13 kB | 37/186 kB | 37/274 kB
Progress (4): 90/528 kB | 13 kB | 37/186 kB | 41/274 kB
Progress (4): 94/528 kB | 13 kB | 37/186 kB | 41/274 kB
Progress (4): 94/528 kB | 13 kB | 37/186 kB | 45/274 kB
Progress (4): 94/528 kB | 13 kB | 38/186 kB | 45/274 kB
Progress (4): 94/528 kB | 13 kB | 38/186 kB | 49/274 kB
Progress (4): 98/528 kB | 13 kB | 38/186 kB | 49/274 kB
Progress (4): 98/528 kB | 13 kB | 40/186 kB | 49/274 kB
Progress (4): 98/528 kB | 13 kB | 41/186 kB | 49/274 kB
Progress (4): 98/528 kB | 13 kB | 43/186 kB | 49/274 kB
Progress (4): 98/528 kB | 13 kB | 44/186 kB | 49/274 kB
Progress (4): 102/528 kB | 13 kB | 44/186 kB | 49/274 kB
Progress (4): 102/528 kB | 13 kB | 45/186 kB | 49/274 kB
Progress (4): 106/528 kB | 13 kB | 45/186 kB | 49/274 kB
Progress (4): 106/528 kB | 13 kB | 47/186 kB | 49/274 kB
Progress (4): 111/528 kB | 13 kB | 47/186 kB | 49/274 kB
Progress (4): 111/528 kB | 13 kB | 48/186 kB | 49/274 kB
Progress (4): 115/528 kB | 13 kB | 48/186 kB | 49/274 kB
Progress (4): 115/528 kB | 13 kB | 49/186 kB | 49/274 kB
Progress (4): 115/528 kB | 13 kB | 49/186 kB | 53/274 kB
Progress (4): 115/528 kB | 13 kB | 51/186 kB | 53/274 kB
Progress (4): 115/528 kB | 13 kB | 51/186 kB | 57/274 kB
Progress (4): 119/528 kB | 13 kB | 51/186 kB | 57/274 kB
Progress (4): 119/528 kB | 13 kB | 52/186 kB | 57/274 kB
Progress (4): 123/528 kB | 13 kB | 52/186 kB | 57/274 kB
Progress (4): 123/528 kB | 13 kB | 52/186 kB | 61/274 kB
Progress (4): 127/528 kB | 13 kB | 52/186 kB | 61/274 kB
Progress (4): 127/528 kB | 13 kB | 53/186 kB | 61/274 kB
Progress (4): 131/528 kB | 13 kB | 53/186 kB | 61/274 kB
Progress (4): 131/528 kB | 13 kB | 53/186 kB | 66/274 kB
Progress (4): 131/528 kB | 13 kB | 55/186 kB | 66/274 kB
Progress (4): 131/528 kB | 13 kB | 56/186 kB | 66/274 kB
Progress (4): 131/528 kB | 13 kB | 58/186 kB | 66/274 kB
Progress (4): 135/528 kB | 13 kB | 58/186 kB | 66/274 kB
Progress (4): 135/528 kB | 13 kB | 59/186 kB | 66/274 kB
Progress (4): 135/528 kB | 13 kB | 59/186 kB | 70/274 kB
Progress (4): 139/528 kB | 13 kB | 59/186 kB | 70/274 kB
Progress (4): 139/528 kB | 13 kB | 59/186 kB | 74/274 kB
Progress (4): 139/528 kB | 13 kB | 60/186 kB | 74/274 kB
Progress (4): 139/528 kB | 13 kB | 60/186 kB | 78/274 kB
Progress (4): 143/528 kB | 13 kB | 60/186 kB | 78/274 kB
Progress (4): 143/528 kB | 13 kB | 60/186 kB | 82/274 kB
Progress (4): 143/528 kB | 13 kB | 62/186 kB | 82/274 kB
Progress (4): 147/528 kB | 13 kB | 62/186 kB | 82/274 kB
Progress (4): 147/528 kB | 13 kB | 63/186 kB | 82/274 kB
Progress (4): 147/528 kB | 13 kB | 64/186 kB | 82/274 kB
Progress (4): 147/528 kB | 13 kB | 66/186 kB | 82/274 kB
Progress (4): 152/528 kB | 13 kB | 66/186 kB | 82/274 kB
Progress (4): 152/528 kB | 13 kB | 67/186 kB | 82/274 kB
Progress (4): 156/528 kB | 13 kB | 67/186 kB | 82/274 kB
Progress (4): 156/528 kB | 13 kB | 69/186 kB | 82/274 kB
Progress (4): 156/528 kB | 13 kB | 70/186 kB | 82/274 kB
Progress (4): 156/528 kB | 13 kB | 71/186 kB | 82/274 kB
Progress (4): 156/528 kB | 13 kB | 71/186 kB | 86/274 kB
                                                        
Downloaded from central: https://repo1.maven.org/maven2/org/apache/maven/surefire/surefire-logger-api/2.22.2/surefire-logger-api-2.22.2.jar (13 kB at 310 kB/s)
Progress (3): 160/528 kB | 71/186 kB | 86/274 kB
Progress (3): 160/528 kB | 71/186 kB | 90/274 kB
Progress (3): 160/528 kB | 73/186 kB | 90/274 kB
Progress (3): 160/528 kB | 73/186 kB | 94/274 kB
Progress (3): 160/528 kB | 74/186 kB | 94/274 kB
Progress (3): 164/528 kB | 74/186 kB | 94/274 kB
Progress (3): 164/528 kB | 75/186 kB | 94/274 kB
Progress (3): 164/528 kB | 75/186 kB | 98/274 kB
Progress (3): 164/528 kB | 77/186 kB | 98/274 kB
Progress (3): 164/528 kB | 78/186 kB | 98/274 kB
Progress (3): 168/528 kB | 78/186 kB | 98/274 kB
Progress (3): 168/528 kB | 80/186 kB | 98/274 kB
Progress (3): 172/528 kB | 80/186 kB | 98/274 kB
Progress (3): 172/528 kB | 81/186 kB | 98/274 kB
Progress (3): 172/528 kB | 81/186 kB | 102/274 kB
Progress (3): 172/528 kB | 82/186 kB | 102/274 kB
Progress (3): 176/528 kB | 82/186 kB | 102/274 kB
Progress (3): 176/528 kB | 84/186 kB | 102/274 kB
Progress (3): 180/528 kB | 84/186 kB | 102/274 kB
Progress (3): 180/528 kB | 84/186 kB | 106/274 kB
Progress (3): 180/528 kB | 85/186 kB | 106/274 kB
Progress (3): 180/528 kB | 85/186 kB | 111/274 kB
Progress (3): 180/528 kB | 86/186 kB | 111/274 kB
Progress (3): 180/528 kB | 86/186 kB | 115/274 kB
Progress (3): 180/528 kB | 88/186 kB | 115/274 kB
Progress (3): 184/528 kB | 88/186 kB | 115/274 kB
Progress (3): 184/528 kB | 89/186 kB | 115/274 kB
Progress (3): 188/528 kB | 89/186 kB | 115/274 kB
Progress (3): 188/528 kB | 90/186 kB | 115/274 kB
Progress (3): 188/528 kB | 90/186 kB | 119/274 kB
Progress (3): 193/528 kB | 90/186 kB | 119/274 kB
Progress (3): 193/528 kB | 90/186 kB | 123/274 kB
Progress (3): 193/528 kB | 92/186 kB | 123/274 kB
Progress (3): 193/528 kB | 92/186 kB | 127/274 kB
Progress (3): 197/528 kB | 92/186 kB | 127/274 kB
Progress (3): 197/528 kB | 92/186 kB | 131/274 kB
Progress (3): 197/528 kB | 93/186 kB | 131/274 kB
Progress (3): 201/528 kB | 93/186 kB | 131/274 kB
Progress (3): 201/528 kB | 95/186 kB | 131/274 kB
Progress (3): 201/528 kB | 95/186 kB | 135/274 kB
Progress (3): 201/528 kB | 96/186 kB | 135/274 kB
Progress (3): 205/528 kB | 96/186 kB | 135/274 kB
Progress (3): 205/528 kB | 97/186 kB | 135/274 kB
Progress (3): 205/528 kB | 97/186 kB | 139/274 kB
Progress (3): 205/528 kB | 99/186 kB | 139/274 kB
Progress (3): 209/528 kB | 99/186 kB | 139/274 kB
Progress (3): 209/528 kB | 100/186 kB | 139/274 kB
Progress (3): 209/528 kB | 100/186 kB | 143/274 kB
Progress (3): 209/528 kB | 101/186 kB | 143/274 kB
Progress (3): 213/528 kB | 101/186 kB | 143/274 kB
Progress (3): 213/528 kB | 103/186 kB | 143/274 kB
Progress (3): 213/528 kB | 103/186 kB | 147/274 kB
Progress (3): 213/528 kB | 104/186 kB | 147/274 kB
Progress (3): 217/528 kB | 104/186 kB | 147/274 kB
Progress (3): 217/528 kB | 106/186 kB | 147/274 kB
Progress (3): 221/528 kB | 106/186 kB | 147/274 kB
Progress (3): 221/528 kB | 107/186 kB | 147/274 kB
Progress (3): 225/528 kB | 107/186 kB | 147/274 kB
Progress (3): 225/528 kB | 108/186 kB | 147/274 kB
Progress (3): 229/528 kB | 108/186 kB | 147/274 kB
Progress (3): 229/528 kB | 110/186 kB | 147/274 kB
Progress (3): 233/528 kB | 110/186 kB | 147/274 kB
Progress (3): 233/528 kB | 111/186 kB | 147/274 kB
Progress (3): 238/528 kB | 111/186 kB | 147/274 kB
Progress (3): 238/528 kB | 112/186 kB | 147/274 kB
Progress (3): 242/528 kB | 112/186 kB | 147/274 kB
Progress (3): 242/528 kB | 112/186 kB | 152/274 kB
Progress (3): 242/528 kB | 114/186 kB | 152/274 kB
Progress (3): 242/528 kB | 114/186 kB | 156/274 kB
Progress (3): 246/528 kB | 114/186 kB | 156/274 kB
Progress (3): 246/528 kB | 114/186 kB | 160/274 kB
Progress (3): 250/528 kB | 114/186 kB | 160/274 kB
Progress (3): 250/528 kB | 115/186 kB | 160/274 kB
Progress (3): 254/528 kB | 115/186 kB | 160/274 kB
Progress (3): 254/528 kB | 115/186 kB | 164/274 kB
Progress (3): 255/528 kB | 115/186 kB | 164/274 kB
Progress (3): 255/528 kB | 117/186 kB | 164/274 kB
Progress (3): 259/528 kB | 117/186 kB | 164/274 kB
Progress (3): 259/528 kB | 118/186 kB | 164/274 kB
Progress (3): 263/528 kB | 118/186 kB | 164/274 kB
Progress (3): 263/528 kB | 119/186 kB | 164/274 kB
Progress (3): 268/528 kB | 119/186 kB | 164/274 kB
Progress (3): 268/528 kB | 121/186 kB | 164/274 kB
Progress (3): 272/528 kB | 121/186 kB | 164/274 kB
Progress (3): 272/528 kB | 122/186 kB | 164/274 kB
Progress (3): 276/528 kB | 122/186 kB | 164/274 kB
Progress (3): 276/528 kB | 122/186 kB | 168/274 kB
Progress (3): 280/528 kB | 122/186 kB | 168/274 kB
Progress (3): 280/528 kB | 123/186 kB | 168/274 kB
Progress (3): 284/528 kB | 123/186 kB | 168/274 kB
Progress (3): 284/528 kB | 123/186 kB | 172/274 kB
Progress (3): 288/528 kB | 123/186 kB | 172/274 kB
Progress (3): 288/528 kB | 125/186 kB | 172/274 kB
Progress (3): 292/528 kB | 125/186 kB | 172/274 kB
Progress (3): 292/528 kB | 125/186 kB | 176/274 kB
Progress (3): 296/528 kB | 125/186 kB | 176/274 kB
Progress (3): 296/528 kB | 126/186 kB | 176/274 kB
Progress (3): 300/528 kB | 126/186 kB | 176/274 kB
Progress (3): 300/528 kB | 126/186 kB | 180/274 kB
Progress (3): 304/528 kB | 126/186 kB | 180/274 kB
Progress (3): 304/528 kB | 128/186 kB | 180/274 kB
Progress (3): 309/528 kB | 128/186 kB | 180/274 kB
Progress (3): 309/528 kB | 129/186 kB | 180/274 kB
Progress (3): 313/528 kB | 129/186 kB | 180/274 kB
Progress (3): 313/528 kB | 130/186 kB | 180/274 kB
Progress (3): 313/528 kB | 130/186 kB | 184/274 kB
Progress (3): 317/528 kB | 130/186 kB | 184/274 kB
Progress (3): 317/528 kB | 130/186 kB | 188/274 kB
Progress (3): 317/528 kB | 132/186 kB | 188/274 kB
Progress (3): 317/528 kB | 132/186 kB | 193/274 kB
Progress (3): 321/528 kB | 132/186 kB | 193/274 kB
Progress (3): 321/528 kB | 132/186 kB | 197/274 kB
Progress (3): 321/528 kB | 133/186 kB | 197/274 kB
Progress (3): 325/528 kB | 133/186 kB | 197/274 kB
Progress (3): 325/528 kB | 134/186 kB | 197/274 kB
Progress (3): 329/528 kB | 134/186 kB | 197/274 kB
Progress (3): 329/528 kB | 136/186 kB | 197/274 kB
Progress (3): 333/528 kB | 136/186 kB | 197/274 kB
Progress (3): 333/528 kB | 137/186 kB | 197/274 kB
Progress (3): 337/528 kB | 137/186 kB | 197/274 kB
Progress (3): 337/528 kB | 138/186 kB | 197/274 kB
Progress (3): 341/528 kB | 138/186 kB | 197/274 kB
Progress (3): 341/528 kB | 140/186 kB | 197/274 kB
Progress (3): 341/528 kB | 140/186 kB | 201/274 kB
Progress (3): 345/528 kB | 140/186 kB | 201/274 kB
Progress (3): 345/528 kB | 140/186 kB | 205/274 kB
Progress (3): 345/528 kB | 141/186 kB | 205/274 kB
Progress (3): 345/528 kB | 141/186 kB | 209/274 kB
Progress (3): 349/528 kB | 141/186 kB | 209/274 kB
Progress (3): 349/528 kB | 141/186 kB | 213/274 kB
Progress (3): 349/528 kB | 143/186 kB | 213/274 kB
Progress (3): 354/528 kB | 143/186 kB | 213/274 kB
Progress (3): 354/528 kB | 144/186 kB | 213/274 kB
Progress (3): 358/528 kB | 144/186 kB | 213/274 kB
Progress (3): 358/528 kB | 145/186 kB | 213/274 kB
Progress (3): 362/528 kB | 145/186 kB | 213/274 kB
Progress (3): 362/528 kB | 147/186 kB | 213/274 kB
Progress (3): 366/528 kB | 147/186 kB | 213/274 kB
Progress (3): 366/528 kB | 148/186 kB | 213/274 kB
Progress (3): 370/528 kB | 148/186 kB | 213/274 kB
Progress (3): 370/528 kB | 149/186 kB | 213/274 kB
Progress (3): 374/528 kB | 149/186 kB | 213/274 kB
Progress (3): 374/528 kB | 151/186 kB | 213/274 kB
Progress (3): 374/528 kB | 151/186 kB | 217/274 kB
Progress (3): 378/528 kB | 151/186 kB | 217/274 kB
Progress (3): 378/528 kB | 151/186 kB | 221/274 kB
Progress (3): 378/528 kB | 152/186 kB | 221/274 kB
Progress (3): 378/528 kB | 152/186 kB | 225/274 kB
Progress (3): 382/528 kB | 152/186 kB | 225/274 kB
Progress (3): 382/528 kB | 152/186 kB | 229/274 kB
Progress (3): 382/528 kB | 154/186 kB | 229/274 kB
Progress (3): 386/528 kB | 154/186 kB | 229/274 kB
Progress (3): 386/528 kB | 155/186 kB | 229/274 kB
Progress (3): 390/528 kB | 155/186 kB | 229/274 kB
Progress (3): 390/528 kB | 156/186 kB | 229/274 kB
Progress (3): 395/528 kB | 156/186 kB | 229/274 kB
Progress (3): 395/528 kB | 158/186 kB | 229/274 kB
Progress (3): 399/528 kB | 158/186 kB | 229/274 kB
Progress (3): 399/528 kB | 159/186 kB | 229/274 kB
Progress (3): 403/528 kB | 159/186 kB | 229/274 kB
Progress (3): 403/528 kB | 160/186 kB | 229/274 kB
Progress (3): 407/528 kB | 160/186 kB | 229/274 kB
Progress (3): 407/528 kB | 162/186 kB | 229/274 kB
Progress (3): 411/528 kB | 162/186 kB | 229/274 kB
Progress (3): 411/528 kB | 163/186 kB | 229/274 kB
Progress (3): 415/528 kB | 163/186 kB | 229/274 kB
Progress (3): 415/528 kB | 165/186 kB | 229/274 kB
Progress (3): 419/528 kB | 165/186 kB | 229/274 kB
Progress (3): 419/528 kB | 166/186 kB | 229/274 kB
Progress (3): 423/528 kB | 166/186 kB | 229/274 kB
Progress (3): 423/528 kB | 167/186 kB | 229/274 kB
Progress (3): 423/528 kB | 167/186 kB | 233/274 kB
Progress (3): 423/528 kB | 169/186 kB | 233/274 kB
Progress (3): 427/528 kB | 169/186 kB | 233/274 kB
Progress (3): 427/528 kB | 170/186 kB | 233/274 kB
Progress (3): 427/528 kB | 170/186 kB | 238/274 kB
Progress (3): 427/528 kB | 171/186 kB | 238/274 kB
Progress (3): 431/528 kB | 171/186 kB | 238/274 kB
Progress (3): 431/528 kB | 173/186 kB | 238/274 kB
Progress (3): 431/528 kB | 174/186 kB | 238/274 kB
Progress (3): 431/528 kB | 174/186 kB | 242/274 kB
Progress (3): 431/528 kB | 175/186 kB | 242/274 kB
Progress (3): 435/528 kB | 175/186 kB | 242/274 kB
Progress (3): 435/528 kB | 177/186 kB | 242/274 kB
Progress (3): 440/528 kB | 177/186 kB | 242/274 kB
Progress (3): 440/528 kB | 177/186 kB | 246/274 kB
Progress (3): 444/528 kB | 177/186 kB | 246/274 kB
Progress (3): 444/528 kB | 178/186 kB | 246/274 kB
Progress (3): 444/528 kB | 178/186 kB | 250/274 kB
Progress (3): 448/528 kB | 178/186 kB | 250/274 kB
Progress (3): 448/528 kB | 178/186 kB | 254/274 kB
Progress (3): 448/528 kB | 180/186 kB | 254/274 kB
Progress (3): 448/528 kB | 180/186 kB | 258/274 kB
Progress (3): 452/528 kB | 180/186 kB | 258/274 kB
Progress (3): 452/528 kB | 181/186 kB | 258/274 kB
Progress (3): 456/528 kB | 181/186 kB | 258/274 kB
Progress (3): 456/528 kB | 181/186 kB | 262/274 kB
Progress (3): 460/528 kB | 181/186 kB | 262/274 kB
Progress (3): 460/528 kB | 182/186 kB | 262/274 kB
Progress (3): 464/528 kB | 182/186 kB | 262/274 kB
Progress (3): 464/528 kB | 184/186 kB | 262/274 kB
Progress (3): 464/528 kB | 184/186 kB | 266/274 kB
Progress (3): 468/528 kB | 184/186 kB | 266/274 kB
Progress (3): 468/528 kB | 184/186 kB | 270/274 kB
Progress (3): 468/528 kB | 185/186 kB | 270/274 kB
Progress (3): 468/528 kB | 185/186 kB | 274 kB    
Progress (3): 472/528 kB | 185/186 kB | 274 kB
Progress (3): 472/528 kB | 186 kB | 274 kB    
Progress (3): 475/528 kB | 186 kB | 274 kB
Progress (3): 479/528 kB | 186 kB | 274 kB
Progress (3): 483/528 kB | 186 kB | 274 kB
Progress (3): 487/528 kB | 186 kB | 274 kB
Progress (3): 491/528 kB | 186 kB | 274 kB
Progress (3): 495/528 kB | 186 kB | 274 kB
Progress (3): 499/528 kB | 186 kB | 274 kB
Progress (3): 503/528 kB | 186 kB | 274 kB
Progress (3): 507/528 kB | 186 kB | 274 kB
Progress (3): 511/528 kB | 186 kB | 274 kB
Progress (3): 515/528 kB | 186 kB | 274 kB
Progress (3): 520/528 kB | 186 kB | 274 kB
Progress (3): 524/528 kB | 186 kB | 274 kB
Progress (3): 528/528 kB | 186 kB | 274 kB
Progress (3): 528 kB | 186 kB | 274 kB    
                                      
Downloaded from central: https://repo1.maven.org/maven2/org/apache/maven/surefire/surefire-booter/2.22.2/surefire-booter-2.22.2.jar (274 kB at 3.0 MB/s)
Downloaded from central: https://repo1.maven.org/maven2/org/apache/maven/surefire/surefire-api/2.22.2/surefire-api-2.22.2.jar (186 kB at 2.0 MB/s)
Downloaded from central: https://repo1.maven.org/maven2/org/apache/maven/surefire/maven-surefire-common/2.22.2/maven-surefire-common-2.22.2.jar (528 kB at 5.6 MB/s)
Downloading from central: https://repo1.maven.org/maven2/org/apache/maven/surefire/surefire-junit4/2.22.2/surefire-junit4-2.22.2.pom
Progress (1): 3.1 kB
                    
Downloaded from central: https://repo1.maven.org/maven2/org/apache/maven/surefire/surefire-junit4/2.22.2/surefire-junit4-2.22.2.pom (3.1 kB at 18 kB/s)
Downloading from central: https://repo1.maven.org/maven2/org/apache/maven/surefire/surefire-providers/2.22.2/surefire-providers-2.22.2.pom
Progress (1): 2.5 kB
                    
Downloaded from central: https://repo1.maven.org/maven2/org/apache/maven/surefire/surefire-providers/2.22.2/surefire-providers-2.22.2.pom (2.5 kB at 71 kB/s)
Downloading from central: https://repo1.maven.org/maven2/org/apache/maven/surefire/surefire-junit4/2.22.2/surefire-junit4-2.22.2.jar
Progress (1): 4.1/85 kB
Progress (1): 8.2/85 kB
Progress (1): 12/85 kB 
Progress (1): 16/85 kB
Progress (1): 20/85 kB
Progress (1): 25/85 kB
Progress (1): 29/85 kB
Progress (1): 33/85 kB
Progress (1): 37/85 kB
Progress (1): 41/85 kB
Progress (1): 45/85 kB
Progress (1): 49/85 kB
Progress (1): 53/85 kB
Progress (1): 57/85 kB
Progress (1): 61/85 kB
Progress (1): 66/85 kB
Progress (1): 70/85 kB
Progress (1): 74/85 kB
Progress (1): 78/85 kB
Progress (1): 82/85 kB
Progress (1): 85 kB   
                   
Downloaded from central: https://repo1.maven.org/maven2/org/apache/maven/surefire/surefire-junit4/2.22.2/surefire-junit4-2.22.2.jar (85 kB at 1.6 MB/s)
[INFO] 
[INFO] -------------------------------------------------------
[INFO]  T E S T S
[INFO] -------------------------------------------------------
[INFO] Running org.aksw.rdfunit.services.PrefixNSServiceTest
log4j:WARN No appenders could be found for logger (org.apache.jena.util.FileManager).
log4j:WARN Please initialize the log4j system properly.
log4j:WARN See http://logging.apache.org/log4j/1.2/faq.html#noconfig for more info.
[INFO] Tests run: 1, Failures: 0, Errors: 0, Skipped: 0, Time elapsed: 9.424 s - in org.aksw.rdfunit.services.PrefixNSServiceTest
[INFO] 
[INFO] Results:
[INFO] 
[INFO] Tests run: 1, Failures: 0, Errors: 0, Skipped: 0
[INFO] 
[INFO] 
[INFO] --- maven-jar-plugin:2.4:jar (default-jar) @ rdfunit-commons ---
[INFO] Building jar: /usr/share/tomcat8/.jenkins/jobs/RDFUnit - build deb packages/workspace/rdfunit-commons/target/rdfunit-commons-0.8.22-SNAPSHOT.jar
[INFO] 
[INFO] --- maven-install-plugin:2.4:install (default-install) @ rdfunit-commons ---
[INFO] Installing /usr/share/tomcat8/.jenkins/jobs/RDFUnit - build deb packages/workspace/rdfunit-commons/target/rdfunit-commons-0.8.22-SNAPSHOT.jar to /usr/share/tomcat8/.m2/repository/org/aksw/rdfunit/rdfunit-commons/0.8.22-SNAPSHOT/rdfunit-commons-0.8.22-SNAPSHOT.jar
[INFO] Installing /usr/share/tomcat8/.jenkins/jobs/RDFUnit - build deb packages/workspace/rdfunit-commons/pom.xml to /usr/share/tomcat8/.m2/repository/org/aksw/rdfunit/rdfunit-commons/0.8.22-SNAPSHOT/rdfunit-commons-0.8.22-SNAPSHOT.pom
[INFO] 
[INFO] --------------------< org.aksw.rdfunit:rdfunit-io >---------------------
[INFO] Building RDFUnit - IO 0.8.22-SNAPSHOT                              [3/7]
[INFO] --------------------------------[ jar ]---------------------------------
[INFO] 
[INFO] --- maven-enforcer-plugin:1.4.1:enforce (enforce-java) @ rdfunit-io ---
[INFO] 
[INFO] --- maven-enforcer-plugin:1.4.1:enforce (enforce-maven) @ rdfunit-io ---
[INFO] 
[INFO] --- jacoco-maven-plugin:0.8.5:prepare-agent (prepare-agent) @ rdfunit-io ---
[INFO] argLine set to "-javaagent:/usr/share/tomcat8/.m2/repository/org/jacoco/org.jacoco.agent/0.8.5/org.jacoco.agent-0.8.5-runtime.jar=destfile=/usr/share/tomcat8/.jenkins/jobs/RDFUnit - build deb packages/workspace/rdfunit-io/target/jacoco.exec"
[INFO] 
[INFO] --- maven-resources-plugin:2.6:resources (default-resources) @ rdfunit-io ---
[INFO] Using 'UTF-8' encoding to copy filtered resources.
[INFO] skip non existing resourceDirectory /usr/share/tomcat8/.jenkins/jobs/RDFUnit - build deb packages/workspace/rdfunit-io/src/main/resources
[INFO] 
[INFO] --- maven-compiler-plugin:3.8.1:compile (default-compile) @ rdfunit-io ---
[INFO] Changes detected - recompiling the module!
[INFO] Compiling 24 source files to /usr/share/tomcat8/.jenkins/jobs/RDFUnit - build deb packages/workspace/rdfunit-io/target/classes
[INFO] 
[INFO] --- maven-resources-plugin:2.6:testResources (default-testResources) @ rdfunit-io ---
[INFO] Using 'UTF-8' encoding to copy filtered resources.
[INFO] Copying 7 resources
[INFO] 
[INFO] --- maven-compiler-plugin:3.8.1:testCompile (default-testCompile) @ rdfunit-io ---
[INFO] Changes detected - recompiling the module!
[INFO] Compiling 6 source files to /usr/share/tomcat8/.jenkins/jobs/RDFUnit - build deb packages/workspace/rdfunit-io/target/test-classes
[INFO] 
[INFO] --- maven-surefire-plugin:2.22.2:test (default-test) @ rdfunit-io ---
[INFO] 
[INFO] -------------------------------------------------------
[INFO]  T E S T S
[INFO] -------------------------------------------------------
[INFO] Running org.aksw.rdfunit.io.reader.RdfFirstSuccessReaderTest
log4j:WARN No appenders could be found for logger (org.aksw.rdfunit.io.reader.RdfStreamReader).
log4j:WARN Please initialize the log4j system properly.
log4j:WARN See http://logging.apache.org/log4j/1.2/faq.html#noconfig for more info.
[INFO] Tests run: 4, Failures: 0, Errors: 0, Skipped: 0, Time elapsed: 1.737 s - in org.aksw.rdfunit.io.reader.RdfFirstSuccessReaderTest
[INFO] Running org.aksw.rdfunit.io.reader.RdfStreamReaderDatasetTest
[INFO] Tests run: 2, Failures: 0, Errors: 0, Skipped: 0, Time elapsed: 0.055 s - in org.aksw.rdfunit.io.reader.RdfStreamReaderDatasetTest
[INFO] Running org.aksw.rdfunit.io.reader.RdfReaderFactoryTest
[INFO] Tests run: 1, Failures: 0, Errors: 0, Skipped: 0, Time elapsed: 0.157 s - in org.aksw.rdfunit.io.reader.RdfReaderFactoryTest
[INFO] Running org.aksw.rdfunit.io.reader.RdfStreamReaderTest
[INFO] Tests run: 6, Failures: 0, Errors: 0, Skipped: 0, Time elapsed: 0.085 s - in org.aksw.rdfunit.io.reader.RdfStreamReaderTest
[INFO] Running org.aksw.rdfunit.io.format.FormatServiceTest
[INFO] Tests run: 3, Failures: 0, Errors: 0, Skipped: 0, Time elapsed: 0.001 s - in org.aksw.rdfunit.io.format.FormatServiceTest
[INFO] 
[INFO] Results:
[INFO] 
[INFO] Tests run: 16, Failures: 0, Errors: 0, Skipped: 0
[INFO] 
[INFO] 
[INFO] --- maven-jar-plugin:2.4:jar (default-jar) @ rdfunit-io ---
[INFO] Building jar: /usr/share/tomcat8/.jenkins/jobs/RDFUnit - build deb packages/workspace/rdfunit-io/target/rdfunit-io-0.8.22-SNAPSHOT.jar
[INFO] 
[INFO] --- maven-install-plugin:2.4:install (default-install) @ rdfunit-io ---
[INFO] Installing /usr/share/tomcat8/.jenkins/jobs/RDFUnit - build deb packages/workspace/rdfunit-io/target/rdfunit-io-0.8.22-SNAPSHOT.jar to /usr/share/tomcat8/.m2/repository/org/aksw/rdfunit/rdfunit-io/0.8.22-SNAPSHOT/rdfunit-io-0.8.22-SNAPSHOT.jar
[INFO] Installing /usr/share/tomcat8/.jenkins/jobs/RDFUnit - build deb packages/workspace/rdfunit-io/pom.xml to /usr/share/tomcat8/.m2/repository/org/aksw/rdfunit/rdfunit-io/0.8.22-SNAPSHOT/rdfunit-io-0.8.22-SNAPSHOT.pom
[INFO] 
[INFO] ---------------< org.aksw.rdfunit:rdfunit-manual-tests >----------------
[INFO] Building RDFUnit - Manual Tests 0.8.22-SNAPSHOT                    [4/7]
[INFO] --------------------------------[ jar ]---------------------------------
[INFO] 
[INFO] --- maven-enforcer-plugin:1.4.1:enforce (enforce-java) @ rdfunit-manual-tests ---
[INFO] 
[INFO] --- maven-enforcer-plugin:1.4.1:enforce (enforce-maven) @ rdfunit-manual-tests ---
[INFO] 
[INFO] --- jacoco-maven-plugin:0.8.5:prepare-agent (prepare-agent) @ rdfunit-manual-tests ---
[INFO] argLine set to "-javaagent:/usr/share/tomcat8/.m2/repository/org/jacoco/org.jacoco.agent/0.8.5/org.jacoco.agent-0.8.5-runtime.jar=destfile=/usr/share/tomcat8/.jenkins/jobs/RDFUnit - build deb packages/workspace/rdfunit-manual-tests/target/jacoco.exec"
[INFO] 
[INFO] --- maven-resources-plugin:2.6:resources (default-resources) @ rdfunit-manual-tests ---
[INFO] Using 'UTF-8' encoding to copy filtered resources.
[INFO] Copying 9 resources
[INFO] 
[INFO] --- maven-compiler-plugin:3.8.1:compile (default-compile) @ rdfunit-manual-tests ---
[INFO] Changes detected - recompiling the module!
[INFO] Compiling 1 source file to /usr/share/tomcat8/.jenkins/jobs/RDFUnit - build deb packages/workspace/rdfunit-manual-tests/target/classes
[INFO] 
[INFO] --- maven-resources-plugin:2.6:testResources (default-testResources) @ rdfunit-manual-tests ---
[INFO] Using 'UTF-8' encoding to copy filtered resources.
[INFO] skip non existing resourceDirectory /usr/share/tomcat8/.jenkins/jobs/RDFUnit - build deb packages/workspace/rdfunit-manual-tests/src/test/resources
[INFO] 
[INFO] --- maven-compiler-plugin:3.8.1:testCompile (default-testCompile) @ rdfunit-manual-tests ---
[INFO] No sources to compile
[INFO] 
[INFO] --- maven-surefire-plugin:2.22.2:test (default-test) @ rdfunit-manual-tests ---
[INFO] No tests to run.
[INFO] 
[INFO] --- maven-jar-plugin:2.4:jar (default-jar) @ rdfunit-manual-tests ---
[INFO] Building jar: /usr/share/tomcat8/.jenkins/jobs/RDFUnit - build deb packages/workspace/rdfunit-manual-tests/target/rdfunit-manual-tests-0.8.22-SNAPSHOT.jar
[INFO] 
[INFO] --- maven-install-plugin:2.4:install (default-install) @ rdfunit-manual-tests ---
[INFO] Installing /usr/share/tomcat8/.jenkins/jobs/RDFUnit - build deb packages/workspace/rdfunit-manual-tests/target/rdfunit-manual-tests-0.8.22-SNAPSHOT.jar to /usr/share/tomcat8/.m2/repository/org/aksw/rdfunit/rdfunit-manual-tests/0.8.22-SNAPSHOT/rdfunit-manual-tests-0.8.22-SNAPSHOT.jar
[INFO] Installing /usr/share/tomcat8/.jenkins/jobs/RDFUnit - build deb packages/workspace/rdfunit-manual-tests/pom.xml to /usr/share/tomcat8/.m2/repository/org/aksw/rdfunit/rdfunit-manual-tests/0.8.22-SNAPSHOT/rdfunit-manual-tests-0.8.22-SNAPSHOT.pom
[INFO] 
[INFO] -------------------< org.aksw.rdfunit:rdfunit-model >-------------------
[INFO] Building RDFUnit - Model 0.8.22-SNAPSHOT                           [5/7]
[INFO] --------------------------------[ jar ]---------------------------------
[INFO] 
[INFO] --- maven-enforcer-plugin:1.4.1:enforce (enforce-java) @ rdfunit-model ---
[INFO] 
[INFO] --- maven-enforcer-plugin:1.4.1:enforce (enforce-maven) @ rdfunit-model ---
[INFO] 
[INFO] --- jacoco-maven-plugin:0.8.5:prepare-agent (prepare-agent) @ rdfunit-model ---
[INFO] argLine set to "-javaagent:/usr/share/tomcat8/.m2/repository/org/jacoco/org.jacoco.agent/0.8.5/org.jacoco.agent-0.8.5-runtime.jar=destfile=/usr/share/tomcat8/.jenkins/jobs/RDFUnit - build deb packages/workspace/rdfunit-model/target/jacoco.exec"
[INFO] 
[INFO] --- maven-resources-plugin:2.6:resources (default-resources) @ rdfunit-model ---
[INFO] Using 'UTF-8' encoding to copy filtered resources.
[INFO] skip non existing resourceDirectory /usr/share/tomcat8/.jenkins/jobs/RDFUnit - build deb packages/workspace/rdfunit-model/src/main/resources
[INFO] 
[INFO] --- maven-compiler-plugin:3.8.1:compile (default-compile) @ rdfunit-model ---
[INFO] Changes detected - recompiling the module!
[INFO] Compiling 139 source files to /usr/share/tomcat8/.jenkins/jobs/RDFUnit - build deb packages/workspace/rdfunit-model/target/classes
[INFO] /usr/share/tomcat8/.jenkins/jobs/RDFUnit - build deb packages/workspace/rdfunit-model/src/main/java/org/aksw/rdfunit/RDFUnit.java: /usr/share/tomcat8/.jenkins/jobs/RDFUnit - build deb packages/workspace/rdfunit-model/src/main/java/org/aksw/rdfunit/RDFUnit.java uses unchecked or unsafe operations.
[INFO] /usr/share/tomcat8/.jenkins/jobs/RDFUnit - build deb packages/workspace/rdfunit-model/src/main/java/org/aksw/rdfunit/RDFUnit.java: Recompile with -Xlint:unchecked for details.
[INFO] 
[INFO] --- maven-resources-plugin:2.6:testResources (default-testResources) @ rdfunit-model ---
[INFO] Using 'UTF-8' encoding to copy filtered resources.
[INFO] Copying 9 resources
[INFO] 
[INFO] --- maven-compiler-plugin:3.8.1:testCompile (default-testCompile) @ rdfunit-model ---
[INFO] Changes detected - recompiling the module!
[INFO] Compiling 27 source files to /usr/share/tomcat8/.jenkins/jobs/RDFUnit - build deb packages/workspace/rdfunit-model/target/test-classes
[INFO] 
[INFO] --- maven-surefire-plugin:2.22.2:test (default-test) @ rdfunit-model ---
[INFO] 
[INFO] -------------------------------------------------------
[INFO]  T E S T S
[INFO] -------------------------------------------------------
[INFO] Running org.aksw.rdfunit.model.impl.shacl.ShapePathImplTest
[INFO  ShapePathImplTest] Simple path: <http://example.com/p1>
[INFO  ShapePathImplTest] Complex path: (<http://example.com/p1>)+/(<http://example.com/p2>)*
[INFO  ShapePathImplTest] Complex path: (<http://example.com/p1>/<http://example.com/p2>)/<http://example.com/p3>
[INFO] Tests run: 5, Failures: 0, Errors: 0, Skipped: 0, Time elapsed: 1.868 s - in org.aksw.rdfunit.model.impl.shacl.ShapePathImplTest
[INFO] Running org.aksw.rdfunit.model.impl.shacl.ShapeTargetCoreTest
[INFO] Tests run: 5, Failures: 0, Errors: 0, Skipped: 0, Time elapsed: 0.023 s - in org.aksw.rdfunit.model.impl.shacl.ShapeTargetCoreTest
[INFO] Running org.aksw.rdfunit.model.impl.shacl.TestCaseWithTargetTest
[INFO] Tests run: 8, Failures: 0, Errors: 0, Skipped: 0, Time elapsed: 1.02 s - in org.aksw.rdfunit.model.impl.shacl.TestCaseWithTargetTest
[INFO] Running org.aksw.rdfunit.model.impl.shacl.ComponentParameterImplTest
[INFO] Tests run: 4, Failures: 0, Errors: 0, Skipped: 0, Time elapsed: 0.002 s - in org.aksw.rdfunit.model.impl.shacl.ComponentParameterImplTest
[INFO] Running org.aksw.rdfunit.model.shacl.ShaclModelTest
[INFO] Tests run: 1, Failures: 0, Errors: 0, Skipped: 0, Time elapsed: 1.268 s - in org.aksw.rdfunit.model.shacl.ShaclModelTest
[INFO] Running org.aksw.rdfunit.model.helper.SelectVarTest
[INFO] Tests run: 3, Failures: 0, Errors: 0, Skipped: 0, Time elapsed: 0.001 s - in org.aksw.rdfunit.model.helper.SelectVarTest
[INFO] Running org.aksw.rdfunit.model.helper.PropertyValuePairSetTest
[INFO] Tests run: 1, Failures: 0, Errors: 0, Skipped: 0, Time elapsed: 0.003 s - in org.aksw.rdfunit.model.helper.PropertyValuePairSetTest
[INFO] Running org.aksw.rdfunit.model.helper.AnnotationTemplateTest
[INFO] Tests run: 4, Failures: 0, Errors: 0, Skipped: 0, Time elapsed: 0.008 s - in org.aksw.rdfunit.model.helper.AnnotationTemplateTest
[INFO] Running org.aksw.rdfunit.model.writers.TestGeneratorWriterTest
[INFO] Tests run: 3, Failures: 0, Errors: 0, Skipped: 0, Time elapsed: 0.221 s - in org.aksw.rdfunit.model.writers.TestGeneratorWriterTest
[INFO] Running org.aksw.rdfunit.model.writers.TestCaseWriterTest
[INFO] Tests run: 8, Failures: 0, Errors: 0, Skipped: 0, Time elapsed: 0.35 s - in org.aksw.rdfunit.model.writers.TestCaseWriterTest
[INFO] Running org.aksw.rdfunit.model.writers.shacl.ComponentParameterWriterTest
[INFO] Tests run: 24, Failures: 0, Errors: 0, Skipped: 0, Time elapsed: 0.02 s - in org.aksw.rdfunit.model.writers.shacl.ComponentParameterWriterTest
[INFO] Running org.aksw.rdfunit.model.writers.PatternWriterTest
[INFO] Tests run: 1, Failures: 0, Errors: 0, Skipped: 0, Time elapsed: 0.02 s - in org.aksw.rdfunit.model.writers.PatternWriterTest
[INFO] Running org.aksw.rdfunit.model.readers.PatternParameterReaderTest
[INFO] Tests run: 83, Failures: 0, Errors: 0, Skipped: 0, Time elapsed: 0.05 s - in org.aksw.rdfunit.model.readers.PatternParameterReaderTest
[INFO] Running org.aksw.rdfunit.model.readers.results.TestExecutionReaderTest
[WARNING] Tests run: 1, Failures: 0, Errors: 0, Skipped: 1, Time elapsed: 0.002 s - in org.aksw.rdfunit.model.readers.results.TestExecutionReaderTest
[INFO] Running org.aksw.rdfunit.model.readers.TestGeneratorReaderTest
[INFO] Tests run: 60, Failures: 0, Errors: 0, Skipped: 0, Time elapsed: 1.527 s - in org.aksw.rdfunit.model.readers.TestGeneratorReaderTest
[INFO] Running org.aksw.rdfunit.model.readers.shacl.SparqlValidatorReaderTest
[INFO] Tests run: 1, Failures: 0, Errors: 0, Skipped: 0, Time elapsed: 0.031 s - in org.aksw.rdfunit.model.readers.shacl.SparqlValidatorReaderTest
[INFO] Running org.aksw.rdfunit.model.readers.shacl.ComponentValidatorReaderTest
[INFO] Tests run: 16, Failures: 0, Errors: 0, Skipped: 0, Time elapsed: 0.009 s - in org.aksw.rdfunit.model.readers.shacl.ComponentValidatorReaderTest
[INFO] Running org.aksw.rdfunit.model.readers.shacl.ShapePathReaderTest
[INFO] Tests run: 13, Failures: 0, Errors: 0, Skipped: 0, Time elapsed: 0.012 s - in org.aksw.rdfunit.model.readers.shacl.ShapePathReaderTest
[INFO] Running org.aksw.rdfunit.model.readers.shacl.ComponentReaderTest
[INFO] Tests run: 21, Failures: 0, Errors: 0, Skipped: 0, Time elapsed: 0.013 s - in org.aksw.rdfunit.model.readers.shacl.ComponentReaderTest
[INFO] Running org.aksw.rdfunit.model.readers.shacl.ShapeReaderTest
[INFO] Tests run: 1, Failures: 0, Errors: 0, Skipped: 0, Time elapsed: 0.007 s - in org.aksw.rdfunit.model.readers.shacl.ShapeReaderTest
[INFO] Running org.aksw.rdfunit.model.readers.shacl.BatchShapeTargetReaderTest
[INFO] Tests run: 1, Failures: 0, Errors: 0, Skipped: 0, Time elapsed: 0 s - in org.aksw.rdfunit.model.readers.shacl.BatchShapeTargetReaderTest
[INFO] Running org.aksw.rdfunit.model.readers.shacl.ComponentParameterReaderTest
[INFO] Tests run: 24, Failures: 0, Errors: 0, Skipped: 0, Time elapsed: 0.011 s - in org.aksw.rdfunit.model.readers.shacl.ComponentParameterReaderTest
[INFO] Running org.aksw.rdfunit.model.readers.PatternReaderTest
[INFO] Tests run: 33, Failures: 0, Errors: 0, Skipped: 0, Time elapsed: 0.023 s - in org.aksw.rdfunit.model.readers.PatternReaderTest
[INFO] Running org.aksw.rdfunit.enums.RLOGLevelTest
[INFO] Tests run: 1, Failures: 0, Errors: 0, Skipped: 0, Time elapsed: 0.001 s - in org.aksw.rdfunit.enums.RLOGLevelTest
[INFO] Running org.aksw.rdfunit.enums.TestCaseResultStatusTest
[INFO] Tests run: 1, Failures: 0, Errors: 0, Skipped: 0, Time elapsed: 0 s - in org.aksw.rdfunit.enums.TestCaseResultStatusTest
[INFO] Running org.aksw.rdfunit.enums.PatternParameterConstraintsTest
[INFO] Tests run: 1, Failures: 0, Errors: 0, Skipped: 0, Time elapsed: 0.001 s - in org.aksw.rdfunit.enums.PatternParameterConstraintsTest
[INFO] Running org.aksw.rdfunit.enums.TestAppliesToTest
[INFO] Tests run: 1, Failures: 0, Errors: 0, Skipped: 0, Time elapsed: 0 s - in org.aksw.rdfunit.enums.TestAppliesToTest
[INFO] 
[INFO] Results:
[INFO] 
[WARNING] Tests run: 325, Failures: 0, Errors: 0, Skipped: 1
[INFO] 
[INFO] 
[INFO] --- maven-jar-plugin:2.4:jar (default-jar) @ rdfunit-model ---
[INFO] Building jar: /usr/share/tomcat8/.jenkins/jobs/RDFUnit - build deb packages/workspace/rdfunit-model/target/rdfunit-model-0.8.22-SNAPSHOT.jar
[INFO] 
[INFO] --- maven-install-plugin:2.4:install (default-install) @ rdfunit-model ---
[INFO] Installing /usr/share/tomcat8/.jenkins/jobs/RDFUnit - build deb packages/workspace/rdfunit-model/target/rdfunit-model-0.8.22-SNAPSHOT.jar to /usr/share/tomcat8/.m2/repository/org/aksw/rdfunit/rdfunit-model/0.8.22-SNAPSHOT/rdfunit-model-0.8.22-SNAPSHOT.jar
[INFO] Installing /usr/share/tomcat8/.jenkins/jobs/RDFUnit - build deb packages/workspace/rdfunit-model/pom.xml to /usr/share/tomcat8/.m2/repository/org/aksw/rdfunit/rdfunit-model/0.8.22-SNAPSHOT/rdfunit-model-0.8.22-SNAPSHOT.pom
[INFO] 
[INFO] -------------------< org.aksw.rdfunit:rdfunit-core >--------------------
[INFO] Building RDFUnit - Core 0.8.22-SNAPSHOT                            [6/7]
[INFO] --------------------------------[ jar ]---------------------------------
[INFO] 
[INFO] --- maven-enforcer-plugin:1.4.1:enforce (enforce-java) @ rdfunit-core ---
[INFO] 
[INFO] --- maven-enforcer-plugin:1.4.1:enforce (enforce-maven) @ rdfunit-core ---
[INFO] 
[INFO] --- maven-resources-plugin:3.0.2:copy-resources (copy-resources) @ rdfunit-core ---
[INFO] Using 'UTF-8' encoding to copy filtered resources.
[INFO] Copying 1 resource
[INFO] 
[INFO] --- jacoco-maven-plugin:0.8.5:prepare-agent (prepare-agent) @ rdfunit-core ---
[INFO] argLine set to "-javaagent:/usr/share/tomcat8/.m2/repository/org/jacoco/org.jacoco.agent/0.8.5/org.jacoco.agent-0.8.5-runtime.jar=destfile=/usr/share/tomcat8/.jenkins/jobs/RDFUnit - build deb packages/workspace/rdfunit-core/target/jacoco.exec"
[INFO] 
[INFO] --- maven-resources-plugin:3.0.2:resources (default-resources) @ rdfunit-core ---
[INFO] Using 'UTF-8' encoding to copy filtered resources.
[INFO] Copying 1 resource
[INFO] 
[INFO] --- maven-compiler-plugin:3.8.1:compile (default-compile) @ rdfunit-core ---
[INFO] Changes detected - recompiling the module!
[INFO] Compiling 75 source files to /usr/share/tomcat8/.jenkins/jobs/RDFUnit - build deb packages/workspace/rdfunit-core/target/classes
[INFO] /usr/share/tomcat8/.jenkins/jobs/RDFUnit - build deb packages/workspace/rdfunit-core/src/main/java/org/aksw/rdfunit/prefix/TrustingUrlConnection.java: Some input files use or override a deprecated API.
[INFO] /usr/share/tomcat8/.jenkins/jobs/RDFUnit - build deb packages/workspace/rdfunit-core/src/main/java/org/aksw/rdfunit/prefix/TrustingUrlConnection.java: Recompile with -Xlint:deprecation for details.
[INFO] 
[INFO] --- maven-resources-plugin:3.0.2:testResources (default-testResources) @ rdfunit-core ---
[INFO] Using 'UTF-8' encoding to copy filtered resources.
[INFO] Copying 125 resources
[INFO] 
[INFO] --- maven-compiler-plugin:3.8.1:testCompile (default-testCompile) @ rdfunit-core ---
[INFO] Changes detected - recompiling the module!
[INFO] Compiling 22 source files to /usr/share/tomcat8/.jenkins/jobs/RDFUnit - build deb packages/workspace/rdfunit-core/target/test-classes
[INFO] 
[INFO] --- maven-surefire-plugin:2.22.2:test (default-test) @ rdfunit-core ---
[INFO] 
[INFO] -------------------------------------------------------
[INFO]  T E S T S
[INFO] -------------------------------------------------------
[INFO] Running org.aksw.rdfunit.validate.wrappers.RDFUnitStaticValidatorTest
[INFO  TagRdfUnitTestGenerator] /org/aksw/rdfunit/validate/data/empty.ttl generated 0 tests using 36 TAGs
[INFO  ShaclTestGenerator] /org/aksw/rdfunit/validate/data/empty.ttl generated 0 SHACL-based tests
[INFO  ManualRdfunitTestReaderGenerator] /org/aksw/rdfunit/validate/data/empty.ttl identified 0 manually written tests
[INFO  ManualRdfunitTestLoaderGenerator] /org/aksw/rdfunit/validate/data/empty.ttl identified 0 predefined manual tests
[INFO  ManualRdfunitTestReaderGenerator] dummy identified 0 manually written tests
[INFO  ManualRdfunitTestLoaderGenerator] dummy identified 0 predefined manual tests
[INFO  TagRdfUnitTestGenerator] /org/aksw/rdfunit/validate/data/empty.ttl generated 0 tests using 36 TAGs
[INFO  ShaclTestGenerator] /org/aksw/rdfunit/validate/data/empty.ttl generated 0 SHACL-based tests
[INFO  ManualRdfunitTestReaderGenerator] /org/aksw/rdfunit/validate/data/empty.ttl identified 0 manually written tests
[INFO  ManualRdfunitTestLoaderGenerator] /org/aksw/rdfunit/validate/data/empty.ttl identified 0 predefined manual tests
[INFO  ManualRdfunitTestReaderGenerator] dummy identified 0 manually written tests
[INFO  ManualRdfunitTestLoaderGenerator] dummy identified 0 predefined manual tests
[INFO  TagRdfUnitTestGenerator] /org/aksw/rdfunit/validate/data/empty.ttl generated 0 tests using 36 TAGs
[INFO  ShaclTestGenerator] /org/aksw/rdfunit/validate/data/empty.ttl generated 0 SHACL-based tests
[INFO  ManualRdfunitTestReaderGenerator] /org/aksw/rdfunit/validate/data/empty.ttl identified 0 manually written tests
[INFO  ManualRdfunitTestLoaderGenerator] /org/aksw/rdfunit/validate/data/empty.ttl identified 0 predefined manual tests
[INFO  ManualRdfunitTestReaderGenerator] dummy identified 0 manually written tests
[INFO  ManualRdfunitTestLoaderGenerator] dummy identified 0 predefined manual tests
[INFO  TagRdfUnitTestGenerator] /org/aksw/rdfunit/validate/data/empty.ttl generated 0 tests using 36 TAGs
[INFO  ShaclTestGenerator] /org/aksw/rdfunit/validate/data/empty.ttl generated 0 SHACL-based tests
[INFO  ManualRdfunitTestReaderGenerator] /org/aksw/rdfunit/validate/data/empty.ttl identified 0 manually written tests
[INFO  ManualRdfunitTestLoaderGenerator] /org/aksw/rdfunit/validate/data/empty.ttl identified 0 predefined manual tests
[INFO  ManualRdfunitTestReaderGenerator] dummy identified 0 manually written tests
[INFO  ManualRdfunitTestLoaderGenerator] dummy identified 0 predefined manual tests
[INFO  TagRdfUnitTestGenerator] /org/aksw/rdfunit/validate/data/empty.ttl generated 0 tests using 36 TAGs
[INFO  ShaclTestGenerator] /org/aksw/rdfunit/validate/data/empty.ttl generated 0 SHACL-based tests
[INFO  ManualRdfunitTestReaderGenerator] /org/aksw/rdfunit/validate/data/empty.ttl identified 0 manually written tests
[INFO  ManualRdfunitTestLoaderGenerator] /org/aksw/rdfunit/validate/data/empty.ttl identified 0 predefined manual tests
[INFO  ManualRdfunitTestReaderGenerator] dummy identified 0 manually written tests
[INFO  ManualRdfunitTestLoaderGenerator] dummy identified 0 predefined manual tests
[INFO  TagRdfUnitTestGenerator] /org/aksw/rdfunit/validate/data/empty.ttl generated 0 tests using 36 TAGs
[INFO  ShaclTestGenerator] /org/aksw/rdfunit/validate/data/empty.ttl generated 0 SHACL-based tests
[INFO  ManualRdfunitTestReaderGenerator] /org/aksw/rdfunit/validate/data/empty.ttl identified 0 manually written tests
[INFO  ManualRdfunitTestLoaderGenerator] /org/aksw/rdfunit/validate/data/empty.ttl identified 0 predefined manual tests
[INFO  ManualRdfunitTestReaderGenerator] dummy identified 0 manually written tests
[INFO  ManualRdfunitTestLoaderGenerator] dummy identified 0 predefined manual tests
[INFO  TagRdfUnitTestGenerator] /org/aksw/rdfunit/validate/data/empty.ttl generated 0 tests using 36 TAGs
[INFO  ShaclTestGenerator] /org/aksw/rdfunit/validate/data/empty.ttl generated 0 SHACL-based tests
[INFO  ManualRdfunitTestReaderGenerator] /org/aksw/rdfunit/validate/data/empty.ttl identified 0 manually written tests
[INFO  ManualRdfunitTestLoaderGenerator] /org/aksw/rdfunit/validate/data/empty.ttl identified 0 predefined manual tests
[INFO  ManualRdfunitTestReaderGenerator] dummy identified 0 manually written tests
[INFO  ManualRdfunitTestLoaderGenerator] dummy identified 0 predefined manual tests
[INFO  TagRdfUnitTestGenerator] /org/aksw/rdfunit/validate/data/empty.ttl generated 0 tests using 36 TAGs
[INFO  ShaclTestGenerator] /org/aksw/rdfunit/validate/data/empty.ttl generated 0 SHACL-based tests
[INFO  ManualRdfunitTestReaderGenerator] /org/aksw/rdfunit/validate/data/empty.ttl identified 0 manually written tests
[INFO  ManualRdfunitTestLoaderGenerator] /org/aksw/rdfunit/validate/data/empty.ttl identified 0 predefined manual tests
[INFO  ManualRdfunitTestReaderGenerator] dummy identified 0 manually written tests
[INFO  ManualRdfunitTestLoaderGenerator] dummy identified 0 predefined manual tests
[INFO] Tests run: 8, Failures: 0, Errors: 0, Skipped: 0, Time elapsed: 3.907 s - in org.aksw.rdfunit.validate.wrappers.RDFUnitStaticValidatorTest
[INFO] Running org.aksw.rdfunit.validate.integration.ManualTestsIntegrationTest
[INFO] Tests run: 1, Failures: 0, Errors: 0, Skipped: 0, Time elapsed: 0.109 s - in org.aksw.rdfunit.validate.integration.ManualTestsIntegrationTest
[INFO] Running org.aksw.rdfunit.validate.integration.XsdIntegrationTest
[INFO  TagRdfUnitTestGenerator] http://rdfunit.aksw.org generated 74 tests using 60 TAGs
[WARN  ErrorHandlerFactory$ErrorLogger] [line: 12, col: 28] Lexical form '-21' not valid for datatype XSD unsignedLong
[WARN  ErrorHandlerFactory$ErrorLogger] [line: 13, col: 28] Lexical form '18446744073709551620' not valid for datatype XSD unsignedLong
[WARN  ErrorHandlerFactory$ErrorLogger] [line: 14, col: 28] Lexical form '3.0' not valid for datatype XSD unsignedLong
[WARN  ErrorHandlerFactory$ErrorLogger] [line: 15, col: 28] Lexical form '' not valid for datatype XSD unsignedLong
[WARN  Log] Datatype format exception: "-21"^^xsd:unsignedLong
[WARN  Log] Datatype format exception: "18446744073709551620"^^xsd:unsignedLong
[WARN  Log] Datatype format exception: "3.0"^^xsd:unsignedLong
[WARN  Log] Datatype format exception: ""^^xsd:unsignedLong
[WARN  Log] Datatype format exception: "-21"^^xsd:unsignedLong
[WARN  Log] Datatype format exception: "-21"^^xsd:unsignedLong
[WARN  Log] Datatype format exception: "18446744073709551620"^^xsd:unsignedLong
[WARN  Log] Datatype format exception: "18446744073709551620"^^xsd:unsignedLong
[WARN  Log] Datatype format exception: "3.0"^^xsd:unsignedLong
[WARN  Log] Datatype format exception: "3.0"^^xsd:unsignedLong
[WARN  Log] Datatype format exception: ""^^xsd:unsignedLong
[WARN  Log] Datatype format exception: ""^^xsd:unsignedLong
[WARN  ErrorHandlerFactory$ErrorLogger] [line: 12, col: 24] Lexical form 'PT15.S' not valid for datatype XSD duration
[WARN  ErrorHandlerFactory$ErrorLogger] [line: 13, col: 24] Lexical form 'P2M1Y' not valid for datatype XSD duration
[WARN  ErrorHandlerFactory$ErrorLogger] [line: 14, col: 24] Lexical form '1Y2M' not valid for datatype XSD duration
[WARN  ErrorHandlerFactory$ErrorLogger] [line: 15, col: 24] Lexical form 'P1D2H' not valid for datatype XSD duration
[WARN  ErrorHandlerFactory$ErrorLogger] [line: 16, col: 24] Lexical form 'P15.5Y' not valid for datatype XSD duration
[WARN  ErrorHandlerFactory$ErrorLogger] [line: 17, col: 24] Lexical form 'P1YM5D' not valid for datatype XSD duration
[WARN  ErrorHandlerFactory$ErrorLogger] [line: 18, col: 24] Lexical form 'P20MT' not valid for datatype XSD duration
[WARN  ErrorHandlerFactory$ErrorLogger] [line: 19, col: 24] Lexical form 'P-20M' not valid for datatype XSD duration
[WARN  ErrorHandlerFactory$ErrorLogger] [line: 20, col: 24] Lexical form 'P' not valid for datatype XSD duration
[WARN  ErrorHandlerFactory$ErrorLogger] [line: 21, col: 24] Lexical form '' not valid for datatype XSD duration
[WARN  Log] Datatype format exception: "P20MT"^^xsd:duration
[WARN  Log] Datatype format exception: "P2M1Y"^^xsd:duration
[WARN  Log] Datatype format exception: "P"^^xsd:duration
[WARN  Log] Datatype format exception: ""^^xsd:duration
[WARN  Log] Datatype format exception: "P15.5Y"^^xsd:duration
[WARN  Log] Datatype format exception: "1Y2M"^^xsd:duration
[WARN  Log] Datatype format exception: "P1YM5D"^^xsd:duration
[WARN  Log] Datatype format exception: "P1D2H"^^xsd:duration
[WARN  Log] Datatype format exception: "PT15.S"^^xsd:duration
[WARN  Log] Datatype format exception: "P-20M"^^xsd:duration
[WARN  Log] Datatype format exception: "P20MT"^^xsd:duration
[WARN  Log] Datatype format exception: "P20MT"^^xsd:duration
[WARN  Log] Datatype format exception: "P2M1Y"^^xsd:duration
[WARN  Log] Datatype format exception: "P2M1Y"^^xsd:duration
[WARN  Log] Datatype format exception: "P"^^xsd:duration
[WARN  Log] Datatype format exception: "P"^^xsd:duration
[WARN  Log] Datatype format exception: ""^^xsd:duration
[WARN  Log] Datatype format exception: ""^^xsd:duration
[WARN  Log] Datatype format exception: "P15.5Y"^^xsd:duration
[WARN  Log] Datatype format exception: "P15.5Y"^^xsd:duration
[WARN  Log] Datatype format exception: "1Y2M"^^xsd:duration
[WARN  Log] Datatype format exception: "1Y2M"^^xsd:duration
[WARN  Log] Datatype format exception: "P1YM5D"^^xsd:duration
[WARN  Log] Datatype format exception: "P1YM5D"^^xsd:duration
[WARN  Log] Datatype format exception: "P1D2H"^^xsd:duration
[WARN  Log] Datatype format exception: "P1D2H"^^xsd:duration
[WARN  Log] Datatype format exception: "PT15.S"^^xsd:duration
[WARN  Log] Datatype format exception: "PT15.S"^^xsd:duration
[WARN  Log] Datatype format exception: "P-20M"^^xsd:duration
[WARN  Log] Datatype format exception: "P-20M"^^xsd:duration
[WARN  ErrorHandlerFactory$ErrorLogger] [line: 11, col: 20] Lexical form '130' not valid for datatype XSD byte
[WARN  ErrorHandlerFactory$ErrorLogger] [line: 12, col: 20] Lexical form '3.0' not valid for datatype XSD byte
[WARN  ErrorHandlerFactory$ErrorLogger] [line: 13, col: 20] Lexical form '-129' not valid for datatype XSD byte
[WARN  Log] Datatype format exception: "130"^^xsd:byte
[WARN  Log] Datatype format exception: "3.0"^^xsd:byte
[WARN  Log] Datatype format exception: "-129"^^xsd:byte
[WARN  Log] Datatype format exception: "130"^^xsd:byte
[WARN  Log] Datatype format exception: "130"^^xsd:byte
[WARN  Log] Datatype format exception: "3.0"^^xsd:byte
[WARN  Log] Datatype format exception: "3.0"^^xsd:byte
[WARN  Log] Datatype format exception: "-129"^^xsd:byte
[WARN  Log] Datatype format exception: "-129"^^xsd:byte
[WARN  ErrorHandlerFactory$ErrorLogger] [line: 12, col: 20] Lexical form '13:65:00' not valid for datatype XSD time
[WARN  ErrorHandlerFactory$ErrorLogger] [line: 13, col: 20] Lexical form '13:20.5:00' not valid for datatype XSD time
[WARN  ErrorHandlerFactory$ErrorLogger] [line: 14, col: 20] Lexical form '13:20' not valid for datatype XSD time
[WARN  ErrorHandlerFactory$ErrorLogger] [line: 15, col: 20] Lexical form '5:20:00' not valid for datatype XSD time
[WARN  ErrorHandlerFactory$ErrorLogger] [line: 16, col: 20] Lexical form '' not valid for datatype XSD time
[WARN  ErrorHandlerFactory$ErrorLogger] [line: 17, col: 20] Lexical form '13:20:00-15:00' not valid for datatype XSD time
[WARN  Log] Datatype format exception: "13:65:00"^^xsd:time
[WARN  Log] Datatype format exception: "13:20.5:00"^^xsd:time
[WARN  Log] Datatype format exception: "13:20"^^xsd:time
[WARN  Log] Datatype format exception: "5:20:00"^^xsd:time
[WARN  Log] Datatype format exception: ""^^xsd:time
[WARN  Log] Datatype format exception: "13:20:00-15:00"^^xsd:time
[WARN  Log] Datatype format exception: "13:65:00"^^xsd:time
[WARN  Log] Datatype format exception: "13:65:00"^^xsd:time
[WARN  Log] Datatype format exception: "13:20.5:00"^^xsd:time
[WARN  Log] Datatype format exception: "13:20.5:00"^^xsd:time
[WARN  Log] Datatype format exception: "13:20"^^xsd:time
[WARN  Log] Datatype format exception: "13:20"^^xsd:time
[WARN  Log] Datatype format exception: "5:20:00"^^xsd:time
[WARN  Log] Datatype format exception: "5:20:00"^^xsd:time
[WARN  Log] Datatype format exception: ""^^xsd:time
[WARN  Log] Datatype format exception: ""^^xsd:time
[WARN  Log] Datatype format exception: "13:20:00-15:00"^^xsd:time
[WARN  Log] Datatype format exception: "13:20:00-15:00"^^xsd:time
[WARN  ErrorHandlerFactory$ErrorLogger] [line: 11, col: 21] Lexical form '-3E2.4' not valid for datatype XSD float
[WARN  ErrorHandlerFactory$ErrorLogger] [line: 12, col: 21] Lexical form '12E' not valid for datatype XSD float
[WARN  ErrorHandlerFactory$ErrorLogger] [line: 13, col: 21] Lexical form 'NAN' not valid for datatype XSD float
[WARN  ErrorHandlerFactory$ErrorLogger] [line: 14, col: 21] Lexical form '' not valid for datatype XSD float
[WARN  Log] Datatype format exception: "-3E2.4"^^xsd:float
[WARN  Log] Datatype format exception: "12E"^^xsd:float
[WARN  Log] Datatype format exception: "NAN"^^xsd:float
[WARN  Log] Datatype format exception: ""^^xsd:float
[WARN  Log] Datatype format exception: "-3E2.4"^^xsd:float
[WARN  Log] Datatype format exception: "-3E2.4"^^xsd:float
[WARN  Log] Datatype format exception: "12E"^^xsd:float
[WARN  Log] Datatype format exception: "12E"^^xsd:float
[WARN  Log] Datatype format exception: "NAN"^^xsd:float
[WARN  Log] Datatype format exception: "NAN"^^xsd:float
[WARN  Log] Datatype format exception: ""^^xsd:float
[WARN  Log] Datatype format exception: ""^^xsd:float
[WARN  ErrorHandlerFactory$ErrorLogger] [line: 12, col: 19] Lexical form 'abc' not valid for datatype XSD integer
[WARN  Log] Datatype format exception: "abc"^^xsd:integer
[WARN  Log] Datatype format exception: "abc"^^xsd:integer
[WARN  Log] Datatype format exception: "abc"^^xsd:integer
[WARN  Log] Datatype format exception: "1.2"^^xsd:integer
[WARN  Log] Datatype format exception: "1.2"^^xsd:integer
[WARN  Log] Datatype format exception: "1.2"^^xsd:integer
[WARN  Log] Datatype format exception: "1.2"^^xsd:integer
[WARN  ErrorHandlerFactory$ErrorLogger] [line: 12, col: 23] Lexical form 'truu' not valid for datatype XSD boolean
[WARN  ErrorHandlerFactory$ErrorLogger] [line: 13, col: 23] Lexical form '2' not valid for datatype XSD boolean
[WARN  Log] Datatype format exception: "truu"^^xsd:boolean
[WARN  Log] Datatype format exception: "2"^^xsd:boolean
[WARN  Log] Datatype format exception: "truu"^^xsd:boolean
[WARN  Log] Datatype format exception: "truu"^^xsd:boolean
[WARN  Log] Datatype format exception: "2"^^xsd:boolean
[WARN  Log] Datatype format exception: "2"^^xsd:boolean
[WARN  ErrorHandlerFactory$ErrorLogger] [line: 11, col: 23] Lexical form '3,5' not valid for datatype XSD decimal
[WARN  ErrorHandlerFactory$ErrorLogger] [line: 12, col: 23] Lexical form '' not valid for datatype XSD decimal
[WARN  Log] Datatype format exception: "3,5"^^xsd:decimal
[WARN  Log] Datatype format exception: ""^^xsd:decimal
[WARN  Log] Datatype format exception: "3,5"^^xsd:decimal
[WARN  Log] Datatype format exception: "3,5"^^xsd:decimal
[WARN  Log] Datatype format exception: ""^^xsd:decimal
[WARN  Log] Datatype format exception: ""^^xsd:decimal
[WARN  ErrorHandlerFactory$ErrorLogger] [line: 11, col: 23] Lexical form '2018-13-01' not valid for datatype XSD date
[WARN  ErrorHandlerFactory$ErrorLogger] [line: 12, col: 23] Lexical form '01-11-2013' not valid for datatype XSD date
[WARN  ErrorHandlerFactory$ErrorLogger] [line: 13, col: 23] Lexical form '01-11-0000' not valid for datatype XSD date
[WARN  ErrorHandlerFactory$ErrorLogger] [line: 14, col: 23] Lexical form '2018-11-01T' not valid for datatype XSD date
[WARN  ErrorHandlerFactory$ErrorLogger] [line: 15, col: 23] Lexical form '99-04-12' not valid for datatype XSD date
[WARN  ErrorHandlerFactory$ErrorLogger] [line: 16, col: 23] Lexical form '2004/04/02' not valid for datatype XSD date
[WARN  Log] Datatype format exception: "2018-13-01"^^xsd:date
[WARN  Log] Datatype format exception: "01-11-2013"^^xsd:date
[WARN  Log] Datatype format exception: "01-11-0000"^^xsd:date
[WARN  Log] Datatype format exception: "2018-11-01T"^^xsd:date
[WARN  Log] Datatype format exception: "99-04-12"^^xsd:date
[WARN  Log] Datatype format exception: "2004/04/02"^^xsd:date
[WARN  Log] Datatype format exception: "2018-13-01"^^xsd:date
[WARN  Log] Datatype format exception: "2018-13-01"^^xsd:date
[WARN  Log] Datatype format exception: "01-11-2013"^^xsd:date
[WARN  Log] Datatype format exception: "01-11-2013"^^xsd:date
[WARN  Log] Datatype format exception: "01-11-0000"^^xsd:date
[WARN  Log] Datatype format exception: "01-11-0000"^^xsd:date
[WARN  Log] Datatype format exception: "2018-11-01T"^^xsd:date
[WARN  Log] Datatype format exception: "2018-11-01T"^^xsd:date
[WARN  Log] Datatype format exception: "99-04-12"^^xsd:date
[WARN  Log] Datatype format exception: "99-04-12"^^xsd:date
[WARN  Log] Datatype format exception: "2004/04/02"^^xsd:date
[WARN  Log] Datatype format exception: "2004/04/02"^^xsd:date
[INFO] Tests run: 18, Failures: 0, Errors: 0, Skipped: 0, Time elapsed: 3.33 s - in org.aksw.rdfunit.validate.integration.XsdIntegrationTest
[INFO] Running org.aksw.rdfunit.validate.integration.RSIntegrationTest
[INFO  TagRdfUnitTestGenerator] http://rdfunit.aksw.org generated 32 tests using 60 TAGs
[INFO] Tests run: 8, Failures: 0, Errors: 0, Skipped: 0, Time elapsed: 0.654 s - in org.aksw.rdfunit.validate.integration.RSIntegrationTest
[INFO] Running org.aksw.rdfunit.validate.integration.DspIntegrationTest
[INFO  TagRdfUnitTestGenerator] http://rdfunit.aksw.org generated 25 tests using 60 TAGs
[INFO] Tests run: 14, Failures: 0, Errors: 0, Skipped: 0, Time elapsed: 0.717 s - in org.aksw.rdfunit.validate.integration.DspIntegrationTest
[INFO] Running org.aksw.rdfunit.validate.integration.OwlIntegrationTest
[INFO] Tests run: 23, Failures: 0, Errors: 0, Skipped: 0, Time elapsed: 2.025 s - in org.aksw.rdfunit.validate.integration.OwlIntegrationTest
[INFO] Running org.aksw.rdfunit.validate.integration.ShaclIntegrationTest
[WARN  ConstraintFactory] No validators found for Property Shape ebea99fa50e26ef6e3af46e0c3d3c5d1 / component http://www.w3.org/ns/shacl#MinCountConstraintComponent and bindings [PropertySingleValuePair(property=http://www.w3.org/ns/shacl#minCount, value=0^^http://www.w3.org/2001/XMLSchema#int)]
[INFO  ShaclTestGenerator] http://rdfunit.aksw.org generated 43 SHACL-based tests
[WARN  ErrorHandlerFactory$ErrorLogger] [line: 31, col: 16] Lexical form 'none' not valid for datatype XSD boolean
[WARN  Log] Datatype format exception: "none"^^xsd:boolean
[WARN  Log] Datatype format exception: "none"^^xsd:boolean
[WARN  Log] Datatype format exception: "none"^^xsd:boolean
[WARN  Log] Datatype format exception: "none"^^xsd:boolean
[WARN  Log] Datatype format exception: "none"^^xsd:boolean
[WARN  Log] Datatype format exception: "none"^^xsd:boolean
[WARN  Log] Datatype format exception: "none"^^xsd:boolean
[WARN  Log] Datatype format exception: "none"^^xsd:boolean
[WARN  Log] Datatype format exception: "none"^^xsd:boolean
[WARN  Log] Datatype format exception: "none"^^xsd:boolean
[WARN  Log] Datatype format exception: "none"^^xsd:boolean
[WARN  Log] Datatype format exception: "none"^^xsd:boolean
[WARN  Log] Datatype format exception: "none"^^xsd:boolean
[WARN  Log] Datatype format exception: "none"^^xsd:boolean
[WARN  Log] Datatype format exception: "none"^^xsd:boolean
[WARN  Log] Datatype format exception: "none"^^xsd:boolean
[WARN  Log] Datatype format exception: "none"^^xsd:boolean
[WARN  ErrorHandlerFactory$ErrorLogger] [line: 8, col: 20] Lexical form 'asdf' not valid for datatype XSD date
[WARN  Log] Datatype format exception: "asdf"^^xsd:date
[WARN  Log] Datatype format exception: "asdf"^^xsd:date
[WARN  Log] Datatype format exception: "asdf"^^xsd:date
[WARN  ErrorHandlerFactory$ErrorLogger] [line: 7, col: 23] Lexical form 'true' not valid for datatype XSD int
[WARN  Log] Datatype format exception: "true"^^xsd:int
[WARN  Log] Datatype format exception: "true"^^xsd:int
[WARN  Log] Datatype format exception: "true"^^xsd:int
[WARN  ErrorHandlerFactory$ErrorLogger] [line: 15, col: 42] Lexical form 'asdf' not valid for datatype XSD int
[WARN  Log] Datatype format exception: "asdf"^^xsd:int
[WARN  Log] Datatype format exception: "asdf"^^xsd:int
[WARN  Log] Datatype format exception: "asdf"^^xsd:int
[INFO] Tests run: 49, Failures: 0, Errors: 0, Skipped: 0, Time elapsed: 4.903 s - in org.aksw.rdfunit.validate.integration.ShaclIntegrationTest
[INFO] Running org.aksw.rdfunit.utils.RDFUnitUtilsTest
[INFO  RDFUnitUtils] Adding manual schema entries (or overriding LOV)!
[INFO  RDFUnitUtils] Loaded 63 schema declarations from: sun.net.www.protocol.jar.JarURLConnection$JarURLInputStream@5b6b1f4a
[INFO  RDFUnitUtils] Loading cached schema entries from LOV!
[INFO  RDFUnitUtils] Loaded 651 schema declarations from: sun.net.www.protocol.jar.JarURLConnection$JarURLInputStream@1051d062
[INFO] Tests run: 2, Failures: 0, Errors: 0, Skipped: 0, Time elapsed: 0.011 s - in org.aksw.rdfunit.utils.RDFUnitUtilsTest
[INFO] Running org.aksw.rdfunit.io.writer.RdfResultsWriterFactoryTest
InputStream: Doctype given is ""
InputStream: Document content looks like HTML 4.01
no warnings or errors were found
InputStream: Doctype given is ""
InputStream: Document content looks like HTML 4.01
no warnings or errors were found
InputStream: Doctype given is ""
InputStream: Document content looks like HTML 4.01
no warnings or errors were found
InputStream: Doctype given is ""
InputStream: Document content looks like HTML 4.01
no warnings or errors were found
[ERROR] Tests run: 4, Failures: 0, Errors: 2, Skipped: 0, Time elapsed: 0.598 s <<< FAILURE! - in org.aksw.rdfunit.io.writer.RdfResultsWriterFactoryTest
[ERROR] testOutputWellFormed[0: Result Type: aggregated](org.aksw.rdfunit.io.writer.RdfResultsWriterFactoryTest)  Time elapsed: 0.274 s  <<< ERROR!
java.util.UnknownFormatConversionException: Conversion = '2'
	at org.aksw.rdfunit.io.writer.RdfResultsWriterFactoryTest.getXmlForExecution(RdfResultsWriterFactoryTest.java:92)
	at org.aksw.rdfunit.io.writer.RdfResultsWriterFactoryTest.testOutputWellFormed(RdfResultsWriterFactoryTest.java:76)

[ERROR] testOutputWellFormed[1: Result Type: status](org.aksw.rdfunit.io.writer.RdfResultsWriterFactoryTest)  Time elapsed: 0.167 s  <<< ERROR!
java.util.UnknownFormatConversionException: Conversion = '2'
	at org.aksw.rdfunit.io.writer.RdfResultsWriterFactoryTest.getXmlForExecution(RdfResultsWriterFactoryTest.java:92)
	at org.aksw.rdfunit.io.writer.RdfResultsWriterFactoryTest.testOutputWellFormed(RdfResultsWriterFactoryTest.java:76)

[INFO] Running org.aksw.rdfunit.prefix.LOVEndpointTest
[WARNING] Tests run: 1, Failures: 0, Errors: 0, Skipped: 1, Time elapsed: 0 s - in org.aksw.rdfunit.prefix.LOVEndpointTest
[INFO] Running org.aksw.rdfunit.sources.DumpTestSourceTest
[ERROR DumpTestSource] Cannot read dump URI: non-resolvable-uri Reason: InputStream is null
[INFO] Tests run: 1, Failures: 0, Errors: 0, Skipped: 0, Time elapsed: 0.001 s - in org.aksw.rdfunit.sources.DumpTestSourceTest
[INFO] Running org.aksw.rdfunit.sources.AbstractTestSourceTest
[INFO] Tests run: 9, Failures: 0, Errors: 0, Skipped: 0, Time elapsed: 0.004 s - in org.aksw.rdfunit.sources.AbstractTestSourceTest
[INFO] Running org.aksw.rdfunit.statistics.DatasetStatisticsPropertiesCountTest
[INFO] Tests run: 1, Failures: 0, Errors: 0, Skipped: 0, Time elapsed: 0.004 s - in org.aksw.rdfunit.statistics.DatasetStatisticsPropertiesCountTest
[INFO] Running org.aksw.rdfunit.statistics.DatasetStatisticsClassesCountTest
[INFO] Tests run: 1, Failures: 0, Errors: 0, Skipped: 0, Time elapsed: 0.001 s - in org.aksw.rdfunit.statistics.DatasetStatisticsClassesCountTest
[INFO] Running org.aksw.rdfunit.statistics.DatasetStatisticsClassesTest
[INFO] Tests run: 1, Failures: 0, Errors: 0, Skipped: 0, Time elapsed: 0.001 s - in org.aksw.rdfunit.statistics.DatasetStatisticsClassesTest
[INFO] Running org.aksw.rdfunit.statistics.DatasetStatisticsPropertiesTest
[INFO] Tests run: 1, Failures: 0, Errors: 0, Skipped: 0, Time elapsed: 0.001 s - in org.aksw.rdfunit.statistics.DatasetStatisticsPropertiesTest
[INFO] Running org.aksw.rdfunit.statistics.DatasetStatisticsAllIrisTest
[INFO] Tests run: 1, Failures: 0, Errors: 0, Skipped: 0, Time elapsed: 0.006 s - in org.aksw.rdfunit.statistics.DatasetStatisticsAllIrisTest
[INFO] Running org.aksw.rdfunit.statistics.NamespaceStatisticsTest
[WARN  NamespaceStatistics] Undefined namespace in LOV or schemaDecl.csv: http://example.com/4#
[WARN  NamespaceStatistics] Undefined namespace in LOV or schemaDecl.csv: http://example.com/5#
[WARN  NamespaceStatistics] Undefined namespace in LOV or schemaDecl.csv: http://example.com/1#
[WARN  NamespaceStatistics] Undefined namespace in LOV or schemaDecl.csv: http://example.com/2#
[WARN  NamespaceStatistics] Undefined namespace in LOV or schemaDecl.csv: http://example.com/3#
[WARN  NamespaceStatistics] Undefined namespace in LOV or schemaDecl.csv: http://example.com/c1#
[WARN  NamespaceStatistics] Undefined namespace in LOV or schemaDecl.csv: http://example.com/c2#
[WARN  NamespaceStatistics] Undefined namespace in LOV or schemaDecl.csv: http://example.com/p4#
[WARN  NamespaceStatistics] Undefined namespace in LOV or schemaDecl.csv: http://example.com/p5#
[WARN  NamespaceStatistics] Undefined namespace in LOV or schemaDecl.csv: http://example.com/p2#
[WARN  NamespaceStatistics] Undefined namespace in LOV or schemaDecl.csv: http://example.com/p3#
[WARN  NamespaceStatistics] Undefined namespace in LOV or schemaDecl.csv: http://example.com/p1#
[ERROR] Tests run: 2, Failures: 1, Errors: 0, Skipped: 0, Time elapsed: 0.012 s <<< FAILURE! - in org.aksw.rdfunit.statistics.NamespaceStatisticsTest
[ERROR] testGetNamespaces(org.aksw.rdfunit.statistics.NamespaceStatisticsTest)  Time elapsed: 0.011 s  <<< FAILURE!
java.lang.AssertionError: expected:<0> but was:<1>
	at org.aksw.rdfunit.statistics.NamespaceStatisticsTest.testGetNamespaces(NamespaceStatisticsTest.java:39)

[INFO] Running org.aksw.rdfunit.tests.generators.TestGeneratorFactoryTest
[INFO  TagRdfUnitTestGenerator] http://example.com/shacl generated 0 tests using 60 TAGs
[INFO  ShaclTestGenerator] http://example.com/shacl generated 1 SHACL-based tests
[INFO  ManualRdfunitTestReaderGenerator] http://example.com/shacl identified 0 manually written tests
[INFO  ManualRdfunitTestLoaderGenerator] http://example.com/shacl identified 0 predefined manual tests
[INFO  TagRdfUnitTestGenerator] http://example.com/owl generated 2 tests using 60 TAGs
[INFO  ShaclTestGenerator] http://example.com/owl generated 0 SHACL-based tests
[INFO  ManualRdfunitTestReaderGenerator] http://example.com/owl identified 0 manually written tests
[INFO  ManualRdfunitTestLoaderGenerator] http://example.com/owl identified 0 predefined manual tests
[INFO  ManualRdfunitTestReaderGenerator] http://dbpedia.org identified 0 manually written tests
[INFO  ManualRdfunitTestLoaderGenerator] http://dbpedia.org identified 12 predefined manual tests
[INFO  ShaclTestGenerator] http://example.com/shacl generated 1 SHACL-based tests
[INFO  ShaclTestGenerator] http://example.com/owl generated 0 SHACL-based tests
[INFO  ManualRdfunitTestLoaderGenerator] http://example.com/owl identified 0 predefined manual tests
[INFO  ManualRdfunitTestLoaderGenerator] http://dbpedia.org identified 12 predefined manual tests
[INFO  TagRdfUnitTestGenerator] http://example.com/owl generated 2 tests using 60 TAGs
[INFO  GenerateAndCacheRdfUnitTestGenerator] 2 tests written to /tmp/9d2b3d95-14de-48de-9c78-17bcd68dbc11/Schema/example.com/owl/exowl.tests.Schema.ttl
[INFO  CacheTestGenerator] http://example.com/owl contains 2 automatically created tests (loaded from cache)
[INFO] Tests run: 4, Failures: 0, Errors: 0, Skipped: 0, Time elapsed: 0.34 s - in org.aksw.rdfunit.tests.generators.TestGeneratorFactoryTest
[INFO] Running org.aksw.rdfunit.tests.query_generation.QueryGenerationFactoryTest
[INFO] Tests run: 2, Failures: 0, Errors: 0, Skipped: 0, Time elapsed: 0.199 s - in org.aksw.rdfunit.tests.query_generation.QueryGenerationFactoryTest
[INFO] 
[INFO] Results:
[INFO] 
[ERROR] Failures: 
[ERROR]   NamespaceStatisticsTest.testGetNamespaces:39 expected:<0> but was:<1>
[ERROR] Errors: 
[ERROR]   RdfResultsWriterFactoryTest.testOutputWellFormed:76->getXmlForExecution:92 » UnknownFormatConversion
[ERROR]   RdfResultsWriterFactoryTest.testOutputWellFormed:76->getXmlForExecution:92 » UnknownFormatConversion
[INFO] 
[ERROR] Tests run: 151, Failures: 1, Errors: 2, Skipped: 1
[INFO] 
[INFO] ------------------------------------------------------------------------
[INFO] Reactor Summary:
[INFO] 
[INFO] RDFUnit - Parent 0.8.22-SNAPSHOT ................... SUCCESS [ 10.769 s]
[INFO] RDFUnit - Commons .................................. SUCCESS [ 30.272 s]
[INFO] RDFUnit - IO ....................................... SUCCESS [ 12.353 s]
[INFO] RDFUnit - Manual Tests ............................. SUCCESS [  0.245 s]
[INFO] RDFUnit - Model .................................... SUCCESS [ 12.020 s]
[INFO] RDFUnit - Core ..................................... FAILURE [ 23.495 s]
[INFO] RDFUnit - Validate 0.8.22-SNAPSHOT ................. SKIPPED
[INFO] ------------------------------------------------------------------------
[INFO] BUILD FAILURE
[INFO] ------------------------------------------------------------------------
[INFO] Total time: 01:30 min
[INFO] Finished at: 2021-04-19T16:54:52+02:00
[INFO] ------------------------------------------------------------------------
[ERROR] Failed to execute goal org.apache.maven.plugins:maven-surefire-plugin:2.22.2:test (default-test) on project rdfunit-core: There are test failures.
[ERROR] 
[ERROR] Please refer to /usr/share/tomcat8/.jenkins/jobs/RDFUnit - build deb packages/workspace/rdfunit-core/target/surefire-reports for the individual test results.
[ERROR] Please refer to dump files (if any exist) [date].dump, [date]-jvmRun[N].dump and [date].dumpstream.
[ERROR] -> [Help 1]
[ERROR] 
[ERROR] To see the full stack trace of the errors, re-run Maven with the -e switch.
[ERROR] Re-run Maven using the -X switch to enable full debug logging.
[ERROR] 
[ERROR] For more information about the errors and possible solutions, please read the following articles:
[ERROR] [Help 1] http://cwiki.apache.org/confluence/display/MAVEN/MojoFailureException
[ERROR] 
[ERROR] After correcting the problems, you can resume the build with the command
[ERROR]   mvn <goals> -rf :rdfunit-core
Build step 'Execute shell' marked build as failure
Archiving artifacts
Finished: FAILURE