FailedConsole Output

Push event to branch develop
Running as SYSTEM
Building on master in workspace /usr/share/tomcat8/.jenkins/jobs/SANSA Inference Layer/branches/develop/workspace
No credentials specified
 > git rev-parse --is-inside-work-tree # timeout=10
Fetching changes from the remote Git repository
 > git config remote.origin.url https://github.com/SANSA-Stack/SANSA-Inference.git # timeout=10
Fetching without tags
Fetching upstream changes from https://github.com/SANSA-Stack/SANSA-Inference.git
 > git --version # timeout=10
 > git fetch --no-tags --progress https://github.com/SANSA-Stack/SANSA-Inference.git +refs/heads/develop:refs/remotes/origin/develop # timeout=10
 > git rev-parse origin/develop^{commit} # timeout=10
Checking out Revision d7b8918cd206e2cd9fd527ae10fdf46b91d032af (origin/develop)
 > git config core.sparsecheckout # timeout=10
 > git checkout -f d7b8918cd206e2cd9fd527ae10fdf46b91d032af # timeout=10
Commit message: "Merge branch 'develop' of https://github.com/SANSA-Stack/SANSA-Inference into develop"
 > git rev-list --no-walk 02b91cca63ea7a0cdc0156dd89271b7a2f399641 # timeout=10
[Set GitHub commit status (universal)] PENDING on repos [GHRepository@8748a2[nodeId=MDEwOlJlcG9zaXRvcnk2NDU5OTc5Ng==,description=A general Inference API based on two of the most popular Big Data processing engines: Apache Spark and Apache Flink,homepage=,name=SANSA-Inference,fork=false,archived=false,size=1670,milestones={},language=Scala,commits={},source=<null>,parent=<null>,url=https://api.github.com/repos/SANSA-Stack/SANSA-Inference,id=64599796]] (sha:d7b8918) with context:SANSA Inference Layer/develop
Setting commit status on GitHub for https://github.com/SANSA-Stack/SANSA-Inference/commit/d7b8918cd206e2cd9fd527ae10fdf46b91d032af
Parsing POMs
using global settings config with name MyGlobalSettings
Replacing all maven server entries not found in credentials list is true
Downloaded artifact http://maven.aksw.org/archiva/repository/snapshots/net/sansa-stack/sansa-parent_2.12/0.7.2-SNAPSHOT/maven-metadata.xml
Failed to transfer Could not find metadata net.sansa-stack:sansa-parent_2.12:0.7.2-SNAPSHOT/maven-metadata.xml in apache-snapshot (https://repository.apache.org/content/repositories/snapshots/)
Failed to transfer Could not find metadata net.sansa-stack:sansa-parent_2.12:0.7.2-SNAPSHOT/maven-metadata.xml in oss-sonatype (https://oss.sonatype.org/content/repositories/snapshots/)
Discovered a new module net.sansa-stack:sansa-inference-parent_2.12 Inference API - Parent
Discovered a new module net.sansa-stack:sansa-inference-common_2.12 Inference API - Common
Discovered a new module net.sansa-stack:sansa-inference-flink_2.12 Inference API - Flink
Discovered a new module net.sansa-stack:sansa-inference-spark_2.12 Inference API - Spark
Discovered a new module net.sansa-stack:sansa-inference-tests_2.12 Inference API - Tests
Modules changed, recalculating dependency graph
Established TCP socket on 33275
[workspace] $ /usr/lib/jvm/java-8-openjdk-amd64//bin/java -Xmx2048m -Xss512m -cp /usr/share/tomcat8/.jenkins/plugins/maven-plugin/WEB-INF/lib/maven35-agent-1.13.jar:/usr/share/maven3/boot/plexus-classworlds-2.5.2.jar:/usr/share/maven3/conf/logging jenkins.maven3.agent.Maven35Main /usr/share/maven3 /var/lib/tomcat8/webapps/jenkins/WEB-INF/lib/remoting-4.3.jar /usr/share/tomcat8/.jenkins/plugins/maven-plugin/WEB-INF/lib/maven35-interceptor-1.13.jar /usr/share/tomcat8/.jenkins/plugins/maven-plugin/WEB-INF/lib/maven3-interceptor-commons-1.13.jar 33275
<===[JENKINS REMOTING CAPACITY]===>channel started
using global settings config with name MyGlobalSettings
Replacing all maven server entries not found in credentials list is true
Executing Maven:  -B -f /usr/share/tomcat8/.jenkins/jobs/SANSA Inference Layer/branches/develop/workspace/pom.xml -gs /tmp/tomcat8-tomcat8-tmp/global-settings471077036466683001.xml -DskipTests=true clean install
[INFO] Scanning for projects...
[WARNING] 
[WARNING] Some problems were encountered while building the effective model for net.sansa-stack:sansa-inference-common_2.12:jar:0.7.2-SNAPSHOT
[WARNING] 'artifactId' contains an expression but should be a constant. @ net.sansa-stack:sansa-inference-common_${scala.binary.version}:[unknown-version], /usr/share/tomcat8/.jenkins/jobs/SANSA Inference Layer/branches/develop/workspace/sansa-inference-common/pom.xml, line 10, column 15
[WARNING] 'profiles.profile[root-dir].activation.file.exists' Failed to interpolate file location ${project.basedir}/../../scalastyle-config.xml for profile root-dir: ${project.basedir} expression not supported during profile activation, use ${basedir} instead @ net.sansa-stack:sansa-inference-parent_2.12:[unknown-version], /usr/share/tomcat8/.jenkins/jobs/SANSA Inference Layer/branches/develop/workspace/pom.xml
[WARNING] Reporting configuration should be done in <reporting> section, not in maven-site-plugin <configuration> as reportPlugins parameter.
[WARNING] 
[WARNING] Some problems were encountered while building the effective model for net.sansa-stack:sansa-inference-flink_2.12:jar:0.7.2-SNAPSHOT
[WARNING] 'artifactId' contains an expression but should be a constant. @ net.sansa-stack:sansa-inference-flink_${scala.binary.version}:[unknown-version], /usr/share/tomcat8/.jenkins/jobs/SANSA Inference Layer/branches/develop/workspace/sansa-inference-flink/pom.xml, line 29, column 14
[WARNING] Reporting configuration should be done in <reporting> section, not in maven-site-plugin <configuration> as reportPlugins parameter.
[WARNING] 
[WARNING] Some problems were encountered while building the effective model for net.sansa-stack:sansa-inference-spark_2.12:jar:0.7.2-SNAPSHOT
[WARNING] 'artifactId' contains an expression but should be a constant. @ net.sansa-stack:sansa-inference-spark_${scala.binary.version}:[unknown-version], /usr/share/tomcat8/.jenkins/jobs/SANSA Inference Layer/branches/develop/workspace/sansa-inference-spark/pom.xml, line 10, column 17
[WARNING] Reporting configuration should be done in <reporting> section, not in maven-site-plugin <configuration> as reportPlugins parameter.
[WARNING] 
[WARNING] Some problems were encountered while building the effective model for net.sansa-stack:sansa-inference-tests_2.12:jar:0.7.2-SNAPSHOT
[WARNING] 'artifactId' contains an expression but should be a constant. @ net.sansa-stack:sansa-inference-tests_${scala.binary.version}:[unknown-version], /usr/share/tomcat8/.jenkins/jobs/SANSA Inference Layer/branches/develop/workspace/sansa-inference-tests/pom.xml, line 10, column 15
[WARNING] Reporting configuration should be done in <reporting> section, not in maven-site-plugin <configuration> as reportPlugins parameter.
[WARNING] 
[WARNING] Some problems were encountered while building the effective model for net.sansa-stack:sansa-inference-parent_2.12:pom:0.7.2-SNAPSHOT
[WARNING] 'profiles.profile[root-dir].activation.file.exists' Failed to interpolate file location ${project.basedir}/../../scalastyle-config.xml for profile root-dir: ${project.basedir} expression not supported during profile activation, use ${basedir} instead @ net.sansa-stack:sansa-inference-parent_2.12:[unknown-version], /usr/share/tomcat8/.jenkins/jobs/SANSA Inference Layer/branches/develop/workspace/pom.xml
[WARNING] Reporting configuration should be done in <reporting> section, not in maven-site-plugin <configuration> as reportPlugins parameter.
[WARNING] 
[WARNING] It is highly recommended to fix these problems because they threaten the stability of your build.
[WARNING] 
[WARNING] For this reason, future Maven versions might no longer support building such malformed projects.
[WARNING] 
[INFO] ------------------------------------------------------------------------
[INFO] Reactor Build Order:
[INFO] 
[INFO] Inference API - Parent                                             [pom]
[INFO] Inference API - Common                                             [jar]
[INFO] Inference API - Tests                                              [jar]
[INFO] Inference API - Flink                                              [jar]
[INFO] Inference API - Spark                                              [jar]
[INFO] 
[INFO] ------------< net.sansa-stack:sansa-inference-parent_2.12 >-------------
[INFO] Building Inference API - Parent 0.7.2-SNAPSHOT                     [1/5]
[INFO] --------------------------------[ pom ]---------------------------------
[INFO] 
[INFO] --- maven-clean-plugin:2.5:clean (default-clean) @ sansa-inference-parent_2.12 ---
[INFO] 
[INFO] --- scala-maven-plugin:4.3.1:add-source (default) @ sansa-inference-parent_2.12 ---
[INFO] Add Source directory: /usr/share/tomcat8/.jenkins/jobs/SANSA Inference Layer/branches/develop/workspace/src/main/scala
[INFO] Add Test Source directory: /usr/share/tomcat8/.jenkins/jobs/SANSA Inference Layer/branches/develop/workspace/src/test/scala
[INFO] 
[INFO] --- jacoco-maven-plugin:0.8.4:prepare-agent (prepare-agent) @ sansa-inference-parent_2.12 ---
[INFO] argLine set to "-javaagent:/usr/share/tomcat8/.m2/repository/org/jacoco/org.jacoco.agent/0.8.4/org.jacoco.agent-0.8.4-runtime.jar=destfile=/usr/share/tomcat8/.jenkins/jobs/SANSA Inference Layer/branches/develop/workspace/target/jacoco.exec"
[INFO] 
[INFO] --- scala-maven-plugin:4.3.1:compile (default) @ sansa-inference-parent_2.12 ---
[INFO] compile in 0.0 s
[INFO] No sources to compile
[INFO] 
[INFO] --- scala-maven-plugin:4.3.1:testCompile (default) @ sansa-inference-parent_2.12 ---
[INFO] compile in 0.0 s
[INFO] No sources to compile
[INFO] 
[INFO] --- scalatest-maven-plugin:2.0.0:test (test) @ sansa-inference-parent_2.12 ---
[INFO] Tests are skipped.
[INFO] 
[INFO] --- maven-javadoc-plugin:3.1.1:jar (attach-javadocs) @ sansa-inference-parent_2.12 ---
[INFO] Not executing Javadoc as the project is not a Java classpath-capable package
[INFO] 
[INFO] >>> scala-maven-plugin:4.3.1:doc-jar (attach-javadocs) > generate-resources @ sansa-inference-parent_2.12 >>>
[INFO] 
[INFO] --- scala-maven-plugin:4.3.1:add-source (default) @ sansa-inference-parent_2.12 ---
[INFO] 
[INFO] --- jacoco-maven-plugin:0.8.4:prepare-agent (prepare-agent) @ sansa-inference-parent_2.12 ---
[INFO] argLine set to "-javaagent:/usr/share/tomcat8/.m2/repository/org/jacoco/org.jacoco.agent/0.8.4/org.jacoco.agent-0.8.4-runtime.jar=destfile=/usr/share/tomcat8/.jenkins/jobs/SANSA Inference Layer/branches/develop/workspace/target/jacoco.exec"
[WARNING] Failed to getClass for scala_maven.ScalaDocJarMojo
[INFO] 
[INFO] <<< scala-maven-plugin:4.3.1:doc-jar (attach-javadocs) < generate-resources @ sansa-inference-parent_2.12 <<<
[INFO] 
[INFO] 
[INFO] --- scala-maven-plugin:4.3.1:doc-jar (attach-javadocs) @ sansa-inference-parent_2.12 ---
[INFO] No source files found
[INFO] 
[INFO] --- maven-source-plugin:3.0.1:jar-no-fork (attach-sources) @ sansa-inference-parent_2.12 ---
[INFO] 
[INFO] --- maven-install-plugin:2.4:install (default-install) @ sansa-inference-parent_2.12 ---
[INFO] Installing /usr/share/tomcat8/.jenkins/jobs/SANSA Inference Layer/branches/develop/workspace/pom.xml to /usr/share/tomcat8/.m2/repository/net/sansa-stack/sansa-inference-parent_2.12/0.7.2-SNAPSHOT/sansa-inference-parent_2.12-0.7.2-SNAPSHOT.pom
[INFO] 
[INFO] ------------< net.sansa-stack:sansa-inference-common_2.12 >-------------
[INFO] Building Inference API - Common 0.7.2-SNAPSHOT                     [2/5]
[INFO] --------------------------------[ jar ]---------------------------------
[INFO] Downloading from oss-sonatype: https://oss.sonatype.org/content/repositories/snapshots/org/scala-graph/graph-core_2.12/1.12.5/graph-core_2.12-1.12.5.pom
[INFO] Downloading from apache-snapshot: https://repository.apache.org/content/repositories/snapshots/org/scala-graph/graph-core_2.12/1.12.5/graph-core_2.12-1.12.5.pom
[INFO] Downloading from oss-sonatype-releases: https://oss.sonatype.org/content/repositories/releases/org/scala-graph/graph-core_2.12/1.12.5/graph-core_2.12-1.12.5.pom
[INFO] Downloaded from oss-sonatype-releases: https://oss.sonatype.org/content/repositories/releases/org/scala-graph/graph-core_2.12/1.12.5/graph-core_2.12-1.12.5.pom (2.3 kB at 5.4 kB/s)
[INFO] Downloading from oss-sonatype: https://oss.sonatype.org/content/repositories/snapshots/org/scala-graph/graph-dot_2.12/1.11.5/graph-dot_2.12-1.11.5.pom
[INFO] Downloading from apache-snapshot: https://repository.apache.org/content/repositories/snapshots/org/scala-graph/graph-dot_2.12/1.11.5/graph-dot_2.12-1.11.5.pom
[INFO] Downloading from oss-sonatype-releases: https://oss.sonatype.org/content/repositories/releases/org/scala-graph/graph-dot_2.12/1.11.5/graph-dot_2.12-1.11.5.pom
[INFO] Downloaded from oss-sonatype-releases: https://oss.sonatype.org/content/repositories/releases/org/scala-graph/graph-dot_2.12/1.11.5/graph-dot_2.12-1.11.5.pom (2.2 kB at 7.6 kB/s)
[INFO] Downloading from oss-sonatype: https://oss.sonatype.org/content/repositories/snapshots/org/scalatestplus/junit-4-12_2.12/3.2.0.0/junit-4-12_2.12-3.2.0.0.pom
[INFO] Downloading from apache-snapshot: https://repository.apache.org/content/repositories/snapshots/org/scalatestplus/junit-4-12_2.12/3.2.0.0/junit-4-12_2.12-3.2.0.0.pom
[INFO] Downloading from oss-sonatype-releases: https://oss.sonatype.org/content/repositories/releases/org/scalatestplus/junit-4-12_2.12/3.2.0.0/junit-4-12_2.12-3.2.0.0.pom
[INFO] Downloaded from oss-sonatype-releases: https://oss.sonatype.org/content/repositories/releases/org/scalatestplus/junit-4-12_2.12/3.2.0.0/junit-4-12_2.12-3.2.0.0.pom (2.7 kB at 9.2 kB/s)
[INFO] Downloading from oss-sonatype: https://oss.sonatype.org/content/repositories/snapshots/org/scalatest/scalatest-core_2.12/3.2.0/scalatest-core_2.12-3.2.0.pom
[INFO] Downloading from apache-snapshot: https://repository.apache.org/content/repositories/snapshots/org/scalatest/scalatest-core_2.12/3.2.0/scalatest-core_2.12-3.2.0.pom
[INFO] Downloading from oss-sonatype-releases: https://oss.sonatype.org/content/repositories/releases/org/scalatest/scalatest-core_2.12/3.2.0/scalatest-core_2.12-3.2.0.pom
[INFO] Downloaded from oss-sonatype-releases: https://oss.sonatype.org/content/repositories/releases/org/scalatest/scalatest-core_2.12/3.2.0/scalatest-core_2.12-3.2.0.pom (3.9 kB at 13 kB/s)
[INFO] Downloading from oss-sonatype: https://oss.sonatype.org/content/repositories/snapshots/org/scalatest/scalatest-compatible/3.2.0/scalatest-compatible-3.2.0.pom
[INFO] Downloading from apache-snapshot: https://repository.apache.org/content/repositories/snapshots/org/scalatest/scalatest-compatible/3.2.0/scalatest-compatible-3.2.0.pom
[INFO] Downloading from oss-sonatype-releases: https://oss.sonatype.org/content/repositories/releases/org/scalatest/scalatest-compatible/3.2.0/scalatest-compatible-3.2.0.pom
[INFO] Downloaded from oss-sonatype-releases: https://oss.sonatype.org/content/repositories/releases/org/scalatest/scalatest-compatible/3.2.0/scalatest-compatible-3.2.0.pom (1.7 kB at 5.6 kB/s)
[INFO] Downloading from oss-sonatype: https://oss.sonatype.org/content/repositories/snapshots/org/scalactic/scalactic_2.12/3.2.0/scalactic_2.12-3.2.0.pom
[INFO] Downloading from apache-snapshot: https://repository.apache.org/content/repositories/snapshots/org/scalactic/scalactic_2.12/3.2.0/scalactic_2.12-3.2.0.pom
[INFO] Downloading from oss-sonatype-releases: https://oss.sonatype.org/content/repositories/releases/org/scalactic/scalactic_2.12/3.2.0/scalactic_2.12-3.2.0.pom
[INFO] Downloaded from oss-sonatype-releases: https://oss.sonatype.org/content/repositories/releases/org/scalactic/scalactic_2.12/3.2.0/scalactic_2.12-3.2.0.pom (2.2 kB at 7.7 kB/s)
[INFO] Downloading from oss-sonatype: https://oss.sonatype.org/content/repositories/snapshots/org/scala-graph/graph-core_2.12/1.12.5/graph-core_2.12-1.12.5.jar
[INFO] Downloading from oss-sonatype: https://oss.sonatype.org/content/repositories/snapshots/org/scala-graph/graph-dot_2.12/1.11.5/graph-dot_2.12-1.11.5.jar
[INFO] Downloading from oss-sonatype: https://oss.sonatype.org/content/repositories/snapshots/org/scalatestplus/junit-4-12_2.12/3.2.0.0/junit-4-12_2.12-3.2.0.0.jar
[INFO] Downloading from oss-sonatype: https://oss.sonatype.org/content/repositories/snapshots/org/scalatest/scalatest-core_2.12/3.2.0/scalatest-core_2.12-3.2.0.jar
[INFO] Downloading from oss-sonatype: https://oss.sonatype.org/content/repositories/snapshots/org/scalatest/scalatest-compatible/3.2.0/scalatest-compatible-3.2.0.jar
[INFO] Downloading from apache-snapshot: https://repository.apache.org/content/repositories/snapshots/org/scala-graph/graph-core_2.12/1.12.5/graph-core_2.12-1.12.5.jar
[INFO] Downloading from apache-snapshot: https://repository.apache.org/content/repositories/snapshots/org/scala-graph/graph-dot_2.12/1.11.5/graph-dot_2.12-1.11.5.jar
[INFO] Downloading from apache-snapshot: https://repository.apache.org/content/repositories/snapshots/org/scalatestplus/junit-4-12_2.12/3.2.0.0/junit-4-12_2.12-3.2.0.0.jar
[INFO] Downloading from apache-snapshot: https://repository.apache.org/content/repositories/snapshots/org/scalatest/scalatest-core_2.12/3.2.0/scalatest-core_2.12-3.2.0.jar
[INFO] Downloading from apache-snapshot: https://repository.apache.org/content/repositories/snapshots/org/scalatest/scalatest-compatible/3.2.0/scalatest-compatible-3.2.0.jar
[INFO] Downloading from oss-sonatype-releases: https://oss.sonatype.org/content/repositories/releases/org/scala-graph/graph-core_2.12/1.12.5/graph-core_2.12-1.12.5.jar
[INFO] Downloading from oss-sonatype-releases: https://oss.sonatype.org/content/repositories/releases/org/scala-graph/graph-dot_2.12/1.11.5/graph-dot_2.12-1.11.5.jar
[INFO] Downloading from oss-sonatype-releases: https://oss.sonatype.org/content/repositories/releases/org/scalatestplus/junit-4-12_2.12/3.2.0.0/junit-4-12_2.12-3.2.0.0.jar
[INFO] Downloading from oss-sonatype-releases: https://oss.sonatype.org/content/repositories/releases/org/scalatest/scalatest-core_2.12/3.2.0/scalatest-core_2.12-3.2.0.jar
[INFO] Downloading from oss-sonatype-releases: https://oss.sonatype.org/content/repositories/releases/org/scalatest/scalatest-compatible/3.2.0/scalatest-compatible-3.2.0.jar
[INFO] Downloaded from oss-sonatype-releases: https://oss.sonatype.org/content/repositories/releases/org/scalatest/scalatest-compatible/3.2.0/scalatest-compatible-3.2.0.jar (1.4 kB at 4.1 kB/s)
[INFO] Downloaded from oss-sonatype-releases: https://oss.sonatype.org/content/repositories/releases/org/scala-graph/graph-dot_2.12/1.11.5/graph-dot_2.12-1.11.5.jar (94 kB at 273 kB/s)
[INFO] Downloaded from oss-sonatype-releases: https://oss.sonatype.org/content/repositories/releases/org/scalatestplus/junit-4-12_2.12/3.2.0.0/junit-4-12_2.12-3.2.0.0.jar (81 kB at 211 kB/s)
[INFO] Downloaded from oss-sonatype-releases: https://oss.sonatype.org/content/repositories/releases/org/scala-graph/graph-core_2.12/1.12.5/graph-core_2.12-1.12.5.jar (1.5 MB at 3.3 MB/s)
[INFO] Downloaded from oss-sonatype-releases: https://oss.sonatype.org/content/repositories/releases/org/scalatest/scalatest-core_2.12/3.2.0/scalatest-core_2.12-3.2.0.jar (3.7 MB at 4.7 MB/s)
[INFO] 
[INFO] --- maven-clean-plugin:2.5:clean (default-clean) @ sansa-inference-common_2.12 ---
[INFO] Deleting /usr/share/tomcat8/.jenkins/jobs/SANSA Inference Layer/branches/develop/workspace/sansa-inference-common/target
[INFO] 
[INFO] --- scala-maven-plugin:4.3.1:add-source (default) @ sansa-inference-common_2.12 ---
[INFO] Add Source directory: /usr/share/tomcat8/.jenkins/jobs/SANSA Inference Layer/branches/develop/workspace/sansa-inference-common/src/main/scala
[INFO] Add Test Source directory: /usr/share/tomcat8/.jenkins/jobs/SANSA Inference Layer/branches/develop/workspace/sansa-inference-common/src/test/scala
[INFO] 
[INFO] --- jacoco-maven-plugin:0.8.4:prepare-agent (prepare-agent) @ sansa-inference-common_2.12 ---
[INFO] argLine set to "-javaagent:/usr/share/tomcat8/.m2/repository/org/jacoco/org.jacoco.agent/0.8.4/org.jacoco.agent-0.8.4-runtime.jar=destfile=/usr/share/tomcat8/.jenkins/jobs/SANSA Inference Layer/branches/develop/workspace/sansa-inference-common/target/jacoco.exec"
[INFO] 
[INFO] --- maven-resources-plugin:3.0.2:resources (default-resources) @ sansa-inference-common_2.12 ---
[INFO] Using 'UTF-8' encoding to copy filtered resources.
[INFO] Copying 7 resources
[INFO] 
[INFO] --- maven-compiler-plugin:3.8.1:compile (default-compile) @ sansa-inference-common_2.12 ---
[INFO] Nothing to compile - all classes are up to date
[INFO] 
[INFO] --- scala-maven-plugin:4.3.1:compile (default) @ sansa-inference-common_2.12 ---
[INFO] Using incremental compilation using Mixed compile order
[INFO] Compiler bridge file: /usr/share/tomcat8/.sbt/1.0/zinc/org.scala-sbt/org.scala-sbt-compiler-bridge_2.12-1.3.2-bin_2.12.11__52.0-1.3.2_20200115T025827.jar
[INFO] Compiling 62 Scala sources to /usr/share/tomcat8/.jenkins/jobs/SANSA Inference Layer/branches/develop/workspace/sansa-inference-common/target/classes ...
[WARNING] [Warn] /usr/share/tomcat8/.jenkins/jobs/SANSA Inference Layer/branches/develop/workspace/sansa-inference-common/src/main/scala/scalax/collection/connectivity/GraphComponents.scala:179: abstract type pattern GraphComponents.this.g.NodeT is unchecked since it is eliminated by erasure
[WARNING] [Warn] /usr/share/tomcat8/.jenkins/jobs/SANSA Inference Layer/branches/develop/workspace/sansa-inference-common/src/main/scala/scalax/collection/connectivity/GraphComponents.scala:204: abstract type pattern GraphComponents.this.g.NodeT is unchecked since it is eliminated by erasure
[WARNING] [Warn] /usr/share/tomcat8/.jenkins/jobs/SANSA Inference Layer/branches/develop/workspace/sansa-inference-common/src/main/scala/scalax/collection/connectivity/GraphComponents.scala:20: higher-kinded type should be enabled
by making the implicit value scala.language.higherKinds visible.
This can be achieved by adding the import clause 'import scala.language.higherKinds'
or by setting the compiler option -language:higherKinds.
See the Scaladoc for value scala.language.higherKinds for a discussion
why the feature should be explicitly enabled.
[WARNING] [Warn] /usr/share/tomcat8/.jenkins/jobs/SANSA Inference Layer/branches/develop/workspace/sansa-inference-common/src/main/scala/scalax/collection/connectivity/GraphComponents.scala:217: higher-kinded type should be enabled
by making the implicit value scala.language.higherKinds visible.
[WARNING] [Warn] /usr/share/tomcat8/.jenkins/jobs/SANSA Inference Layer/branches/develop/workspace/sansa-inference-common/src/main/scala/scalax/collection/connectivity/GraphComponents.scala:217: implicit conversion method graphToComponents should be enabled
by making the implicit value scala.language.implicitConversions visible.
This can be achieved by adding the import clause 'import scala.language.implicitConversions'
or by setting the compiler option -language:implicitConversions.
See the Scaladoc for value scala.language.implicitConversions for a discussion
why the feature should be explicitly enabled.
[WARNING] [Warn] /usr/share/tomcat8/.jenkins/jobs/SANSA Inference Layer/branches/develop/workspace/sansa-inference-common/src/main/scala/net/sansa_stack/inference/data/SimpleRDFOps.scala:32: unreachable code
[WARNING] [Warn] /usr/share/tomcat8/.jenkins/jobs/SANSA Inference Layer/branches/develop/workspace/sansa-inference-common/src/main/scala/net/sansa_stack/inference/rules/RuleDependencyGraphGenerator.scala:237: class CycleDetector in package alg is deprecated: see corresponding Javadoc for more information.
[WARNING] [Warn] /usr/share/tomcat8/.jenkins/jobs/SANSA Inference Layer/branches/develop/workspace/sansa-inference-common/src/main/scala/net/sansa_stack/inference/rules/minimizer/RuleDependencyGraphMinimizer.scala:285: class CycleDetector in package alg is deprecated: see corresponding Javadoc for more information.
[WARNING] 8 warnings found
[INFO] Done compiling.
[INFO] compile in 17.7 s
[INFO] 
[INFO] --- maven-resources-plugin:3.0.2:testResources (default-testResources) @ sansa-inference-common_2.12 ---
[INFO] Using 'UTF-8' encoding to copy filtered resources.
[INFO] skip non existing resourceDirectory /usr/share/tomcat8/.jenkins/jobs/SANSA Inference Layer/branches/develop/workspace/sansa-inference-common/src/test/resources
[INFO] 
[INFO] --- maven-compiler-plugin:3.8.1:testCompile (default-testCompile) @ sansa-inference-common_2.12 ---
[INFO] Changes detected - recompiling the module!
[INFO] 
[INFO] --- scala-maven-plugin:4.3.1:testCompile (default) @ sansa-inference-common_2.12 ---
[INFO] Using incremental compilation using Mixed compile order
[INFO] Compiler bridge file: /usr/share/tomcat8/.sbt/1.0/zinc/org.scala-sbt/org.scala-sbt-compiler-bridge_2.12-1.3.2-bin_2.12.11__52.0-1.3.2_20200115T025827.jar
[INFO] Compiling 1 Scala source to /usr/share/tomcat8/.jenkins/jobs/SANSA Inference Layer/branches/develop/workspace/sansa-inference-common/target/test-classes ...
[INFO] Done compiling.
[INFO] compile in 5.2 s
[INFO] 
[INFO] --- maven-surefire-plugin:2.20.1:test (default-test) @ sansa-inference-common_2.12 ---
[INFO] Tests are skipped.
[INFO] 
[INFO] --- scalatest-maven-plugin:2.0.0:test (test) @ sansa-inference-common_2.12 ---
[INFO] Tests are skipped.
[INFO] 
[INFO] --- maven-jar-plugin:2.4:jar (default-jar) @ sansa-inference-common_2.12 ---
[INFO] Building jar: /usr/share/tomcat8/.jenkins/jobs/SANSA Inference Layer/branches/develop/workspace/sansa-inference-common/target/sansa-inference-common_2.12-0.7.2-SNAPSHOT.jar
[INFO] 
[INFO] --- maven-javadoc-plugin:3.1.1:jar (attach-javadocs) @ sansa-inference-common_2.12 ---
[INFO] 
[INFO] >>> scala-maven-plugin:4.3.1:doc-jar (attach-javadocs) > generate-resources @ sansa-inference-common_2.12 >>>
[INFO] 
[INFO] --- scala-maven-plugin:4.3.1:add-source (default) @ sansa-inference-common_2.12 ---
[INFO] 
[INFO] --- jacoco-maven-plugin:0.8.4:prepare-agent (prepare-agent) @ sansa-inference-common_2.12 ---
[INFO] argLine set to "-javaagent:/usr/share/tomcat8/.m2/repository/org/jacoco/org.jacoco.agent/0.8.4/org.jacoco.agent-0.8.4-runtime.jar=destfile=/usr/share/tomcat8/.jenkins/jobs/SANSA Inference Layer/branches/develop/workspace/sansa-inference-common/target/jacoco.exec"
[WARNING] Failed to getClass for scala_maven.ScalaDocJarMojo
[INFO] 
[INFO] <<< scala-maven-plugin:4.3.1:doc-jar (attach-javadocs) < generate-resources @ sansa-inference-common_2.12 <<<
[INFO] 
[INFO] 
[INFO] --- scala-maven-plugin:4.3.1:doc-jar (attach-javadocs) @ sansa-inference-common_2.12 ---
/usr/share/tomcat8/.jenkins/jobs/SANSA Inference Layer/branches/develop/workspace/sansa-inference-common/src/main/scala/scalax/collection/connectivity/GraphComponents.scala:179: warning: abstract type pattern GraphComponents.this.g.NodeT is unchecked since it is eliminated by erasure
      for (v: g.NodeT <- n.diSuccessors) {
                ^
/usr/share/tomcat8/.jenkins/jobs/SANSA Inference Layer/branches/develop/workspace/sansa-inference-common/src/main/scala/scalax/collection/connectivity/GraphComponents.scala:204: warning: abstract type pattern GraphComponents.this.g.NodeT is unchecked since it is eliminated by erasure
    for (n: g.NodeT <- g.nodes if (discovery.get(n) == None)) {
              ^
warning: there were three feature warnings; re-run with -feature for details
model contains 106 documentable templates
/usr/share/tomcat8/.jenkins/jobs/SANSA Inference Layer/branches/develop/workspace/sansa-inference-common/src/main/scala/net/sansa_stack/inference/rules/ReasoningProfile.scala:12: warning: Could not find any member to link for "NoSuchElementException".
  /**
  ^
four warnings found
[INFO] Building jar: /usr/share/tomcat8/.jenkins/jobs/SANSA Inference Layer/branches/develop/workspace/sansa-inference-common/target/sansa-inference-common_2.12-0.7.2-SNAPSHOT-javadoc.jar
[INFO] 
[INFO] --- maven-source-plugin:3.0.1:jar-no-fork (attach-sources) @ sansa-inference-common_2.12 ---
[INFO] Building jar: /usr/share/tomcat8/.jenkins/jobs/SANSA Inference Layer/branches/develop/workspace/sansa-inference-common/target/sansa-inference-common_2.12-0.7.2-SNAPSHOT-sources.jar
[INFO] 
[INFO] --- maven-install-plugin:2.4:install (default-install) @ sansa-inference-common_2.12 ---
[INFO] Installing /usr/share/tomcat8/.jenkins/jobs/SANSA Inference Layer/branches/develop/workspace/sansa-inference-common/target/sansa-inference-common_2.12-0.7.2-SNAPSHOT.jar to /usr/share/tomcat8/.m2/repository/net/sansa-stack/sansa-inference-common_2.12/0.7.2-SNAPSHOT/sansa-inference-common_2.12-0.7.2-SNAPSHOT.jar
[INFO] Installing /usr/share/tomcat8/.jenkins/jobs/SANSA Inference Layer/branches/develop/workspace/sansa-inference-common/pom.xml to /usr/share/tomcat8/.m2/repository/net/sansa-stack/sansa-inference-common_2.12/0.7.2-SNAPSHOT/sansa-inference-common_2.12-0.7.2-SNAPSHOT.pom
[INFO] Installing /usr/share/tomcat8/.jenkins/jobs/SANSA Inference Layer/branches/develop/workspace/sansa-inference-common/target/sansa-inference-common_2.12-0.7.2-SNAPSHOT-javadoc.jar to /usr/share/tomcat8/.m2/repository/net/sansa-stack/sansa-inference-common_2.12/0.7.2-SNAPSHOT/sansa-inference-common_2.12-0.7.2-SNAPSHOT-javadoc.jar
[INFO] Installing /usr/share/tomcat8/.jenkins/jobs/SANSA Inference Layer/branches/develop/workspace/sansa-inference-common/target/sansa-inference-common_2.12-0.7.2-SNAPSHOT-sources.jar to /usr/share/tomcat8/.m2/repository/net/sansa-stack/sansa-inference-common_2.12/0.7.2-SNAPSHOT/sansa-inference-common_2.12-0.7.2-SNAPSHOT-sources.jar
[INFO] 
[INFO] -------------< net.sansa-stack:sansa-inference-tests_2.12 >-------------
[INFO] Building Inference API - Tests 0.7.2-SNAPSHOT                      [3/5]
[INFO] --------------------------------[ jar ]---------------------------------
[INFO] Downloading from oss-sonatype: https://oss.sonatype.org/content/repositories/snapshots/org/specs2/specs2-core_2.12/4.0.3/specs2-core_2.12-4.0.3.pom
[INFO] Downloading from apache-snapshot: https://repository.apache.org/content/repositories/snapshots/org/specs2/specs2-core_2.12/4.0.3/specs2-core_2.12-4.0.3.pom
[INFO] Downloading from oss-sonatype-releases: https://oss.sonatype.org/content/repositories/releases/org/specs2/specs2-core_2.12/4.0.3/specs2-core_2.12-4.0.3.pom
[INFO] Downloaded from oss-sonatype-releases: https://oss.sonatype.org/content/repositories/releases/org/specs2/specs2-core_2.12/4.0.3/specs2-core_2.12-4.0.3.pom (2.6 kB at 8.7 kB/s)
[INFO] Downloading from oss-sonatype: https://oss.sonatype.org/content/repositories/snapshots/org/specs2/specs2-matcher_2.12/4.0.3/specs2-matcher_2.12-4.0.3.pom
[INFO] Downloading from apache-snapshot: https://repository.apache.org/content/repositories/snapshots/org/specs2/specs2-matcher_2.12/4.0.3/specs2-matcher_2.12-4.0.3.pom
[INFO] Downloading from oss-sonatype-releases: https://oss.sonatype.org/content/repositories/releases/org/specs2/specs2-matcher_2.12/4.0.3/specs2-matcher_2.12-4.0.3.pom
[INFO] Downloaded from oss-sonatype-releases: https://oss.sonatype.org/content/repositories/releases/org/specs2/specs2-matcher_2.12/4.0.3/specs2-matcher_2.12-4.0.3.pom (1.6 kB at 5.4 kB/s)
[INFO] Downloading from oss-sonatype: https://oss.sonatype.org/content/repositories/snapshots/org/specs2/specs2-common_2.12/4.0.3/specs2-common_2.12-4.0.3.pom
[INFO] Downloading from apache-snapshot: https://repository.apache.org/content/repositories/snapshots/org/specs2/specs2-common_2.12/4.0.3/specs2-common_2.12-4.0.3.pom
[INFO] Downloading from oss-sonatype-releases: https://oss.sonatype.org/content/repositories/releases/org/specs2/specs2-common_2.12/4.0.3/specs2-common_2.12-4.0.3.pom
[INFO] Downloaded from oss-sonatype-releases: https://oss.sonatype.org/content/repositories/releases/org/specs2/specs2-common_2.12/4.0.3/specs2-common_2.12-4.0.3.pom (2.4 kB at 7.8 kB/s)
[INFO] Downloading from oss-sonatype: https://oss.sonatype.org/content/repositories/snapshots/org/specs2/specs2-fp_2.12/4.0.3/specs2-fp_2.12-4.0.3.pom
[INFO] Downloading from apache-snapshot: https://repository.apache.org/content/repositories/snapshots/org/specs2/specs2-fp_2.12/4.0.3/specs2-fp_2.12-4.0.3.pom
[INFO] Downloading from oss-sonatype-releases: https://oss.sonatype.org/content/repositories/releases/org/specs2/specs2-fp_2.12/4.0.3/specs2-fp_2.12-4.0.3.pom
[INFO] Downloaded from oss-sonatype-releases: https://oss.sonatype.org/content/repositories/releases/org/specs2/specs2-fp_2.12/4.0.3/specs2-fp_2.12-4.0.3.pom (1.4 kB at 4.6 kB/s)
[INFO] Downloading from oss-sonatype: https://oss.sonatype.org/content/repositories/snapshots/org/specs2/specs2-junit_2.12/4.0.3/specs2-junit_2.12-4.0.3.pom
[INFO] Downloading from apache-snapshot: https://repository.apache.org/content/repositories/snapshots/org/specs2/specs2-junit_2.12/4.0.3/specs2-junit_2.12-4.0.3.pom
[INFO] Downloading from oss-sonatype-releases: https://oss.sonatype.org/content/repositories/releases/org/specs2/specs2-junit_2.12/4.0.3/specs2-junit_2.12-4.0.3.pom
[INFO] Downloaded from oss-sonatype-releases: https://oss.sonatype.org/content/repositories/releases/org/specs2/specs2-junit_2.12/4.0.3/specs2-junit_2.12-4.0.3.pom (2.8 kB at 9.4 kB/s)
[INFO] Downloading from oss-sonatype: https://oss.sonatype.org/content/repositories/snapshots/org/specs2/specs2-core_2.12/4.0.3/specs2-core_2.12-4.0.3.jar
[INFO] Downloading from oss-sonatype: https://oss.sonatype.org/content/repositories/snapshots/org/specs2/specs2-matcher_2.12/4.0.3/specs2-matcher_2.12-4.0.3.jar
[INFO] Downloading from oss-sonatype: https://oss.sonatype.org/content/repositories/snapshots/org/specs2/specs2-common_2.12/4.0.3/specs2-common_2.12-4.0.3.jar
[INFO] Downloading from oss-sonatype: https://oss.sonatype.org/content/repositories/snapshots/org/specs2/specs2-fp_2.12/4.0.3/specs2-fp_2.12-4.0.3.jar
[INFO] Downloading from oss-sonatype: https://oss.sonatype.org/content/repositories/snapshots/org/specs2/specs2-junit_2.12/4.0.3/specs2-junit_2.12-4.0.3.jar
[INFO] Downloading from apache-snapshot: https://repository.apache.org/content/repositories/snapshots/org/specs2/specs2-core_2.12/4.0.3/specs2-core_2.12-4.0.3.jar
[INFO] Downloading from apache-snapshot: https://repository.apache.org/content/repositories/snapshots/org/specs2/specs2-matcher_2.12/4.0.3/specs2-matcher_2.12-4.0.3.jar
[INFO] Downloading from apache-snapshot: https://repository.apache.org/content/repositories/snapshots/org/specs2/specs2-common_2.12/4.0.3/specs2-common_2.12-4.0.3.jar
[INFO] Downloading from apache-snapshot: https://repository.apache.org/content/repositories/snapshots/org/specs2/specs2-fp_2.12/4.0.3/specs2-fp_2.12-4.0.3.jar
[INFO] Downloading from apache-snapshot: https://repository.apache.org/content/repositories/snapshots/org/specs2/specs2-junit_2.12/4.0.3/specs2-junit_2.12-4.0.3.jar
[INFO] Downloading from oss-sonatype-releases: https://oss.sonatype.org/content/repositories/releases/org/specs2/specs2-core_2.12/4.0.3/specs2-core_2.12-4.0.3.jar
[INFO] Downloading from oss-sonatype-releases: https://oss.sonatype.org/content/repositories/releases/org/specs2/specs2-matcher_2.12/4.0.3/specs2-matcher_2.12-4.0.3.jar
[INFO] Downloading from oss-sonatype-releases: https://oss.sonatype.org/content/repositories/releases/org/specs2/specs2-common_2.12/4.0.3/specs2-common_2.12-4.0.3.jar
[INFO] Downloading from oss-sonatype-releases: https://oss.sonatype.org/content/repositories/releases/org/specs2/specs2-fp_2.12/4.0.3/specs2-fp_2.12-4.0.3.jar
[INFO] Downloading from oss-sonatype-releases: https://oss.sonatype.org/content/repositories/releases/org/specs2/specs2-junit_2.12/4.0.3/specs2-junit_2.12-4.0.3.jar
[INFO] Downloaded from oss-sonatype-releases: https://oss.sonatype.org/content/repositories/releases/org/specs2/specs2-junit_2.12/4.0.3/specs2-junit_2.12-4.0.3.jar (146 kB at 476 kB/s)
[INFO] Downloaded from oss-sonatype-releases: https://oss.sonatype.org/content/repositories/releases/org/specs2/specs2-fp_2.12/4.0.3/specs2-fp_2.12-4.0.3.jar (223 kB at 725 kB/s)
[INFO] Downloaded from oss-sonatype-releases: https://oss.sonatype.org/content/repositories/releases/org/specs2/specs2-matcher_2.12/4.0.3/specs2-matcher_2.12-4.0.3.jar (1.6 MB at 3.8 MB/s)
[INFO] Downloaded from oss-sonatype-releases: https://oss.sonatype.org/content/repositories/releases/org/specs2/specs2-core_2.12/4.0.3/specs2-core_2.12-4.0.3.jar (1.4 MB at 2.8 MB/s)
[INFO] Downloaded from oss-sonatype-releases: https://oss.sonatype.org/content/repositories/releases/org/specs2/specs2-common_2.12/4.0.3/specs2-common_2.12-4.0.3.jar (2.1 MB at 3.0 MB/s)
[INFO] 
[INFO] --- maven-clean-plugin:2.5:clean (default-clean) @ sansa-inference-tests_2.12 ---
[INFO] Deleting /usr/share/tomcat8/.jenkins/jobs/SANSA Inference Layer/branches/develop/workspace/sansa-inference-tests/target
[INFO] 
[INFO] --- scala-maven-plugin:4.3.1:add-source (default) @ sansa-inference-tests_2.12 ---
[INFO] 
[INFO] --- jacoco-maven-plugin:0.8.4:prepare-agent (prepare-agent) @ sansa-inference-tests_2.12 ---
[INFO] argLine set to "-javaagent:/usr/share/tomcat8/.m2/repository/org/jacoco/org.jacoco.agent/0.8.4/org.jacoco.agent-0.8.4-runtime.jar=destfile=/usr/share/tomcat8/.jenkins/jobs/SANSA Inference Layer/branches/develop/workspace/sansa-inference-tests/target/jacoco.exec"
[INFO] 
[INFO] --- maven-resources-plugin:3.0.2:resources (default-resources) @ sansa-inference-tests_2.12 ---
[INFO] Using 'UTF-8' encoding to copy filtered resources.
[INFO] skip non existing resourceDirectory /usr/share/tomcat8/.jenkins/jobs/SANSA Inference Layer/branches/develop/workspace/sansa-inference-tests/src/main/resources
[INFO] 
[INFO] --- maven-compiler-plugin:3.8.1:compile (default-compile) @ sansa-inference-tests_2.12 ---
[INFO] No sources to compile
[INFO] 
[INFO] --- scala-maven-plugin:4.3.1:compile (default) @ sansa-inference-tests_2.12 ---
[INFO] compile in 0.0 s
[INFO] No sources to compile
[INFO] 
[INFO] --- maven-resources-plugin:3.0.2:testResources (default-testResources) @ sansa-inference-tests_2.12 ---
[INFO] Using 'UTF-8' encoding to copy filtered resources.
[INFO] Copying 1343 resources
[INFO] 
[INFO] --- maven-compiler-plugin:3.8.1:testCompile (default-testCompile) @ sansa-inference-tests_2.12 ---
[INFO] Changes detected - recompiling the module!
[INFO] Compiling 1 source file to /usr/share/tomcat8/.jenkins/jobs/SANSA Inference Layer/branches/develop/workspace/sansa-inference-tests/target/test-classes
[INFO] 
[INFO] --- scala-maven-plugin:4.3.1:testCompile (default) @ sansa-inference-tests_2.12 ---
[INFO] Using incremental compilation using Mixed compile order
[INFO] Compiler bridge file: /usr/share/tomcat8/.sbt/1.0/zinc/org.scala-sbt/org.scala-sbt-compiler-bridge_2.12-1.3.2-bin_2.12.11__52.0-1.3.2_20200115T025827.jar
[INFO] Compiling 5 Scala sources and 1 Java source to /usr/share/tomcat8/.jenkins/jobs/SANSA Inference Layer/branches/develop/workspace/sansa-inference-tests/target/test-classes ...
[WARNING] [Warn] : Supported source version 'RELEASE_7' from annotation processor 'org.netbeans.modules.openide.filesystems.declmime.MIMEResolverProcessor' less than -source '1.8'
[WARNING] [Warn] : Supported source version 'RELEASE_6' from annotation processor 'org.netbeans.modules.openide.util.NbBundleProcessor' less than -source '1.8'
[WARNING] [Warn] : Supported source version 'RELEASE_7' from annotation processor 'org.netbeans.modules.openide.util.ServiceProviderProcessor' less than -source '1.8'
[WARNING] [Warn] : Supported source version 'RELEASE_7' from annotation processor 'org.netbeans.modules.openide.util.NamedServiceProcessor' less than -source '1.8'
[WARNING] [Warn] : Supported source version 'RELEASE_7' from annotation processor 'org.netbeans.modules.openide.awt.ActionProcessor' less than -source '1.8'
[WARNING] [Warn] : Supported source version 'RELEASE_7' from annotation processor 'org.netbeans.modules.intent.OpenUriHandlerProcessor' less than -source '1.8'
[WARNING] [Warn] : Supported source version 'RELEASE_7' from annotation processor 'org.netbeans.modules.openide.loaders.DataObjectFactoryProcessor' less than -source '1.8'
[WARNING] [Warn] : Supported source version 'RELEASE_7' from annotation processor 'org.netbeans.modules.editor.mimelookup.CreateRegistrationProcessor' less than -source '1.8'
[WARNING] [Warn] : Supported source version 'RELEASE_7' from annotation processor 'org.netbeans.modules.templates.TemplateProcessor' less than -source '1.8'
[WARNING] [Warn] : Supported source version 'RELEASE_7' from annotation processor 'org.netbeans.modules.openide.nodes.NodesAnnotationProcessor' less than -source '1.8'
[WARNING] [Warn] : Supported source version 'RELEASE_7' from annotation processor 'org.netbeans.modules.openide.windows.TopComponentProcessor' less than -source '1.8'
[WARNING] [Warn] : Supported source version 'RELEASE_7' from annotation processor 'org.netbeans.api.annotations.common.proc.StaticResourceProcessor' less than -source '1.8'
[INFO] Done compiling.
[INFO] compile in 5.5 s
[INFO] 
[INFO] --- maven-surefire-plugin:2.20.1:test (default-test) @ sansa-inference-tests_2.12 ---
[INFO] Tests are skipped.
[INFO] 
[INFO] --- scalatest-maven-plugin:2.0.0:test (test) @ sansa-inference-tests_2.12 ---
[INFO] Tests are skipped.
[INFO] 
[INFO] --- maven-jar-plugin:2.4:jar (default-jar) @ sansa-inference-tests_2.12 ---
[WARNING] JAR will be empty - no content was marked for inclusion!
[INFO] Building jar: /usr/share/tomcat8/.jenkins/jobs/SANSA Inference Layer/branches/develop/workspace/sansa-inference-tests/target/sansa-inference-tests_2.12-0.7.2-SNAPSHOT.jar
[INFO] 
[INFO] --- maven-javadoc-plugin:3.1.1:jar (attach-javadocs) @ sansa-inference-tests_2.12 ---
[INFO] 
[INFO] >>> scala-maven-plugin:4.3.1:doc-jar (attach-javadocs) > generate-resources @ sansa-inference-tests_2.12 >>>
[INFO] 
[INFO] --- scala-maven-plugin:4.3.1:add-source (default) @ sansa-inference-tests_2.12 ---
[INFO] 
[INFO] --- jacoco-maven-plugin:0.8.4:prepare-agent (prepare-agent) @ sansa-inference-tests_2.12 ---
[INFO] argLine set to "-javaagent:/usr/share/tomcat8/.m2/repository/org/jacoco/org.jacoco.agent/0.8.4/org.jacoco.agent-0.8.4-runtime.jar=destfile=/usr/share/tomcat8/.jenkins/jobs/SANSA Inference Layer/branches/develop/workspace/sansa-inference-tests/target/jacoco.exec"
[WARNING] Failed to getClass for scala_maven.ScalaDocJarMojo
[INFO] 
[INFO] <<< scala-maven-plugin:4.3.1:doc-jar (attach-javadocs) < generate-resources @ sansa-inference-tests_2.12 <<<
[INFO] 
[INFO] 
[INFO] --- scala-maven-plugin:4.3.1:doc-jar (attach-javadocs) @ sansa-inference-tests_2.12 ---
[INFO] No source files found
[INFO] 
[INFO] --- maven-jar-plugin:2.4:test-jar (default) @ sansa-inference-tests_2.12 ---
[INFO] Building jar: /usr/share/tomcat8/.jenkins/jobs/SANSA Inference Layer/branches/develop/workspace/sansa-inference-tests/target/sansa-inference-tests_2.12-0.7.2-SNAPSHOT-tests.jar
[INFO] 
[INFO] --- maven-source-plugin:3.0.1:jar-no-fork (attach-sources) @ sansa-inference-tests_2.12 ---
[INFO] No sources in project. Archive not created.
[INFO] 
[INFO] --- maven-install-plugin:2.4:install (default-install) @ sansa-inference-tests_2.12 ---
[INFO] Installing /usr/share/tomcat8/.jenkins/jobs/SANSA Inference Layer/branches/develop/workspace/sansa-inference-tests/target/sansa-inference-tests_2.12-0.7.2-SNAPSHOT.jar to /usr/share/tomcat8/.m2/repository/net/sansa-stack/sansa-inference-tests_2.12/0.7.2-SNAPSHOT/sansa-inference-tests_2.12-0.7.2-SNAPSHOT.jar
[INFO] Installing /usr/share/tomcat8/.jenkins/jobs/SANSA Inference Layer/branches/develop/workspace/sansa-inference-tests/pom.xml to /usr/share/tomcat8/.m2/repository/net/sansa-stack/sansa-inference-tests_2.12/0.7.2-SNAPSHOT/sansa-inference-tests_2.12-0.7.2-SNAPSHOT.pom
[INFO] Installing /usr/share/tomcat8/.jenkins/jobs/SANSA Inference Layer/branches/develop/workspace/sansa-inference-tests/target/sansa-inference-tests_2.12-0.7.2-SNAPSHOT-tests.jar to /usr/share/tomcat8/.m2/repository/net/sansa-stack/sansa-inference-tests_2.12/0.7.2-SNAPSHOT/sansa-inference-tests_2.12-0.7.2-SNAPSHOT-tests.jar
[INFO] 
[INFO] -------------< net.sansa-stack:sansa-inference-flink_2.12 >-------------
[INFO] Building Inference API - Flink 0.7.2-SNAPSHOT                      [4/5]
[INFO] --------------------------------[ jar ]---------------------------------
[INFO] Downloading from maven.aksw.snapshots: http://maven.aksw.org/archiva/repository/snapshots/net/sansa-stack/sansa-rdf-flink_2.12/0.7.2-SNAPSHOT/maven-metadata.xml
[INFO] Downloading from apache-snapshot: https://repository.apache.org/content/repositories/snapshots/net/sansa-stack/sansa-rdf-flink_2.12/0.7.2-SNAPSHOT/maven-metadata.xml
[INFO] Downloading from oss-sonatype: https://oss.sonatype.org/content/repositories/snapshots/net/sansa-stack/sansa-rdf-flink_2.12/0.7.2-SNAPSHOT/maven-metadata.xml
[INFO] Downloading from oss-sonatype: https://oss.sonatype.org/content/repositories/snapshots/net/sansa-stack/sansa-rdf-flink_2.12/0.7.2-SNAPSHOT/sansa-rdf-flink_2.12-0.7.2-SNAPSHOT.pom
[INFO] Downloading from apache-snapshot: https://repository.apache.org/content/repositories/snapshots/net/sansa-stack/sansa-rdf-flink_2.12/0.7.2-SNAPSHOT/sansa-rdf-flink_2.12-0.7.2-SNAPSHOT.pom
[INFO] Downloading from maven.aksw.snapshots: http://maven.aksw.org/archiva/repository/snapshots/net/sansa-stack/sansa-rdf-flink_2.12/0.7.2-SNAPSHOT/sansa-rdf-flink_2.12-0.7.2-SNAPSHOT.pom
[WARNING] The POM for net.sansa-stack:sansa-rdf-flink_2.12:jar:0.7.2-SNAPSHOT is missing, no dependency information available
[INFO] Downloading from oss-sonatype: https://oss.sonatype.org/content/repositories/snapshots/org/apache/flink/flink-test-utils_2.12/1.10.1/flink-test-utils_2.12-1.10.1.pom
[INFO] Downloading from apache-snapshot: https://repository.apache.org/content/repositories/snapshots/org/apache/flink/flink-test-utils_2.12/1.10.1/flink-test-utils_2.12-1.10.1.pom
[INFO] Downloading from oss-sonatype-releases: https://oss.sonatype.org/content/repositories/releases/org/apache/flink/flink-test-utils_2.12/1.10.1/flink-test-utils_2.12-1.10.1.pom
[INFO] Downloaded from oss-sonatype-releases: https://oss.sonatype.org/content/repositories/releases/org/apache/flink/flink-test-utils_2.12/1.10.1/flink-test-utils_2.12-1.10.1.pom (6.3 kB at 21 kB/s)
[INFO] Downloading from oss-sonatype: https://oss.sonatype.org/content/repositories/snapshots/org/apache/flink/flink-test-utils-parent/1.10.1/flink-test-utils-parent-1.10.1.pom
[INFO] Downloading from apache-snapshot: https://repository.apache.org/content/repositories/snapshots/org/apache/flink/flink-test-utils-parent/1.10.1/flink-test-utils-parent-1.10.1.pom
[INFO] Downloading from oss-sonatype-releases: https://oss.sonatype.org/content/repositories/releases/org/apache/flink/flink-test-utils-parent/1.10.1/flink-test-utils-parent-1.10.1.pom
[INFO] Downloaded from oss-sonatype-releases: https://oss.sonatype.org/content/repositories/releases/org/apache/flink/flink-test-utils-parent/1.10.1/flink-test-utils-parent-1.10.1.pom (1.4 kB at 4.9 kB/s)
[INFO] Downloading from oss-sonatype: https://oss.sonatype.org/content/repositories/snapshots/org/apache/flink/flink-test-utils-junit/1.10.1/flink-test-utils-junit-1.10.1.pom
[INFO] Downloading from apache-snapshot: https://repository.apache.org/content/repositories/snapshots/org/apache/flink/flink-test-utils-junit/1.10.1/flink-test-utils-junit-1.10.1.pom
[INFO] Downloading from oss-sonatype-releases: https://oss.sonatype.org/content/repositories/releases/org/apache/flink/flink-test-utils-junit/1.10.1/flink-test-utils-junit-1.10.1.pom
[INFO] Downloaded from oss-sonatype-releases: https://oss.sonatype.org/content/repositories/releases/org/apache/flink/flink-test-utils-junit/1.10.1/flink-test-utils-junit-1.10.1.pom (3.7 kB at 13 kB/s)
[INFO] Downloading from oss-sonatype: https://oss.sonatype.org/content/repositories/snapshots/org/apache/flink/flink-streaming-java_2.12/1.10.1/flink-streaming-java_2.12-1.10.1.pom
[INFO] Downloading from apache-snapshot: https://repository.apache.org/content/repositories/snapshots/org/apache/flink/flink-streaming-java_2.12/1.10.1/flink-streaming-java_2.12-1.10.1.pom
[INFO] Downloading from oss-sonatype-releases: https://oss.sonatype.org/content/repositories/releases/org/apache/flink/flink-streaming-java_2.12/1.10.1/flink-streaming-java_2.12-1.10.1.pom
[INFO] Downloaded from oss-sonatype-releases: https://oss.sonatype.org/content/repositories/releases/org/apache/flink/flink-streaming-java_2.12/1.10.1/flink-streaming-java_2.12-1.10.1.pom (5.8 kB at 19 kB/s)
[INFO] Downloading from oss-sonatype: https://oss.sonatype.org/content/repositories/snapshots/net/sansa-stack/sansa-rdf-flink_2.12/0.7.2-SNAPSHOT/sansa-rdf-flink_2.12-0.7.2-SNAPSHOT.jar
[INFO] Downloading from oss-sonatype: https://oss.sonatype.org/content/repositories/snapshots/org/apache/flink/flink-test-utils_2.12/1.10.1/flink-test-utils_2.12-1.10.1.jar
[INFO] Downloading from oss-sonatype: https://oss.sonatype.org/content/repositories/snapshots/org/apache/flink/flink-test-utils-junit/1.10.1/flink-test-utils-junit-1.10.1.jar
[INFO] Downloading from oss-sonatype: https://oss.sonatype.org/content/repositories/snapshots/org/lz4/lz4-java/1.5.0/lz4-java-1.5.0.jar
[INFO] Downloading from oss-sonatype: https://oss.sonatype.org/content/repositories/snapshots/org/apache/flink/flink-runtime_2.12/1.10.1/flink-runtime_2.12-1.10.1-tests.jar
[INFO] Downloading from oss-sonatype: https://oss.sonatype.org/content/repositories/snapshots/org/apache/flink/flink-streaming-java_2.12/1.10.1/flink-streaming-java_2.12-1.10.1.jar
[INFO] Downloading from apache-snapshot: https://repository.apache.org/content/repositories/snapshots/net/sansa-stack/sansa-rdf-flink_2.12/0.7.2-SNAPSHOT/sansa-rdf-flink_2.12-0.7.2-SNAPSHOT.jar
[INFO] Downloading from apache-snapshot: https://repository.apache.org/content/repositories/snapshots/org/apache/flink/flink-test-utils_2.12/1.10.1/flink-test-utils_2.12-1.10.1.jar
[INFO] Downloading from apache-snapshot: https://repository.apache.org/content/repositories/snapshots/org/apache/flink/flink-test-utils-junit/1.10.1/flink-test-utils-junit-1.10.1.jar
[INFO] Downloading from apache-snapshot: https://repository.apache.org/content/repositories/snapshots/org/lz4/lz4-java/1.5.0/lz4-java-1.5.0.jar
[INFO] Downloading from apache-snapshot: https://repository.apache.org/content/repositories/snapshots/org/apache/flink/flink-runtime_2.12/1.10.1/flink-runtime_2.12-1.10.1-tests.jar
[INFO] Downloading from apache-snapshot: https://repository.apache.org/content/repositories/snapshots/org/apache/flink/flink-streaming-java_2.12/1.10.1/flink-streaming-java_2.12-1.10.1.jar
[INFO] Downloading from maven.aksw.snapshots: http://maven.aksw.org/archiva/repository/snapshots/net/sansa-stack/sansa-rdf-flink_2.12/0.7.2-SNAPSHOT/sansa-rdf-flink_2.12-0.7.2-SNAPSHOT.jar
[INFO] Downloading from oss-sonatype-releases: https://oss.sonatype.org/content/repositories/releases/org/apache/flink/flink-test-utils_2.12/1.10.1/flink-test-utils_2.12-1.10.1.jar
[INFO] Downloading from oss-sonatype-releases: https://oss.sonatype.org/content/repositories/releases/org/apache/flink/flink-test-utils-junit/1.10.1/flink-test-utils-junit-1.10.1.jar
[INFO] Downloading from oss-sonatype-releases: https://oss.sonatype.org/content/repositories/releases/org/lz4/lz4-java/1.5.0/lz4-java-1.5.0.jar
[INFO] Downloading from oss-sonatype-releases: https://oss.sonatype.org/content/repositories/releases/org/apache/flink/flink-runtime_2.12/1.10.1/flink-runtime_2.12-1.10.1-tests.jar
[INFO] Downloading from oss-sonatype-releases: https://oss.sonatype.org/content/repositories/releases/org/apache/flink/flink-streaming-java_2.12/1.10.1/flink-streaming-java_2.12-1.10.1.jar
[INFO] Downloaded from oss-sonatype-releases: https://oss.sonatype.org/content/repositories/releases/org/apache/flink/flink-test-utils-junit/1.10.1/flink-test-utils-junit-1.10.1.jar (32 kB at 108 kB/s)
[INFO] Downloaded from oss-sonatype-releases: https://oss.sonatype.org/content/repositories/releases/org/apache/flink/flink-test-utils_2.12/1.10.1/flink-test-utils_2.12-1.10.1.jar (1.4 MB at 4.2 MB/s)
[INFO] Downloaded from oss-sonatype-releases: https://oss.sonatype.org/content/repositories/releases/org/lz4/lz4-java/1.5.0/lz4-java-1.5.0.jar (512 kB at 1.5 MB/s)
[INFO] Downloaded from oss-sonatype-releases: https://oss.sonatype.org/content/repositories/releases/org/apache/flink/flink-runtime_2.12/1.10.1/flink-runtime_2.12-1.10.1-tests.jar (3.8 MB at 7.5 MB/s)
[INFO] Downloaded from oss-sonatype-releases: https://oss.sonatype.org/content/repositories/releases/org/apache/flink/flink-streaming-java_2.12/1.10.1/flink-streaming-java_2.12-1.10.1.jar (1.0 MB at 1.5 MB/s)
[INFO] ------------------------------------------------------------------------
[INFO] Reactor Summary:
[INFO] 
[INFO] Inference API - Parent 0.7.2-SNAPSHOT .............. SUCCESS [ 10.524 s]
[INFO] Inference API - Common ............................. SUCCESS [ 51.002 s]
[INFO] Inference API - Tests .............................. SUCCESS [ 15.778 s]
[INFO] Inference API - Flink .............................. FAILURE [  4.342 s]
[INFO] Inference API - Spark 0.7.2-SNAPSHOT ............... SKIPPED
[INFO] ------------------------------------------------------------------------
[INFO] BUILD FAILURE
[INFO] ------------------------------------------------------------------------
[INFO] Total time: 01:24 min
[INFO] Finished at: 2020-06-27T11:19:46+02:00
[INFO] ------------------------------------------------------------------------
Waiting for Jenkins to finish collecting data
[ERROR] Failed to execute goal on project sansa-inference-flink_2.12: Could not resolve dependencies for project net.sansa-stack:sansa-inference-flink_2.12:jar:0.7.2-SNAPSHOT: Could not find artifact net.sansa-stack:sansa-rdf-flink_2.12:jar:0.7.2-SNAPSHOT in oss-sonatype (https://oss.sonatype.org/content/repositories/snapshots/) -> [Help 1]
[ERROR] 
[ERROR] To see the full stack trace of the errors, re-run Maven with the -e switch.
[ERROR] Re-run Maven using the -X switch to enable full debug logging.
[ERROR] 
[ERROR] For more information about the errors and possible solutions, please read the following articles:
[ERROR] [Help 1] http://cwiki.apache.org/confluence/display/MAVEN/DependencyResolutionException
[ERROR] 
[ERROR] After correcting the problems, you can resume the build with the command
[ERROR]   mvn <goals> -rf :sansa-inference-flink_2.12
[JENKINS] Archiving /usr/share/tomcat8/.jenkins/jobs/SANSA Inference Layer/branches/develop/workspace/sansa-inference-tests/pom.xml to net.sansa-stack/sansa-inference-tests_2.12/0.7.2-SNAPSHOT/sansa-inference-tests_2.12-0.7.2-SNAPSHOT.pom
[JENKINS] Archiving /usr/share/tomcat8/.jenkins/jobs/SANSA Inference Layer/branches/develop/workspace/sansa-inference-tests/target/sansa-inference-tests_2.12-0.7.2-SNAPSHOT.jar to net.sansa-stack/sansa-inference-tests_2.12/0.7.2-SNAPSHOT/sansa-inference-tests_2.12-0.7.2-SNAPSHOT.jar
[JENKINS] Archiving /usr/share/tomcat8/.jenkins/jobs/SANSA Inference Layer/branches/develop/workspace/sansa-inference-tests/target/sansa-inference-tests_2.12-0.7.2-SNAPSHOT-tests.jar to net.sansa-stack/sansa-inference-tests_2.12/0.7.2-SNAPSHOT/sansa-inference-tests_2.12-0.7.2-SNAPSHOT-tests.jar
[JENKINS] Archiving /usr/share/tomcat8/.jenkins/jobs/SANSA Inference Layer/branches/develop/workspace/sansa-inference-common/pom.xml to net.sansa-stack/sansa-inference-common_2.12/0.7.2-SNAPSHOT/sansa-inference-common_2.12-0.7.2-SNAPSHOT.pom
[JENKINS] Archiving /usr/share/tomcat8/.jenkins/jobs/SANSA Inference Layer/branches/develop/workspace/sansa-inference-common/target/sansa-inference-common_2.12-0.7.2-SNAPSHOT.jar to net.sansa-stack/sansa-inference-common_2.12/0.7.2-SNAPSHOT/sansa-inference-common_2.12-0.7.2-SNAPSHOT.jar
[JENKINS] Archiving /usr/share/tomcat8/.jenkins/jobs/SANSA Inference Layer/branches/develop/workspace/sansa-inference-common/target/sansa-inference-common_2.12-0.7.2-SNAPSHOT-javadoc.jar to net.sansa-stack/sansa-inference-common_2.12/0.7.2-SNAPSHOT/sansa-inference-common_2.12-0.7.2-SNAPSHOT-javadoc.jar
[JENKINS] Archiving /usr/share/tomcat8/.jenkins/jobs/SANSA Inference Layer/branches/develop/workspace/sansa-inference-common/target/sansa-inference-common_2.12-0.7.2-SNAPSHOT-sources.jar to net.sansa-stack/sansa-inference-common_2.12/0.7.2-SNAPSHOT/sansa-inference-common_2.12-0.7.2-SNAPSHOT-sources.jar
[JENKINS] Archiving /usr/share/tomcat8/.jenkins/jobs/SANSA Inference Layer/branches/develop/workspace/pom.xml to net.sansa-stack/sansa-inference-parent_2.12/0.7.2-SNAPSHOT/sansa-inference-parent_2.12-0.7.2-SNAPSHOT.pom
[JENKINS] Archiving /usr/share/tomcat8/.jenkins/jobs/SANSA Inference Layer/branches/develop/workspace/sansa-inference-spark/pom.xml to net.sansa-stack/sansa-inference-spark_2.12/0.7.2-SNAPSHOT/sansa-inference-spark_2.12-0.7.2-SNAPSHOT.pom
[JENKINS] Archiving /usr/share/tomcat8/.jenkins/jobs/SANSA Inference Layer/branches/develop/workspace/sansa-inference-flink/pom.xml to net.sansa-stack/sansa-inference-flink_2.12/0.7.2-SNAPSHOT/sansa-inference-flink_2.12-0.7.2-SNAPSHOT.pom
No mail will be sent out, as 'SANSA Inference Layer » develop » Inference API - Spark #205' does not have a result yet. Please make sure you set a proper result in case of pipeline/build scripts.
Sending e-mails to: buehmann@informatik.uni-leipzig.de westphal@informatik.uni-leipzig.de
channel stopped
[Set GitHub commit status (universal)] ERROR on repos [GHRepository@1c3cd72c[nodeId=MDEwOlJlcG9zaXRvcnk2NDU5OTc5Ng==,description=A general Inference API based on two of the most popular Big Data processing engines: Apache Spark and Apache Flink,homepage=,name=SANSA-Inference,fork=false,archived=false,size=1670,milestones={},language=Scala,commits={},source=<null>,parent=<null>,url=https://api.github.com/repos/SANSA-Stack/SANSA-Inference,id=64599796]] (sha:d7b8918) with context:SANSA Inference Layer/develop
Setting commit status on GitHub for https://github.com/SANSA-Stack/SANSA-Inference/commit/d7b8918cd206e2cd9fd527ae10fdf46b91d032af
Sending e-mails to: buehmann@informatik.uni-leipzig.de westphal@informatik.uni-leipzig.de heba.a.ibrahim@gmail.com patrick.westphal@teebeutelstoerche.de
Finished: FAILURE