FailedConsole Output

Push event to branch claus-record-reader-revision
20:57:52 Connecting to https://api.github.com using aksw-ci/******
Obtained Jenkinsfile from 34c1600494c0ad37791a61a5169434ad27b977e3
Running in Durability level: MAX_SURVIVABILITY
[Pipeline] Start of Pipeline
[Pipeline] node
Running on Jenkins in /usr/share/tomcat8/.jenkins/jobs/SANSA-Stack/branches/claus-record-reader-revision/workspace
[Pipeline] {
[Pipeline] stage
[Pipeline] { (Declarative: Checkout SCM)
[Pipeline] checkout
using credential github-api
Cloning the remote Git repository
Cloning with configured refspecs honoured and without tags
Cloning repository https://github.com/SANSA-Stack/SANSA-Stack.git
 > git init /usr/share/tomcat8/.jenkins/jobs/SANSA-Stack/branches/claus-record-reader-revision/workspace # timeout=10
Fetching upstream changes from https://github.com/SANSA-Stack/SANSA-Stack.git
 > git --version # timeout=10
using GIT_ASKPASS to set credentials 
 > git fetch --no-tags --progress -- https://github.com/SANSA-Stack/SANSA-Stack.git +refs/heads/claus-record-reader-revision:refs/remotes/origin/claus-record-reader-revision # timeout=10
 > git config remote.origin.url https://github.com/SANSA-Stack/SANSA-Stack.git # timeout=10
 > git config --add remote.origin.fetch +refs/heads/claus-record-reader-revision:refs/remotes/origin/claus-record-reader-revision # timeout=10
 > git config remote.origin.url https://github.com/SANSA-Stack/SANSA-Stack.git # timeout=10
Fetching without tags
Fetching upstream changes from https://github.com/SANSA-Stack/SANSA-Stack.git
using GIT_ASKPASS to set credentials 
 > git fetch --no-tags --progress -- https://github.com/SANSA-Stack/SANSA-Stack.git +refs/heads/claus-record-reader-revision:refs/remotes/origin/claus-record-reader-revision # timeout=10
Checking out Revision 34c1600494c0ad37791a61a5169434ad27b977e3 (claus-record-reader-revision)
 > git config core.sparsecheckout # timeout=10
 > git checkout -f 34c1600494c0ad37791a61a5169434ad27b977e3 # timeout=10
Commit message: "Added DeferredSeekablePushbackInputStream in order to get end of block (EOB) advertised before reading into the next block. Moved util classes to io, nio, and hadoop sub packages for InputStream, Channel and Seekable stuff, respectively. Improved clarity of several of these utils."
First time build. Skipping changelog.
[Pipeline] }
[Pipeline] // stage
[Pipeline] withEnv
[Pipeline] {
[Pipeline] withEnv
[Pipeline] {
[Pipeline] stage
[Pipeline] { (Declarative: Tool Install)
[Pipeline] tool
[Pipeline] envVarsForTool
[Pipeline] tool
[Pipeline] envVarsForTool
[Pipeline] }
[Pipeline] // stage
[Pipeline] withEnv
[Pipeline] {
[Pipeline] stage
[Pipeline] { (Initialize)
[Pipeline] tool
[Pipeline] envVarsForTool
[Pipeline] tool
[Pipeline] envVarsForTool
[Pipeline] withEnv
[Pipeline] {
[Pipeline] sh
+ echo PATH = /usr/lib/jvm/java-11-openjdk-amd64/bin:/opt/maven/bin:/usr/lib/jvm/java-11-openjdk-amd64/bin:/opt/maven/bin:/bin:/usr/bin:/sbin:/usr/sbin
PATH = /usr/lib/jvm/java-11-openjdk-amd64/bin:/opt/maven/bin:/usr/lib/jvm/java-11-openjdk-amd64/bin:/opt/maven/bin:/bin:/usr/bin:/sbin:/usr/sbin
+ echo M2_HOME = /opt/maven
M2_HOME = /opt/maven
[Pipeline] }
[Pipeline] // withEnv
[Pipeline] }
[Pipeline] // stage
[Pipeline] stage
[Pipeline] { (Build and Push to Archiva)
[Pipeline] tool
[Pipeline] envVarsForTool
[Pipeline] tool
[Pipeline] envVarsForTool
[Pipeline] withEnv
[Pipeline] {
[Pipeline] sh
+ mvn --batch-mode -V -U -e -DskipTests clean deploy -pl :sansa-query-spark_2.12 -am
Apache Maven 3.8.1 (05c21c65bdfed0f71a2f2ada8b84da59348c4c5d)
Maven home: /opt/maven
Java version: 1.8.0_292, vendor: Private Build, runtime: /usr/lib/jvm/java-8-openjdk-amd64/jre
Default locale: en_US, platform encoding: UTF-8
OS name: "linux", version: "5.4.0-1046-azure", arch: "amd64", family: "unix"
[INFO] Error stacktraces are turned on.
[INFO] Scanning for projects...
[WARNING] 
[WARNING] Some problems were encountered while building the effective model for net.sansa-stack:sansa-hadoop-jena:jar:0.8.0-RC2-SNAPSHOT
[WARNING] 'profiles.profile[root-dir].activation.file.exists' Failed to interpolate file location ${project.basedir}/scalastyle-config.xml for profile root-dir: ${project.basedir} expression not supported during profile activation, use ${basedir} instead @ net.sansa-stack:sansa-parent_2.12:0.8.0-RC2-SNAPSHOT, /usr/share/tomcat8/.jenkins/jobs/SANSA-Stack/branches/claus-record-reader-revision/workspace/pom.xml
[WARNING] 'profiles.profile[child-dir].activation.file.exists' Failed to interpolate file location ${project.basedir}/../lib for profile child-dir: ${project.basedir} expression not supported during profile activation, use ${basedir} instead @ net.sansa-stack:sansa-parent_2.12:0.8.0-RC2-SNAPSHOT, /usr/share/tomcat8/.jenkins/jobs/SANSA-Stack/branches/claus-record-reader-revision/workspace/pom.xml
[WARNING] 
[WARNING] Some problems were encountered while building the effective model for net.sansa-stack:sansa-query-tests_2.12:jar:0.8.0-RC2-SNAPSHOT
[WARNING] 'build.plugins.plugin.version' for org.scala-tools:maven-scala-plugin is missing. @ line 51, column 21
[WARNING] 
[WARNING] Some problems were encountered while building the effective model for net.sansa-stack:sansa-debian-spark-cli:jar:0.8.0-RC2-SNAPSHOT
[WARNING] 'build.plugins.plugin.version' for org.sonatype.plugins:nexus-staging-maven-plugin is missing. @ line 40, column 21
[WARNING] 'build.plugins.plugin.version' for org.apache.maven.plugins:maven-deploy-plugin is missing. @ line 32, column 21
[WARNING] 
[WARNING] Some problems were encountered while building the effective model for net.sansa-stack:sansa-parent_2.12:pom:0.8.0-RC2-SNAPSHOT
[WARNING] 'profiles.profile[root-dir].activation.file.exists' Failed to interpolate file location ${project.basedir}/scalastyle-config.xml for profile root-dir: ${project.basedir} expression not supported during profile activation, use ${basedir} instead
[WARNING] 'profiles.profile[child-dir].activation.file.exists' Failed to interpolate file location ${project.basedir}/../lib for profile child-dir: ${project.basedir} expression not supported during profile activation, use ${basedir} instead
[WARNING] 
[WARNING] It is highly recommended to fix these problems because they threaten the stability of your build.
[WARNING] 
[WARNING] For this reason, future Maven versions might no longer support building such malformed projects.
[WARNING] 
[WARNING] The project net.sansa-stack:sansa-parent_2.12:pom:0.8.0-RC2-SNAPSHOT uses prerequisites which is only intended for maven-plugin projects but not for non maven-plugin projects. For such purposes you should use the maven-enforcer-plugin. See https://maven.apache.org/enforcer/enforcer-rules/requireMavenVersion.html
[INFO] ------------------------------------------------------------------------
[INFO] Reactor Build Order:
[INFO] 
[INFO] SANSA - Parent                                                     [pom]
[INFO] sansa-test-resources_2.12                                          [jar]
[INFO] sansa-hadoop-jena                                                  [jar]
[INFO] sansa-kryo-jena                                                    [jar]
[INFO] sansa-resource-metadata                                            [jar]
[INFO] sansa-resource-testdata                                            [jar]
[INFO] SANSA Stack - RDF Layer - Parent                                   [pom]
[INFO] sansa-rdf-common_2.12                                              [jar]
[INFO] sansa-rdf-spark_2.12                                               [jar]
[INFO] SANSA Stack - DataLake Layer - Parent                              [pom]
[INFO] sansa-datalake-spark_2.12                                          [jar]
[INFO] SANSA Stack - Query Layer - Parent                                 [pom]
[INFO] sansa-query-tests_2.12                                             [jar]
[INFO] sansa-query-spark_2.12                                             [jar]
[INFO] 
[INFO] -----------------< net.sansa-stack:sansa-parent_2.12 >------------------
[INFO] Building SANSA - Parent 0.8.0-RC2-SNAPSHOT                        [1/14]
[INFO] --------------------------------[ pom ]---------------------------------
[INFO] 
[INFO] --- maven-clean-plugin:2.5:clean (default-clean) @ sansa-parent_2.12 ---
[INFO] 
[INFO] --- jacoco-maven-plugin:0.8.4:prepare-agent (prepare-agent) @ sansa-parent_2.12 ---
[INFO] argLine set to -javaagent:/usr/share/tomcat8/.m2/repository/org/jacoco/org.jacoco.agent/0.8.4/org.jacoco.agent-0.8.4-runtime.jar=destfile=/usr/share/tomcat8/.jenkins/jobs/SANSA-Stack/branches/claus-record-reader-revision/workspace/target/jacoco.exec
[INFO] 
[INFO] --- scala-maven-plugin:4.4.0:add-source (scala-compile-first) @ sansa-parent_2.12 ---
[INFO] Add Source directory: /usr/share/tomcat8/.jenkins/jobs/SANSA-Stack/branches/claus-record-reader-revision/workspace/src/main/scala
[INFO] Add Test Source directory: /usr/share/tomcat8/.jenkins/jobs/SANSA-Stack/branches/claus-record-reader-revision/workspace/src/test/scala
[INFO] 
[INFO] --- scala-maven-plugin:4.4.0:compile (scala-compile-first) @ sansa-parent_2.12 ---
[INFO] compile in 0.0 s
[INFO] No sources to compile
[INFO] 
[INFO] --- scala-maven-plugin:4.4.0:testCompile (scala-test-compile) @ sansa-parent_2.12 ---
[INFO] compile in 0.0 s
[INFO] No sources to compile
[INFO] 
[INFO] --- scalatest-maven-plugin:2.0.2:test (test) @ sansa-parent_2.12 ---
[INFO] Tests are skipped.
[INFO] 
[INFO] >>> scala-maven-plugin:4.4.0:doc-jar (attach-javadocs) > generate-sources @ sansa-parent_2.12 >>>
[INFO] 
[INFO] --- jacoco-maven-plugin:0.8.4:prepare-agent (prepare-agent) @ sansa-parent_2.12 ---
[INFO] argLine set to -javaagent:/usr/share/tomcat8/.m2/repository/org/jacoco/org.jacoco.agent/0.8.4/org.jacoco.agent-0.8.4-runtime.jar=destfile=/usr/share/tomcat8/.jenkins/jobs/SANSA-Stack/branches/claus-record-reader-revision/workspace/target/jacoco.exec
[INFO] 
[INFO] <<< scala-maven-plugin:4.4.0:doc-jar (attach-javadocs) < generate-sources @ sansa-parent_2.12 <<<
[INFO] 
[INFO] 
[INFO] --- scala-maven-plugin:4.4.0:doc-jar (attach-javadocs) @ sansa-parent_2.12 ---
[INFO] No source files found
[INFO] 
[INFO] --- maven-javadoc-plugin:3.1.1:jar (attach-javadocs) @ sansa-parent_2.12 ---
[INFO] Not executing Javadoc as the project is not a Java classpath-capable package
[INFO] 
[INFO] --- maven-install-plugin:2.4:install (default-install) @ sansa-parent_2.12 ---
[INFO] Installing /usr/share/tomcat8/.jenkins/jobs/SANSA-Stack/branches/claus-record-reader-revision/workspace/pom.xml to /usr/share/tomcat8/.m2/repository/net/sansa-stack/sansa-parent_2.12/0.8.0-RC2-SNAPSHOT/sansa-parent_2.12-0.8.0-RC2-SNAPSHOT.pom
[INFO] 
[INFO] --- maven-deploy-plugin:2.7:deploy (default-deploy) @ sansa-parent_2.12 ---
[INFO] Downloading from maven.aksw.snapshots: https://maven.aksw.org/archiva/repository/snapshots/net/sansa-stack/sansa-parent_2.12/0.8.0-RC2-SNAPSHOT/maven-metadata.xml
[INFO] Downloaded from maven.aksw.snapshots: https://maven.aksw.org/archiva/repository/snapshots/net/sansa-stack/sansa-parent_2.12/0.8.0-RC2-SNAPSHOT/maven-metadata.xml (374 B at 337 B/s)
[INFO] Uploading to maven.aksw.snapshots: https://maven.aksw.org/archiva/repository/snapshots/net/sansa-stack/sansa-parent_2.12/0.8.0-RC2-SNAPSHOT/sansa-parent_2.12-0.8.0-RC2-20210628.185837-34.pom
[INFO] Uploaded to maven.aksw.snapshots: https://maven.aksw.org/archiva/repository/snapshots/net/sansa-stack/sansa-parent_2.12/0.8.0-RC2-SNAPSHOT/sansa-parent_2.12-0.8.0-RC2-20210628.185837-34.pom (96 kB at 58 kB/s)
[INFO] Downloading from maven.aksw.snapshots: https://maven.aksw.org/archiva/repository/snapshots/net/sansa-stack/sansa-parent_2.12/maven-metadata.xml
[INFO] Downloaded from maven.aksw.snapshots: https://maven.aksw.org/archiva/repository/snapshots/net/sansa-stack/sansa-parent_2.12/maven-metadata.xml (427 B at 196 B/s)
[INFO] Uploading to maven.aksw.snapshots: https://maven.aksw.org/archiva/repository/snapshots/net/sansa-stack/sansa-parent_2.12/0.8.0-RC2-SNAPSHOT/maven-metadata.xml
[INFO] Uploaded to maven.aksw.snapshots: https://maven.aksw.org/archiva/repository/snapshots/net/sansa-stack/sansa-parent_2.12/0.8.0-RC2-SNAPSHOT/maven-metadata.xml (619 B at 33 kB/s)
[INFO] Uploading to maven.aksw.snapshots: https://maven.aksw.org/archiva/repository/snapshots/net/sansa-stack/sansa-parent_2.12/maven-metadata.xml
[INFO] Uploaded to maven.aksw.snapshots: https://maven.aksw.org/archiva/repository/snapshots/net/sansa-stack/sansa-parent_2.12/maven-metadata.xml (426 B at 24 kB/s)
[INFO] 
[INFO] -------------< net.sansa-stack:sansa-test-resources_2.12 >--------------
[INFO] Building sansa-test-resources_2.12 0.8.0-RC2-SNAPSHOT             [2/14]
[INFO] --------------------------------[ jar ]---------------------------------
[INFO] 
[INFO] --- maven-clean-plugin:2.5:clean (default-clean) @ sansa-test-resources_2.12 ---
[INFO] 
[INFO] --- jacoco-maven-plugin:0.8.4:prepare-agent (prepare-agent) @ sansa-test-resources_2.12 ---
[INFO] argLine set to -javaagent:/usr/share/tomcat8/.m2/repository/org/jacoco/org.jacoco.agent/0.8.4/org.jacoco.agent-0.8.4-runtime.jar=destfile=/usr/share/tomcat8/.jenkins/jobs/SANSA-Stack/branches/claus-record-reader-revision/workspace/sansa-test-resources/target/jacoco.exec
[INFO] 
[INFO] --- maven-resources-plugin:3.0.2:resources (default-resources) @ sansa-test-resources_2.12 ---
[INFO] Using 'UTF-8' encoding to copy filtered resources.
[INFO] Copying 1 resource
[INFO] 
[INFO] --- scala-maven-plugin:4.4.0:add-source (scala-compile-first) @ sansa-test-resources_2.12 ---
[INFO] Add Source directory: /usr/share/tomcat8/.jenkins/jobs/SANSA-Stack/branches/claus-record-reader-revision/workspace/sansa-test-resources/src/main/scala
[INFO] Add Test Source directory: /usr/share/tomcat8/.jenkins/jobs/SANSA-Stack/branches/claus-record-reader-revision/workspace/sansa-test-resources/src/test/scala
[INFO] 
[INFO] --- scala-maven-plugin:4.4.0:compile (scala-compile-first) @ sansa-test-resources_2.12 ---
[INFO] compile in 0.0 s
[INFO] No sources to compile
[INFO] 
[INFO] --- maven-compiler-plugin:3.8.1:compile (default-compile) @ sansa-test-resources_2.12 ---
[INFO] No sources to compile
[INFO] 
[INFO] --- maven-resources-plugin:3.0.2:testResources (default-testResources) @ sansa-test-resources_2.12 ---
[INFO] Using 'UTF-8' encoding to copy filtered resources.
[INFO] skip non existing resourceDirectory /usr/share/tomcat8/.jenkins/jobs/SANSA-Stack/branches/claus-record-reader-revision/workspace/sansa-test-resources/src/test/resources
[INFO] 
[INFO] --- scala-maven-plugin:4.4.0:testCompile (scala-test-compile) @ sansa-test-resources_2.12 ---
[INFO] compile in 0.0 s
[INFO] No sources to compile
[INFO] 
[INFO] --- maven-compiler-plugin:3.8.1:testCompile (default-testCompile) @ sansa-test-resources_2.12 ---
[INFO] No sources to compile
[INFO] 
[INFO] --- maven-surefire-plugin:2.20.1:test (default-test) @ sansa-test-resources_2.12 ---
[INFO] Tests are skipped.
[INFO] 
[INFO] --- scalatest-maven-plugin:2.0.2:test (test) @ sansa-test-resources_2.12 ---
[INFO] Tests are skipped.
[INFO] 
[INFO] --- maven-jar-plugin:3.2.0:jar (default-jar) @ sansa-test-resources_2.12 ---
[INFO] Building jar: /usr/share/tomcat8/.jenkins/jobs/SANSA-Stack/branches/claus-record-reader-revision/workspace/sansa-test-resources/target/sansa-test-resources_2.12-0.8.0-RC2-SNAPSHOT.jar
[INFO] 
[INFO] >>> scala-maven-plugin:4.4.0:doc-jar (attach-javadocs) > generate-sources @ sansa-test-resources_2.12 >>>
[INFO] 
[INFO] --- jacoco-maven-plugin:0.8.4:prepare-agent (prepare-agent) @ sansa-test-resources_2.12 ---
[INFO] argLine set to -javaagent:/usr/share/tomcat8/.m2/repository/org/jacoco/org.jacoco.agent/0.8.4/org.jacoco.agent-0.8.4-runtime.jar=destfile=/usr/share/tomcat8/.jenkins/jobs/SANSA-Stack/branches/claus-record-reader-revision/workspace/sansa-test-resources/target/jacoco.exec
[INFO] 
[INFO] <<< scala-maven-plugin:4.4.0:doc-jar (attach-javadocs) < generate-sources @ sansa-test-resources_2.12 <<<
[INFO] 
[INFO] 
[INFO] --- scala-maven-plugin:4.4.0:doc-jar (attach-javadocs) @ sansa-test-resources_2.12 ---
[INFO] No source files found
[INFO] 
[INFO] --- maven-javadoc-plugin:3.1.1:jar (attach-javadocs) @ sansa-test-resources_2.12 ---
[INFO] 
[INFO] --- maven-install-plugin:2.4:install (default-install) @ sansa-test-resources_2.12 ---
[INFO] Installing /usr/share/tomcat8/.jenkins/jobs/SANSA-Stack/branches/claus-record-reader-revision/workspace/sansa-test-resources/target/sansa-test-resources_2.12-0.8.0-RC2-SNAPSHOT.jar to /usr/share/tomcat8/.m2/repository/net/sansa-stack/sansa-test-resources_2.12/0.8.0-RC2-SNAPSHOT/sansa-test-resources_2.12-0.8.0-RC2-SNAPSHOT.jar
[INFO] Installing /usr/share/tomcat8/.jenkins/jobs/SANSA-Stack/branches/claus-record-reader-revision/workspace/sansa-test-resources/pom.xml to /usr/share/tomcat8/.m2/repository/net/sansa-stack/sansa-test-resources_2.12/0.8.0-RC2-SNAPSHOT/sansa-test-resources_2.12-0.8.0-RC2-SNAPSHOT.pom
[INFO] 
[INFO] --- maven-deploy-plugin:2.7:deploy (default-deploy) @ sansa-test-resources_2.12 ---
[INFO] Downloading from maven.aksw.snapshots: https://maven.aksw.org/archiva/repository/snapshots/net/sansa-stack/sansa-test-resources_2.12/0.8.0-RC2-SNAPSHOT/maven-metadata.xml
[INFO] Downloaded from maven.aksw.snapshots: https://maven.aksw.org/archiva/repository/snapshots/net/sansa-stack/sansa-test-resources_2.12/0.8.0-RC2-SNAPSHOT/maven-metadata.xml (382 B at 3.6 kB/s)
[INFO] Uploading to maven.aksw.snapshots: https://maven.aksw.org/archiva/repository/snapshots/net/sansa-stack/sansa-test-resources_2.12/0.8.0-RC2-SNAPSHOT/sansa-test-resources_2.12-0.8.0-RC2-20210628.185846-33.jar
[INFO] Uploaded to maven.aksw.snapshots: https://maven.aksw.org/archiva/repository/snapshots/net/sansa-stack/sansa-test-resources_2.12/0.8.0-RC2-SNAPSHOT/sansa-test-resources_2.12-0.8.0-RC2-20210628.185846-33.jar (1.9 kB at 29 kB/s)
[INFO] Uploading to maven.aksw.snapshots: https://maven.aksw.org/archiva/repository/snapshots/net/sansa-stack/sansa-test-resources_2.12/0.8.0-RC2-SNAPSHOT/sansa-test-resources_2.12-0.8.0-RC2-20210628.185846-33.pom
[INFO] Uploaded to maven.aksw.snapshots: https://maven.aksw.org/archiva/repository/snapshots/net/sansa-stack/sansa-test-resources_2.12/0.8.0-RC2-SNAPSHOT/sansa-test-resources_2.12-0.8.0-RC2-20210628.185846-33.pom (718 B at 20 kB/s)
[INFO] Downloading from maven.aksw.snapshots: https://maven.aksw.org/archiva/repository/snapshots/net/sansa-stack/sansa-test-resources_2.12/maven-metadata.xml
[INFO] Downloaded from maven.aksw.snapshots: https://maven.aksw.org/archiva/repository/snapshots/net/sansa-stack/sansa-test-resources_2.12/maven-metadata.xml (385 B at 28 kB/s)
[INFO] Uploading to maven.aksw.snapshots: https://maven.aksw.org/archiva/repository/snapshots/net/sansa-stack/sansa-test-resources_2.12/0.8.0-RC2-SNAPSHOT/maven-metadata.xml
[INFO] Uploaded to maven.aksw.snapshots: https://maven.aksw.org/archiva/repository/snapshots/net/sansa-stack/sansa-test-resources_2.12/0.8.0-RC2-SNAPSHOT/maven-metadata.xml (805 B at 37 kB/s)
[INFO] Uploading to maven.aksw.snapshots: https://maven.aksw.org/archiva/repository/snapshots/net/sansa-stack/sansa-test-resources_2.12/maven-metadata.xml
[INFO] Uploaded to maven.aksw.snapshots: https://maven.aksw.org/archiva/repository/snapshots/net/sansa-stack/sansa-test-resources_2.12/maven-metadata.xml (384 B at 21 kB/s)
[INFO] 
[INFO] -----------------< net.sansa-stack:sansa-hadoop-jena >------------------
[INFO] Building sansa-hadoop-jena 0.8.0-RC2-SNAPSHOT                     [3/14]
[INFO] --------------------------------[ jar ]---------------------------------
[INFO] Downloading from maven.aksw.snapshots: https://maven.aksw.org/archiva/repository/snapshots/net/minidev/json-smart/maven-metadata.xml
[INFO] Downloading from maven.aksw.internal: https://maven.aksw.org/archiva/repository/internal/net/minidev/json-smart/maven-metadata.xml
[INFO] Downloading from central: https://repo.maven.apache.org/maven2/net/minidev/json-smart/maven-metadata.xml
[INFO] Downloading from oss-sonatype-releases: https://oss.sonatype.org/content/repositories/releases/net/minidev/json-smart/maven-metadata.xml
[INFO] Downloading from apache.snapshots.https: https://repository.apache.org/content/repositories/snapshots/net/minidev/json-smart/maven-metadata.xml
[INFO] Downloaded from maven.aksw.internal: https://maven.aksw.org/archiva/repository/internal/net/minidev/json-smart/maven-metadata.xml (383 B at 12 kB/s)
[INFO] Downloading from maven-default-http-blocker: http://0.0.0.0/net/minidev/json-smart/maven-metadata.xml
[INFO] Downloaded from central: https://repo.maven.apache.org/maven2/net/minidev/json-smart/maven-metadata.xml (1.1 kB at 7.4 kB/s)
[INFO] Downloaded from oss-sonatype-releases: https://oss.sonatype.org/content/repositories/releases/net/minidev/json-smart/maven-metadata.xml (1.1 kB at 1.4 kB/s)
[WARNING] Could not transfer metadata net.minidev:json-smart/maven-metadata.xml from/to maven-default-http-blocker (http://0.0.0.0/): transfer failed for http://0.0.0.0/net/minidev/json-smart/maven-metadata.xml
[INFO] Downloading from maven.aksw.snapshots: https://maven.aksw.org/archiva/repository/snapshots/org/aksw/jena-sparql-api/jena-sparql-api-rx/3.17.0-2-SNAPSHOT/maven-metadata.xml
[INFO] Downloaded from maven.aksw.snapshots: https://maven.aksw.org/archiva/repository/snapshots/org/aksw/jena-sparql-api/jena-sparql-api-rx/3.17.0-2-SNAPSHOT/maven-metadata.xml (382 B at 8.1 kB/s)
[INFO] Downloading from maven.aksw.snapshots: https://maven.aksw.org/archiva/repository/snapshots/org/aksw/jena-sparql-api/jena-sparql-api-parent/3.17.0-2-SNAPSHOT/maven-metadata.xml
[INFO] Downloaded from maven.aksw.snapshots: https://maven.aksw.org/archiva/repository/snapshots/org/aksw/jena-sparql-api/jena-sparql-api-parent/3.17.0-2-SNAPSHOT/maven-metadata.xml (386 B at 4.9 kB/s)
[INFO] Downloading from maven-default-http-blocker: http://0.0.0.0/org/aksw/jena-sparql-api/jena-sparql-api-concepts/3.17.0-2-SNAPSHOT/maven-metadata.xml
[INFO] Downloading from maven.aksw.snapshots: https://maven.aksw.org/archiva/repository/snapshots/org/aksw/jena-sparql-api/jena-sparql-api-concepts/3.17.0-2-SNAPSHOT/maven-metadata.xml
[INFO] Downloaded from maven.aksw.snapshots: https://maven.aksw.org/archiva/repository/snapshots/org/aksw/jena-sparql-api/jena-sparql-api-concepts/3.17.0-2-SNAPSHOT/maven-metadata.xml (388 B at 1.1 kB/s)
[WARNING] Could not transfer metadata org.aksw.jena-sparql-api:jena-sparql-api-concepts:3.17.0-2-SNAPSHOT/maven-metadata.xml from/to maven-default-http-blocker (http://0.0.0.0/): transfer failed for http://0.0.0.0/org/aksw/jena-sparql-api/jena-sparql-api-concepts/3.17.0-2-SNAPSHOT/maven-metadata.xml
[WARNING] org.aksw.jena-sparql-api:jena-sparql-api-concepts:3.17.0-2-SNAPSHOT/maven-metadata.xmlfailed to transfer from http://0.0.0.0/ during a previous attempt. This failure was cached in the local repository and resolution will not be reattempted until the update interval of maven-default-http-blocker has elapsed or updates are forced. Original error: Could not transfer metadata org.aksw.jena-sparql-api:jena-sparql-api-concepts:3.17.0-2-SNAPSHOT/maven-metadata.xml from/to maven-default-http-blocker (http://0.0.0.0/): transfer failed for http://0.0.0.0/org/aksw/jena-sparql-api/jena-sparql-api-concepts/3.17.0-2-SNAPSHOT/maven-metadata.xml
[INFO] Downloading from maven.aksw.snapshots: https://maven.aksw.org/archiva/repository/snapshots/org/aksw/jena-sparql-api/jena-sparql-api-stmt/3.17.0-2-SNAPSHOT/maven-metadata.xml
[INFO] Downloading from maven-default-http-blocker: http://0.0.0.0/org/aksw/jena-sparql-api/jena-sparql-api-stmt/3.17.0-2-SNAPSHOT/maven-metadata.xml
[INFO] Downloaded from maven.aksw.snapshots: https://maven.aksw.org/archiva/repository/snapshots/org/aksw/jena-sparql-api/jena-sparql-api-stmt/3.17.0-2-SNAPSHOT/maven-metadata.xml (384 B at 32 kB/s)
[WARNING] Could not transfer metadata org.aksw.jena-sparql-api:jena-sparql-api-stmt:3.17.0-2-SNAPSHOT/maven-metadata.xml from/to maven-default-http-blocker (http://0.0.0.0/): transfer failed for http://0.0.0.0/org/aksw/jena-sparql-api/jena-sparql-api-stmt/3.17.0-2-SNAPSHOT/maven-metadata.xml
[WARNING] org.aksw.jena-sparql-api:jena-sparql-api-stmt:3.17.0-2-SNAPSHOT/maven-metadata.xmlfailed to transfer from http://0.0.0.0/ during a previous attempt. This failure was cached in the local repository and resolution will not be reattempted until the update interval of maven-default-http-blocker has elapsed or updates are forced. Original error: Could not transfer metadata org.aksw.jena-sparql-api:jena-sparql-api-stmt:3.17.0-2-SNAPSHOT/maven-metadata.xml from/to maven-default-http-blocker (http://0.0.0.0/): transfer failed for http://0.0.0.0/org/aksw/jena-sparql-api/jena-sparql-api-stmt/3.17.0-2-SNAPSHOT/maven-metadata.xml
[INFO] Downloading from maven.aksw.snapshots: https://maven.aksw.org/archiva/repository/snapshots/org/aksw/jena-sparql-api/jena-sparql-api-resources/3.17.0-2-SNAPSHOT/maven-metadata.xml
[INFO] Downloading from maven-default-http-blocker: http://0.0.0.0/org/aksw/jena-sparql-api/jena-sparql-api-resources/3.17.0-2-SNAPSHOT/maven-metadata.xml
[INFO] Downloaded from maven.aksw.snapshots: https://maven.aksw.org/archiva/repository/snapshots/org/aksw/jena-sparql-api/jena-sparql-api-resources/3.17.0-2-SNAPSHOT/maven-metadata.xml (1.0 kB at 7.9 kB/s)
[WARNING] Could not transfer metadata org.aksw.jena-sparql-api:jena-sparql-api-resources:3.17.0-2-SNAPSHOT/maven-metadata.xml from/to maven-default-http-blocker (http://0.0.0.0/): transfer failed for http://0.0.0.0/org/aksw/jena-sparql-api/jena-sparql-api-resources/3.17.0-2-SNAPSHOT/maven-metadata.xml
[WARNING] org.aksw.jena-sparql-api:jena-sparql-api-resources:3.17.0-2-SNAPSHOT/maven-metadata.xmlfailed to transfer from http://0.0.0.0/ during a previous attempt. This failure was cached in the local repository and resolution will not be reattempted until the update interval of maven-default-http-blocker has elapsed or updates are forced. Original error: Could not transfer metadata org.aksw.jena-sparql-api:jena-sparql-api-resources:3.17.0-2-SNAPSHOT/maven-metadata.xml from/to maven-default-http-blocker (http://0.0.0.0/): transfer failed for http://0.0.0.0/org/aksw/jena-sparql-api/jena-sparql-api-resources/3.17.0-2-SNAPSHOT/maven-metadata.xml
[INFO] Downloading from maven.aksw.snapshots: https://maven.aksw.org/archiva/repository/snapshots/org/aksw/jena-sparql-api/jena-sparql-api-utils/3.17.0-2-SNAPSHOT/maven-metadata.xml
[INFO] Downloading from maven-default-http-blocker: http://0.0.0.0/org/aksw/jena-sparql-api/jena-sparql-api-utils/3.17.0-2-SNAPSHOT/maven-metadata.xml
[INFO] Downloaded from maven.aksw.snapshots: https://maven.aksw.org/archiva/repository/snapshots/org/aksw/jena-sparql-api/jena-sparql-api-utils/3.17.0-2-SNAPSHOT/maven-metadata.xml (1.0 kB at 73 kB/s)
[WARNING] Could not transfer metadata org.aksw.jena-sparql-api:jena-sparql-api-utils:3.17.0-2-SNAPSHOT/maven-metadata.xml from/to maven-default-http-blocker (http://0.0.0.0/): transfer failed for http://0.0.0.0/org/aksw/jena-sparql-api/jena-sparql-api-utils/3.17.0-2-SNAPSHOT/maven-metadata.xml
[WARNING] org.aksw.jena-sparql-api:jena-sparql-api-utils:3.17.0-2-SNAPSHOT/maven-metadata.xmlfailed to transfer from http://0.0.0.0/ during a previous attempt. This failure was cached in the local repository and resolution will not be reattempted until the update interval of maven-default-http-blocker has elapsed or updates are forced. Original error: Could not transfer metadata org.aksw.jena-sparql-api:jena-sparql-api-utils:3.17.0-2-SNAPSHOT/maven-metadata.xml from/to maven-default-http-blocker (http://0.0.0.0/): transfer failed for http://0.0.0.0/org/aksw/jena-sparql-api/jena-sparql-api-utils/3.17.0-2-SNAPSHOT/maven-metadata.xml
[INFO] Downloading from maven-default-http-blocker: http://0.0.0.0/org/aksw/jena-sparql-api/jena-sparql-api-collections/3.17.0-2-SNAPSHOT/maven-metadata.xml
[INFO] Downloading from maven.aksw.snapshots: https://maven.aksw.org/archiva/repository/snapshots/org/aksw/jena-sparql-api/jena-sparql-api-collections/3.17.0-2-SNAPSHOT/maven-metadata.xml
[INFO] Downloaded from maven.aksw.snapshots: https://maven.aksw.org/archiva/repository/snapshots/org/aksw/jena-sparql-api/jena-sparql-api-collections/3.17.0-2-SNAPSHOT/maven-metadata.xml (391 B at 1.8 kB/s)
[WARNING] Could not transfer metadata org.aksw.jena-sparql-api:jena-sparql-api-collections:3.17.0-2-SNAPSHOT/maven-metadata.xml from/to maven-default-http-blocker (http://0.0.0.0/): transfer failed for http://0.0.0.0/org/aksw/jena-sparql-api/jena-sparql-api-collections/3.17.0-2-SNAPSHOT/maven-metadata.xml
[WARNING] org.aksw.jena-sparql-api:jena-sparql-api-collections:3.17.0-2-SNAPSHOT/maven-metadata.xmlfailed to transfer from http://0.0.0.0/ during a previous attempt. This failure was cached in the local repository and resolution will not be reattempted until the update interval of maven-default-http-blocker has elapsed or updates are forced. Original error: Could not transfer metadata org.aksw.jena-sparql-api:jena-sparql-api-collections:3.17.0-2-SNAPSHOT/maven-metadata.xml from/to maven-default-http-blocker (http://0.0.0.0/): transfer failed for http://0.0.0.0/org/aksw/jena-sparql-api/jena-sparql-api-collections/3.17.0-2-SNAPSHOT/maven-metadata.xml
[INFO] Downloading from maven.aksw.snapshots: https://maven.aksw.org/archiva/repository/snapshots/org/aksw/jena-sparql-api/jena-sparql-api-mapper-annotations/3.17.0-2-SNAPSHOT/maven-metadata.xml
[INFO] Downloading from maven-default-http-blocker: http://0.0.0.0/org/aksw/jena-sparql-api/jena-sparql-api-mapper-annotations/3.17.0-2-SNAPSHOT/maven-metadata.xml
[INFO] Downloaded from maven.aksw.snapshots: https://maven.aksw.org/archiva/repository/snapshots/org/aksw/jena-sparql-api/jena-sparql-api-mapper-annotations/3.17.0-2-SNAPSHOT/maven-metadata.xml (398 B at 8.7 kB/s)
[WARNING] Could not transfer metadata org.aksw.jena-sparql-api:jena-sparql-api-mapper-annotations:3.17.0-2-SNAPSHOT/maven-metadata.xml from/to maven-default-http-blocker (http://0.0.0.0/): transfer failed for http://0.0.0.0/org/aksw/jena-sparql-api/jena-sparql-api-mapper-annotations/3.17.0-2-SNAPSHOT/maven-metadata.xml
[WARNING] org.aksw.jena-sparql-api:jena-sparql-api-mapper-annotations:3.17.0-2-SNAPSHOT/maven-metadata.xmlfailed to transfer from http://0.0.0.0/ during a previous attempt. This failure was cached in the local repository and resolution will not be reattempted until the update interval of maven-default-http-blocker has elapsed or updates are forced. Original error: Could not transfer metadata org.aksw.jena-sparql-api:jena-sparql-api-mapper-annotations:3.17.0-2-SNAPSHOT/maven-metadata.xml from/to maven-default-http-blocker (http://0.0.0.0/): transfer failed for http://0.0.0.0/org/aksw/jena-sparql-api/jena-sparql-api-mapper-annotations/3.17.0-2-SNAPSHOT/maven-metadata.xml
[INFO] Downloading from maven.aksw.snapshots: https://maven.aksw.org/archiva/repository/snapshots/org/aksw/jena-sparql-api/jena-sparql-api-io-core/3.17.0-2-SNAPSHOT/maven-metadata.xml
[INFO] Downloaded from maven.aksw.snapshots: https://maven.aksw.org/archiva/repository/snapshots/org/aksw/jena-sparql-api/jena-sparql-api-io-core/3.17.0-2-SNAPSHOT/maven-metadata.xml (387 B at 28 kB/s)
[INFO] 
[INFO] --- maven-clean-plugin:2.5:clean (default-clean) @ sansa-hadoop-jena ---
[INFO] 
[INFO] --- jacoco-maven-plugin:0.8.4:prepare-agent (prepare-agent) @ sansa-hadoop-jena ---
[INFO] argLine set to -javaagent:/usr/share/tomcat8/.m2/repository/org/jacoco/org.jacoco.agent/0.8.4/org.jacoco.agent-0.8.4-runtime.jar=destfile=/usr/share/tomcat8/.jenkins/jobs/SANSA-Stack/branches/claus-record-reader-revision/workspace/sansa-hadoop-jena/target/jacoco.exec
[INFO] 
[INFO] --- maven-resources-plugin:3.0.2:resources (default-resources) @ sansa-hadoop-jena ---
[INFO] Using 'UTF-8' encoding to copy filtered resources.
[INFO] skip non existing resourceDirectory /usr/share/tomcat8/.jenkins/jobs/SANSA-Stack/branches/claus-record-reader-revision/workspace/sansa-hadoop-jena/src/main/resources
[INFO] 
[INFO] --- scala-maven-plugin:4.4.0:add-source (scala-compile-first) @ sansa-hadoop-jena ---
[INFO] Add Source directory: /usr/share/tomcat8/.jenkins/jobs/SANSA-Stack/branches/claus-record-reader-revision/workspace/sansa-hadoop-jena/src/main/scala
[INFO] Add Test Source directory: /usr/share/tomcat8/.jenkins/jobs/SANSA-Stack/branches/claus-record-reader-revision/workspace/sansa-hadoop-jena/src/test/scala
[INFO] 
[INFO] --- scala-maven-plugin:4.4.0:compile (scala-compile-first) @ sansa-hadoop-jena ---
[WARNING] net.minidev:json-smart/maven-metadata.xmlfailed to transfer from http://0.0.0.0/ during a previous attempt. This failure was cached in the local repository and resolution will not be reattempted until the update interval of maven-default-http-blocker has elapsed or updates are forced. Original error: Could not transfer metadata net.minidev:json-smart/maven-metadata.xml from/to maven-default-http-blocker (http://0.0.0.0/): transfer failed for http://0.0.0.0/net/minidev/json-smart/maven-metadata.xml
[INFO] Using incremental compilation using Mixed compile order
[INFO] Compiler bridge file: /usr/share/tomcat8/.sbt/1.0/zinc/org.scala-sbt/org.scala-sbt-compiler-bridge_2.12-1.3.5-bin_2.12.11__52.0-1.3.5_20200330T000931.jar
[INFO] Compiling 28 Java sources to /usr/share/tomcat8/.jenkins/jobs/SANSA-Stack/branches/claus-record-reader-revision/workspace/sansa-hadoop-jena/target/classes ...
[WARNING] Unexpected javac output: Note: CAL10NAnnotationProcessor 0.8.1 initialized
warning: Supported source version 'RELEASE_5' from annotation processor 'ch.qos.cal10n.verifier.processor.CAL10NAnnotationProcessor' less than -source '1.8'
Note: Some input files use unchecked or unsafe operations.
Note: Recompile with -Xlint:unchecked for details.
1 warning.
[INFO] NoPosition: Note: CAL10NAnnotationProcessor 0.8.1 initialized
[INFO] Done compiling.
[INFO] compile in 11.0 s
[INFO] 
[INFO] --- maven-compiler-plugin:3.8.1:compile (default-compile) @ sansa-hadoop-jena ---
[INFO] Changes detected - recompiling the module!
[INFO] Compiling 28 source files to /usr/share/tomcat8/.jenkins/jobs/SANSA-Stack/branches/claus-record-reader-revision/workspace/sansa-hadoop-jena/target/classes
[INFO] /usr/share/tomcat8/.jenkins/jobs/SANSA-Stack/branches/claus-record-reader-revision/workspace/sansa-hadoop-jena/src/main/java/net/sansa_stack/hadoop/generic/RecordReaderGenericBase.java: Some input files use unchecked or unsafe operations.
[INFO] /usr/share/tomcat8/.jenkins/jobs/SANSA-Stack/branches/claus-record-reader-revision/workspace/sansa-hadoop-jena/src/main/java/net/sansa_stack/hadoop/generic/RecordReaderGenericBase.java: Recompile with -Xlint:unchecked for details.
[INFO] 
[INFO] --- maven-resources-plugin:3.0.2:testResources (default-testResources) @ sansa-hadoop-jena ---
[INFO] Using 'UTF-8' encoding to copy filtered resources.
[INFO] skip non existing resourceDirectory /usr/share/tomcat8/.jenkins/jobs/SANSA-Stack/branches/claus-record-reader-revision/workspace/sansa-hadoop-jena/src/test/resources
[INFO] 
[INFO] --- scala-maven-plugin:4.4.0:testCompile (scala-test-compile) @ sansa-hadoop-jena ---
[WARNING] net.minidev:json-smart/maven-metadata.xmlfailed to transfer from http://0.0.0.0/ during a previous attempt. This failure was cached in the local repository and resolution will not be reattempted until the update interval of maven-default-http-blocker has elapsed or updates are forced. Original error: Could not transfer metadata net.minidev:json-smart/maven-metadata.xml from/to maven-default-http-blocker (http://0.0.0.0/): transfer failed for http://0.0.0.0/net/minidev/json-smart/maven-metadata.xml
[INFO] Using incremental compilation using Mixed compile order
[INFO] Compiler bridge file: /usr/share/tomcat8/.sbt/1.0/zinc/org.scala-sbt/org.scala-sbt-compiler-bridge_2.12-1.3.5-bin_2.12.11__52.0-1.3.5_20200330T000931.jar
[INFO] Compiling 5 Java sources to /usr/share/tomcat8/.jenkins/jobs/SANSA-Stack/branches/claus-record-reader-revision/workspace/sansa-hadoop-jena/target/test-classes ...
[WARNING] Unexpected javac output: Note: CAL10NAnnotationProcessor 0.8.1 initialized
warning: Supported source version 'RELEASE_5' from annotation processor 'ch.qos.cal10n.verifier.processor.CAL10NAnnotationProcessor' less than -source '1.8'
1 warning.
[INFO] NoPosition: Note: CAL10NAnnotationProcessor 0.8.1 initialized
[INFO] Done compiling.
[INFO] compile in 3.0 s
[INFO] 
[INFO] --- maven-compiler-plugin:3.8.1:testCompile (default-testCompile) @ sansa-hadoop-jena ---
[INFO] Changes detected - recompiling the module!
[INFO] Compiling 5 source files to /usr/share/tomcat8/.jenkins/jobs/SANSA-Stack/branches/claus-record-reader-revision/workspace/sansa-hadoop-jena/target/test-classes
[INFO] 
[INFO] --- maven-surefire-plugin:2.20.1:test (default-test) @ sansa-hadoop-jena ---
[INFO] Tests are skipped.
[INFO] 
[INFO] --- scalatest-maven-plugin:2.0.2:test (test) @ sansa-hadoop-jena ---
[INFO] Tests are skipped.
[INFO] 
[INFO] --- maven-jar-plugin:3.2.0:jar (default-jar) @ sansa-hadoop-jena ---
[INFO] Building jar: /usr/share/tomcat8/.jenkins/jobs/SANSA-Stack/branches/claus-record-reader-revision/workspace/sansa-hadoop-jena/target/sansa-hadoop-jena-0.8.0-RC2-SNAPSHOT.jar
[INFO] 
[INFO] >>> scala-maven-plugin:4.4.0:doc-jar (attach-javadocs) > generate-sources @ sansa-hadoop-jena >>>
[WARNING] net.minidev:json-smart/maven-metadata.xmlfailed to transfer from http://0.0.0.0/ during a previous attempt. This failure was cached in the local repository and resolution will not be reattempted until the update interval of maven-default-http-blocker has elapsed or updates are forced. Original error: Could not transfer metadata net.minidev:json-smart/maven-metadata.xml from/to maven-default-http-blocker (http://0.0.0.0/): transfer failed for http://0.0.0.0/net/minidev/json-smart/maven-metadata.xml
[INFO] 
[INFO] --- jacoco-maven-plugin:0.8.4:prepare-agent (prepare-agent) @ sansa-hadoop-jena ---
[INFO] argLine set to -javaagent:/usr/share/tomcat8/.m2/repository/org/jacoco/org.jacoco.agent/0.8.4/org.jacoco.agent-0.8.4-runtime.jar=destfile=/usr/share/tomcat8/.jenkins/jobs/SANSA-Stack/branches/claus-record-reader-revision/workspace/sansa-hadoop-jena/target/jacoco.exec
[INFO] 
[INFO] <<< scala-maven-plugin:4.4.0:doc-jar (attach-javadocs) < generate-sources @ sansa-hadoop-jena <<<
[INFO] 
[INFO] 
[INFO] --- scala-maven-plugin:4.4.0:doc-jar (attach-javadocs) @ sansa-hadoop-jena ---
[WARNING] net.minidev:json-smart/maven-metadata.xmlfailed to transfer from http://0.0.0.0/ during a previous attempt. This failure was cached in the local repository and resolution will not be reattempted until the update interval of maven-default-http-blocker has elapsed or updates are forced. Original error: Could not transfer metadata net.minidev:json-smart/maven-metadata.xml from/to maven-default-http-blocker (http://0.0.0.0/): transfer failed for http://0.0.0.0/net/minidev/json-smart/maven-metadata.xml
[WARNING] net.minidev:json-smart/maven-metadata.xmlfailed to transfer from http://0.0.0.0/ during a previous attempt. This failure was cached in the local repository and resolution will not be reattempted until the update interval of maven-default-http-blocker has elapsed or updates are forced. Original error: Could not transfer metadata net.minidev:json-smart/maven-metadata.xml from/to maven-default-http-blocker (http://0.0.0.0/): transfer failed for http://0.0.0.0/net/minidev/json-smart/maven-metadata.xml
/usr/share/tomcat8/.jenkins/jobs/SANSA-Stack/branches/claus-record-reader-revision/workspace/sansa-hadoop-jena/src/main/java/net/sansa_stack/nio/util/InterruptingSeekableByteChannel.java:11: error: class type required but net.sansa_stack.nio.util.SeekableByteChannelDecoratorBase[_ <: java.nio.channels.SeekableByteChannel] found
    extends SeekableByteChannelDecoratorBase
            ^
model contains 45 documentable templates
/usr/share/tomcat8/.jenkins/jobs/SANSA-Stack/branches/claus-record-reader-revision/workspace/sansa-hadoop-jena/src/main/java/net/sansa_stack/hadoop/util/DeferredSeekablePushbackInputStream.java:67: warning: Could not find any member to link for "IOException".
    /**
    ^
/usr/share/tomcat8/.jenkins/jobs/SANSA-Stack/branches/claus-record-reader-revision/workspace/sansa-hadoop-jena/src/main/java/net/sansa_stack/hadoop/jena/rdf/base/FileInputFormatRdfBase.java:32: warning: Could not find any member to link for "#createRecordReaderActual(InputSplit,".
/**
^
/usr/share/tomcat8/.jenkins/jobs/SANSA-Stack/branches/claus-record-reader-revision/workspace/sansa-hadoop-jena/src/main/java/net/sansa_stack/hadoop/generic/RecordReaderGenericBase.java:52: warning: Could not find any member to link for "#parse(Callable)".
/**
^
/usr/share/tomcat8/.jenkins/jobs/SANSA-Stack/branches/claus-record-reader-revision/workspace/sansa-hadoop-jena/src/main/java/net/sansa_stack/hadoop/generic/RecordReaderGenericBase.java:52: warning: Could not find any member to link for "Flowable".
/**
^
four warnings found
one error found
[INFO] ------------------------------------------------------------------------
[INFO] Reactor Summary for SANSA - Parent 0.8.0-RC2-SNAPSHOT:
[INFO] 
[INFO] SANSA - Parent ..................................... SUCCESS [ 18.294 s]
[INFO] sansa-test-resources_2.12 .......................... SUCCESS [  5.506 s]
[INFO] sansa-hadoop-jena .................................. FAILURE [ 28.677 s]
[INFO] sansa-kryo-jena .................................... SKIPPED
[INFO] sansa-resource-metadata ............................ SKIPPED
[INFO] sansa-resource-testdata ............................ SKIPPED
[INFO] SANSA Stack - RDF Layer - Parent ................... SKIPPED
[INFO] sansa-rdf-common_2.12 .............................. SKIPPED
[INFO] sansa-rdf-spark_2.12 ............................... SKIPPED
[INFO] SANSA Stack - DataLake Layer - Parent .............. SKIPPED
[INFO] sansa-datalake-spark_2.12 .......................... SKIPPED
[INFO] SANSA Stack - Query Layer - Parent ................. SKIPPED
[INFO] sansa-query-tests_2.12 ............................. SKIPPED
[INFO] sansa-query-spark_2.12 ............................. SKIPPED
[INFO] ------------------------------------------------------------------------
[INFO] BUILD FAILURE
[INFO] ------------------------------------------------------------------------
[INFO] Total time:  53.435 s
[INFO] Finished at: 2021-06-28T20:59:15+02:00
[INFO] ------------------------------------------------------------------------
[ERROR] Failed to execute goal net.alchim31.maven:scala-maven-plugin:4.4.0:doc-jar (attach-javadocs) on project sansa-hadoop-jena: MavenReportException: Error while creating archive: wrap: Process exited with an error: 1 (Exit value: 1) -> [Help 1]
org.apache.maven.lifecycle.LifecycleExecutionException: Failed to execute goal net.alchim31.maven:scala-maven-plugin:4.4.0:doc-jar (attach-javadocs) on project sansa-hadoop-jena: MavenReportException: Error while creating archive: wrap: Process exited with an error: 1 (Exit value: 1)
    at org.apache.maven.lifecycle.internal.MojoExecutor.execute (MojoExecutor.java:215)
    at org.apache.maven.lifecycle.internal.MojoExecutor.execute (MojoExecutor.java:156)
    at org.apache.maven.lifecycle.internal.MojoExecutor.execute (MojoExecutor.java:148)
    at org.apache.maven.lifecycle.internal.LifecycleModuleBuilder.buildProject (LifecycleModuleBuilder.java:117)
    at org.apache.maven.lifecycle.internal.LifecycleModuleBuilder.buildProject (LifecycleModuleBuilder.java:81)
    at org.apache.maven.lifecycle.internal.builder.singlethreaded.SingleThreadedBuilder.build (SingleThreadedBuilder.java:56)
    at org.apache.maven.lifecycle.internal.LifecycleStarter.execute (LifecycleStarter.java:128)
    at org.apache.maven.DefaultMaven.doExecute (DefaultMaven.java:305)
    at org.apache.maven.DefaultMaven.doExecute (DefaultMaven.java:192)
    at org.apache.maven.DefaultMaven.execute (DefaultMaven.java:105)
    at org.apache.maven.cli.MavenCli.execute (MavenCli.java:957)
    at org.apache.maven.cli.MavenCli.doMain (MavenCli.java:289)
    at org.apache.maven.cli.MavenCli.main (MavenCli.java:193)
    at sun.reflect.NativeMethodAccessorImpl.invoke0 (Native Method)
    at sun.reflect.NativeMethodAccessorImpl.invoke (NativeMethodAccessorImpl.java:62)
    at sun.reflect.DelegatingMethodAccessorImpl.invoke (DelegatingMethodAccessorImpl.java:43)
    at java.lang.reflect.Method.invoke (Method.java:498)
    at org.codehaus.plexus.classworlds.launcher.Launcher.launchEnhanced (Launcher.java:282)
    at org.codehaus.plexus.classworlds.launcher.Launcher.launch (Launcher.java:225)
    at org.codehaus.plexus.classworlds.launcher.Launcher.mainWithExitCode (Launcher.java:406)
    at org.codehaus.plexus.classworlds.launcher.Launcher.main (Launcher.java:347)
Caused by: org.apache.maven.plugin.MojoExecutionException: MavenReportException: Error while creating archive: wrap: Process exited with an error: 1 (Exit value: 1)
    at scala_maven.ScalaDocJarMojo.failOnError (ScalaDocJarMojo.java:207)
    at scala_maven.ScalaDocJarMojo.doExecute (ScalaDocJarMojo.java:146)
    at scala_maven.ScalaMojoSupport.execute (ScalaMojoSupport.java:557)
    at org.apache.maven.plugin.DefaultBuildPluginManager.executeMojo (DefaultBuildPluginManager.java:137)
    at org.apache.maven.lifecycle.internal.MojoExecutor.execute (MojoExecutor.java:210)
    at org.apache.maven.lifecycle.internal.MojoExecutor.execute (MojoExecutor.java:156)
    at org.apache.maven.lifecycle.internal.MojoExecutor.execute (MojoExecutor.java:148)
    at org.apache.maven.lifecycle.internal.LifecycleModuleBuilder.buildProject (LifecycleModuleBuilder.java:117)
    at org.apache.maven.lifecycle.internal.LifecycleModuleBuilder.buildProject (LifecycleModuleBuilder.java:81)
    at org.apache.maven.lifecycle.internal.builder.singlethreaded.SingleThreadedBuilder.build (SingleThreadedBuilder.java:56)
    at org.apache.maven.lifecycle.internal.LifecycleStarter.execute (LifecycleStarter.java:128)
    at org.apache.maven.DefaultMaven.doExecute (DefaultMaven.java:305)
    at org.apache.maven.DefaultMaven.doExecute (DefaultMaven.java:192)
    at org.apache.maven.DefaultMaven.execute (DefaultMaven.java:105)
    at org.apache.maven.cli.MavenCli.execute (MavenCli.java:957)
    at org.apache.maven.cli.MavenCli.doMain (MavenCli.java:289)
    at org.apache.maven.cli.MavenCli.main (MavenCli.java:193)
    at sun.reflect.NativeMethodAccessorImpl.invoke0 (Native Method)
    at sun.reflect.NativeMethodAccessorImpl.invoke (NativeMethodAccessorImpl.java:62)
    at sun.reflect.DelegatingMethodAccessorImpl.invoke (DelegatingMethodAccessorImpl.java:43)
    at java.lang.reflect.Method.invoke (Method.java:498)
    at org.codehaus.plexus.classworlds.launcher.Launcher.launchEnhanced (Launcher.java:282)
    at org.codehaus.plexus.classworlds.launcher.Launcher.launch (Launcher.java:225)
    at org.codehaus.plexus.classworlds.launcher.Launcher.mainWithExitCode (Launcher.java:406)
    at org.codehaus.plexus.classworlds.launcher.Launcher.main (Launcher.java:347)
Caused by: org.apache.maven.reporting.MavenReportException: wrap: Process exited with an error: 1 (Exit value: 1)
    at scala_maven.ScalaDocMojo.generate (ScalaDocMojo.java:365)
    at scala_maven.ScalaDocJarMojo.doExecute (ScalaDocJarMojo.java:128)
    at scala_maven.ScalaMojoSupport.execute (ScalaMojoSupport.java:557)
    at org.apache.maven.plugin.DefaultBuildPluginManager.executeMojo (DefaultBuildPluginManager.java:137)
    at org.apache.maven.lifecycle.internal.MojoExecutor.execute (MojoExecutor.java:210)
    at org.apache.maven.lifecycle.internal.MojoExecutor.execute (MojoExecutor.java:156)
    at org.apache.maven.lifecycle.internal.MojoExecutor.execute (MojoExecutor.java:148)
    at org.apache.maven.lifecycle.internal.LifecycleModuleBuilder.buildProject (LifecycleModuleBuilder.java:117)
    at org.apache.maven.lifecycle.internal.LifecycleModuleBuilder.buildProject (LifecycleModuleBuilder.java:81)
    at org.apache.maven.lifecycle.internal.builder.singlethreaded.SingleThreadedBuilder.build (SingleThreadedBuilder.java:56)
    at org.apache.maven.lifecycle.internal.LifecycleStarter.execute (LifecycleStarter.java:128)
    at org.apache.maven.DefaultMaven.doExecute (DefaultMaven.java:305)
    at org.apache.maven.DefaultMaven.doExecute (DefaultMaven.java:192)
    at org.apache.maven.DefaultMaven.execute (DefaultMaven.java:105)
    at org.apache.maven.cli.MavenCli.execute (MavenCli.java:957)
    at org.apache.maven.cli.MavenCli.doMain (MavenCli.java:289)
    at org.apache.maven.cli.MavenCli.main (MavenCli.java:193)
    at sun.reflect.NativeMethodAccessorImpl.invoke0 (Native Method)
    at sun.reflect.NativeMethodAccessorImpl.invoke (NativeMethodAccessorImpl.java:62)
    at sun.reflect.DelegatingMethodAccessorImpl.invoke (DelegatingMethodAccessorImpl.java:43)
    at java.lang.reflect.Method.invoke (Method.java:498)
    at org.codehaus.plexus.classworlds.launcher.Launcher.launchEnhanced (Launcher.java:282)
    at org.codehaus.plexus.classworlds.launcher.Launcher.launch (Launcher.java:225)
    at org.codehaus.plexus.classworlds.launcher.Launcher.mainWithExitCode (Launcher.java:406)
    at org.codehaus.plexus.classworlds.launcher.Launcher.main (Launcher.java:347)
Caused by: org.apache.commons.exec.ExecuteException: Process exited with an error: 1 (Exit value: 1)
    at org.apache.commons.exec.DefaultExecutor.executeInternal (DefaultExecutor.java:404)
    at org.apache.commons.exec.DefaultExecutor.execute (DefaultExecutor.java:166)
    at org.apache.commons.exec.DefaultExecutor.execute (DefaultExecutor.java:153)
    at scala_maven_executions.JavaMainCallerByFork.run (JavaMainCallerByFork.java:90)
    at scala_maven_executions.JavaMainCallerSupport.run (JavaMainCallerSupport.java:108)
    at scala_maven.ScalaDocMojo.generate (ScalaDocMojo.java:352)
    at scala_maven.ScalaDocJarMojo.doExecute (ScalaDocJarMojo.java:128)
    at scala_maven.ScalaMojoSupport.execute (ScalaMojoSupport.java:557)
    at org.apache.maven.plugin.DefaultBuildPluginManager.executeMojo (DefaultBuildPluginManager.java:137)
    at org.apache.maven.lifecycle.internal.MojoExecutor.execute (MojoExecutor.java:210)
    at org.apache.maven.lifecycle.internal.MojoExecutor.execute (MojoExecutor.java:156)
    at org.apache.maven.lifecycle.internal.MojoExecutor.execute (MojoExecutor.java:148)
    at org.apache.maven.lifecycle.internal.LifecycleModuleBuilder.buildProject (LifecycleModuleBuilder.java:117)
    at org.apache.maven.lifecycle.internal.LifecycleModuleBuilder.buildProject (LifecycleModuleBuilder.java:81)
    at org.apache.maven.lifecycle.internal.builder.singlethreaded.SingleThreadedBuilder.build (SingleThreadedBuilder.java:56)
    at org.apache.maven.lifecycle.internal.LifecycleStarter.execute (LifecycleStarter.java:128)
    at org.apache.maven.DefaultMaven.doExecute (DefaultMaven.java:305)
    at org.apache.maven.DefaultMaven.doExecute (DefaultMaven.java:192)
    at org.apache.maven.DefaultMaven.execute (DefaultMaven.java:105)
    at org.apache.maven.cli.MavenCli.execute (MavenCli.java:957)
    at org.apache.maven.cli.MavenCli.doMain (MavenCli.java:289)
    at org.apache.maven.cli.MavenCli.main (MavenCli.java:193)
    at sun.reflect.NativeMethodAccessorImpl.invoke0 (Native Method)
    at sun.reflect.NativeMethodAccessorImpl.invoke (NativeMethodAccessorImpl.java:62)
    at sun.reflect.DelegatingMethodAccessorImpl.invoke (DelegatingMethodAccessorImpl.java:43)
    at java.lang.reflect.Method.invoke (Method.java:498)
    at org.codehaus.plexus.classworlds.launcher.Launcher.launchEnhanced (Launcher.java:282)
    at org.codehaus.plexus.classworlds.launcher.Launcher.launch (Launcher.java:225)
    at org.codehaus.plexus.classworlds.launcher.Launcher.mainWithExitCode (Launcher.java:406)
    at org.codehaus.plexus.classworlds.launcher.Launcher.main (Launcher.java:347)
[ERROR] 
[ERROR] Re-run Maven using the -X switch to enable full debug logging.
[ERROR] 
[ERROR] For more information about the errors and possible solutions, please read the following articles:
[ERROR] [Help 1] http://cwiki.apache.org/confluence/display/MAVEN/MojoExecutionException
[ERROR] 
[ERROR] After correcting the problems, you can resume the build with the command
[ERROR]   mvn <args> -rf :sansa-hadoop-jena
[Pipeline] }
[Pipeline] // withEnv
[Pipeline] }
[Pipeline] // stage
[Pipeline] }
[Pipeline] // withEnv
[Pipeline] }
[Pipeline] // withEnv
[Pipeline] }
[Pipeline] // withEnv
[Pipeline] }
[Pipeline] // node
[Pipeline] End of Pipeline

GitHub has been notified of this commit’s build result

ERROR: script returned exit code 1
Finished: FAILURE