FailedConsole Output

Skipping 164 KB.. Full Log
ata/0.8.0-RC2-SNAPSHOT/sansa-resource-testdata-0.8.0-RC2-SNAPSHOT.jar
[INFO] Installing /usr/share/tomcat8/.jenkins/jobs/SANSA-Stack/branches/develop/workspace@2/sansa-resource-testdata/pom.xml to /usr/share/tomcat8/.m2/repository/net/sansa-stack/sansa-resource-testdata/0.8.0-RC2-SNAPSHOT/sansa-resource-testdata-0.8.0-RC2-SNAPSHOT.pom
[INFO] 
[INFO] --- maven-deploy-plugin:2.7:deploy (default-deploy) @ sansa-resource-testdata ---
[INFO] Downloading from maven.aksw.snapshots: https://maven.aksw.org/archiva/repository/snapshots/net/sansa-stack/sansa-resource-testdata/0.8.0-RC2-SNAPSHOT/maven-metadata.xml
[INFO] Downloaded from maven.aksw.snapshots: https://maven.aksw.org/archiva/repository/snapshots/net/sansa-stack/sansa-resource-testdata/0.8.0-RC2-SNAPSHOT/maven-metadata.xml (803 B at 80 kB/s)
[INFO] Uploading to maven.aksw.snapshots: https://maven.aksw.org/archiva/repository/snapshots/net/sansa-stack/sansa-resource-testdata/0.8.0-RC2-SNAPSHOT/sansa-resource-testdata-0.8.0-RC2-20220121.200610-77.jar
[INFO] Uploaded to maven.aksw.snapshots: https://maven.aksw.org/archiva/repository/snapshots/net/sansa-stack/sansa-resource-testdata/0.8.0-RC2-SNAPSHOT/sansa-resource-testdata-0.8.0-RC2-20220121.200610-77.jar (786 kB at 4.8 MB/s)
[INFO] Uploading to maven.aksw.snapshots: https://maven.aksw.org/archiva/repository/snapshots/net/sansa-stack/sansa-resource-testdata/0.8.0-RC2-SNAPSHOT/sansa-resource-testdata-0.8.0-RC2-20220121.200610-77.pom
[INFO] Uploaded to maven.aksw.snapshots: https://maven.aksw.org/archiva/repository/snapshots/net/sansa-stack/sansa-resource-testdata/0.8.0-RC2-SNAPSHOT/sansa-resource-testdata-0.8.0-RC2-20220121.200610-77.pom (567 B at 6.8 kB/s)
[INFO] Downloading from maven.aksw.snapshots: https://maven.aksw.org/archiva/repository/snapshots/net/sansa-stack/sansa-resource-testdata/maven-metadata.xml
[INFO] Downloaded from maven.aksw.snapshots: https://maven.aksw.org/archiva/repository/snapshots/net/sansa-stack/sansa-resource-testdata/maven-metadata.xml (433 B at 48 kB/s)
[INFO] Uploading to maven.aksw.snapshots: https://maven.aksw.org/archiva/repository/snapshots/net/sansa-stack/sansa-resource-testdata/0.8.0-RC2-SNAPSHOT/maven-metadata.xml
[INFO] Uploaded to maven.aksw.snapshots: https://maven.aksw.org/archiva/repository/snapshots/net/sansa-stack/sansa-resource-testdata/0.8.0-RC2-SNAPSHOT/maven-metadata.xml (803 B at 42 kB/s)
[INFO] Uploading to maven.aksw.snapshots: https://maven.aksw.org/archiva/repository/snapshots/net/sansa-stack/sansa-resource-testdata/maven-metadata.xml
[INFO] Uploaded to maven.aksw.snapshots: https://maven.aksw.org/archiva/repository/snapshots/net/sansa-stack/sansa-resource-testdata/maven-metadata.xml (433 B at 24 kB/s)
[INFO] 
[INFO] ---------------< net.sansa-stack:sansa-rdf-parent_2.12 >----------------
[INFO] Building SANSA Stack - RDF Layer - Parent 0.8.0-RC2-SNAPSHOT      [8/15]
[INFO] --------------------------------[ pom ]---------------------------------
[INFO] 
[INFO] --- maven-clean-plugin:2.5:clean (default-clean) @ sansa-rdf-parent_2.12 ---
[INFO] 
[INFO] --- jacoco-maven-plugin:0.8.4:prepare-agent (prepare-agent) @ sansa-rdf-parent_2.12 ---
[INFO] argLine set to -javaagent:/usr/share/tomcat8/.m2/repository/org/jacoco/org.jacoco.agent/0.8.4/org.jacoco.agent-0.8.4-runtime.jar=destfile=/usr/share/tomcat8/.jenkins/jobs/SANSA-Stack/branches/develop/workspace@2/sansa-rdf/target/jacoco.exec
[INFO] 
[INFO] --- scala-maven-plugin:4.5.3:add-source (scala-compile-first) @ sansa-rdf-parent_2.12 ---
[INFO] Add Source directory: /usr/share/tomcat8/.jenkins/jobs/SANSA-Stack/branches/develop/workspace@2/sansa-rdf/src/main/scala
[INFO] Add Test Source directory: /usr/share/tomcat8/.jenkins/jobs/SANSA-Stack/branches/develop/workspace@2/sansa-rdf/src/test/scala
[INFO] 
[INFO] --- scala-maven-plugin:4.5.3:compile (scala-compile-first) @ sansa-rdf-parent_2.12 ---
[INFO] compile in 0.0 s
[INFO] No sources to compile
[INFO] 
[INFO] --- scala-maven-plugin:4.5.3:testCompile (scala-test-compile) @ sansa-rdf-parent_2.12 ---
[INFO] compile in 0.0 s
[INFO] No sources to compile
[INFO] 
[INFO] --- scalatest-maven-plugin:2.0.2:test (test) @ sansa-rdf-parent_2.12 ---
[INFO] Tests are skipped.
[INFO] 
[INFO] --- maven-javadoc-plugin:3.1.1:jar (attach-javadocs) @ sansa-rdf-parent_2.12 ---
[INFO] Not executing Javadoc as the project is not a Java classpath-capable package
[INFO] 
[INFO] --- maven-install-plugin:2.4:install (default-install) @ sansa-rdf-parent_2.12 ---
[INFO] Installing /usr/share/tomcat8/.jenkins/jobs/SANSA-Stack/branches/develop/workspace@2/sansa-rdf/pom.xml to /usr/share/tomcat8/.m2/repository/net/sansa-stack/sansa-rdf-parent_2.12/0.8.0-RC2-SNAPSHOT/sansa-rdf-parent_2.12-0.8.0-RC2-SNAPSHOT.pom
[INFO] 
[INFO] --- maven-deploy-plugin:2.7:deploy (default-deploy) @ sansa-rdf-parent_2.12 ---
[INFO] Downloading from maven.aksw.snapshots: https://maven.aksw.org/archiva/repository/snapshots/net/sansa-stack/sansa-rdf-parent_2.12/0.8.0-RC2-SNAPSHOT/maven-metadata.xml
[INFO] Downloaded from maven.aksw.snapshots: https://maven.aksw.org/archiva/repository/snapshots/net/sansa-stack/sansa-rdf-parent_2.12/0.8.0-RC2-SNAPSHOT/maven-metadata.xml (623 B at 44 kB/s)
[INFO] Uploading to maven.aksw.snapshots: https://maven.aksw.org/archiva/repository/snapshots/net/sansa-stack/sansa-rdf-parent_2.12/0.8.0-RC2-SNAPSHOT/sansa-rdf-parent_2.12-0.8.0-RC2-20220121.200610-82.pom
[INFO] Uploaded to maven.aksw.snapshots: https://maven.aksw.org/archiva/repository/snapshots/net/sansa-stack/sansa-rdf-parent_2.12/0.8.0-RC2-SNAPSHOT/sansa-rdf-parent_2.12-0.8.0-RC2-20220121.200610-82.pom (2.1 kB at 31 kB/s)
[INFO] Downloading from maven.aksw.snapshots: https://maven.aksw.org/archiva/repository/snapshots/net/sansa-stack/sansa-rdf-parent_2.12/maven-metadata.xml
[INFO] Downloaded from maven.aksw.snapshots: https://maven.aksw.org/archiva/repository/snapshots/net/sansa-stack/sansa-rdf-parent_2.12/maven-metadata.xml (431 B at 39 kB/s)
[INFO] Uploading to maven.aksw.snapshots: https://maven.aksw.org/archiva/repository/snapshots/net/sansa-stack/sansa-rdf-parent_2.12/0.8.0-RC2-SNAPSHOT/maven-metadata.xml
[INFO] Uploaded to maven.aksw.snapshots: https://maven.aksw.org/archiva/repository/snapshots/net/sansa-stack/sansa-rdf-parent_2.12/0.8.0-RC2-SNAPSHOT/maven-metadata.xml (623 B at 33 kB/s)
[INFO] Uploading to maven.aksw.snapshots: https://maven.aksw.org/archiva/repository/snapshots/net/sansa-stack/sansa-rdf-parent_2.12/maven-metadata.xml
[INFO] Uploaded to maven.aksw.snapshots: https://maven.aksw.org/archiva/repository/snapshots/net/sansa-stack/sansa-rdf-parent_2.12/maven-metadata.xml (431 B at 24 kB/s)
[INFO] 
[INFO] ---------------< net.sansa-stack:sansa-rdf-common_2.12 >----------------
[INFO] Building sansa-rdf-common_2.12 0.8.0-RC2-SNAPSHOT                 [9/15]
[INFO] --------------------------------[ jar ]---------------------------------
[WARNING] net.minidev:json-smart/maven-metadata.xmlfailed to transfer from http://0.0.0.0/ during a previous attempt. This failure was cached in the local repository and resolution will not be reattempted until the update interval of maven-default-http-blocker has elapsed or updates are forced. Original error: Could not transfer metadata net.minidev:json-smart/maven-metadata.xml from/to maven-default-http-blocker (http://0.0.0.0/): transfer failed for http://0.0.0.0/net/minidev/json-smart/maven-metadata.xml
[WARNING] net.minidev:json-smart/maven-metadata.xmlfailed to transfer from http://0.0.0.0/ during a previous attempt. This failure was cached in the local repository and resolution will not be reattempted until the update interval of maven-default-http-blocker has elapsed or updates are forced. Original error: Could not transfer metadata net.minidev:json-smart/maven-metadata.xml from/to maven-default-http-blocker (http://0.0.0.0/): transfer failed for http://0.0.0.0/net/minidev/json-smart/maven-metadata.xml
[INFO] Downloading from apache-snapshot: https://repository.apache.org/content/repositories/snapshots/org/aksw/sparqlify/sparqlify-core/0.9.1-SNAPSHOT/maven-metadata.xml
[INFO] Downloading from maven.aksw.snapshots: https://maven.aksw.org/archiva/repository/snapshots/org/aksw/sparqlify/sparqlify-core/0.9.1-SNAPSHOT/maven-metadata.xml
[INFO] Downloaded from maven.aksw.snapshots: https://maven.aksw.org/archiva/repository/snapshots/org/aksw/sparqlify/sparqlify-core/0.9.1-SNAPSHOT/maven-metadata.xml (369 B at 34 kB/s)
[INFO] Downloading from apache-snapshot: https://repository.apache.org/content/repositories/snapshots/org/aksw/sparqlify/sparqlify-parent/0.9.1-SNAPSHOT/maven-metadata.xml
[INFO] Downloading from maven.aksw.snapshots: https://maven.aksw.org/archiva/repository/snapshots/org/aksw/sparqlify/sparqlify-parent/0.9.1-SNAPSHOT/maven-metadata.xml
[INFO] Downloaded from maven.aksw.snapshots: https://maven.aksw.org/archiva/repository/snapshots/org/aksw/sparqlify/sparqlify-parent/0.9.1-SNAPSHOT/maven-metadata.xml (371 B at 41 kB/s)
[INFO] Downloading from apache-snapshot: https://repository.apache.org/content/repositories/snapshots/org/aksw/r2rml/r2rml-jena-plugin/0.9.1-SNAPSHOT/maven-metadata.xml
[INFO] Downloading from maven.aksw.snapshots: https://maven.aksw.org/archiva/repository/snapshots/org/aksw/r2rml/r2rml-jena-plugin/0.9.1-SNAPSHOT/maven-metadata.xml
[INFO] Downloaded from maven.aksw.snapshots: https://maven.aksw.org/archiva/repository/snapshots/org/aksw/r2rml/r2rml-jena-plugin/0.9.1-SNAPSHOT/maven-metadata.xml (369 B at 37 kB/s)
[INFO] Downloading from apache-snapshot: https://repository.apache.org/content/repositories/snapshots/org/aksw/r2rml/r2rml-api-parent/0.9.1-SNAPSHOT/maven-metadata.xml
[INFO] Downloading from maven.aksw.snapshots: https://maven.aksw.org/archiva/repository/snapshots/org/aksw/r2rml/r2rml-api-parent/0.9.1-SNAPSHOT/maven-metadata.xml
[INFO] Downloaded from maven.aksw.snapshots: https://maven.aksw.org/archiva/repository/snapshots/org/aksw/r2rml/r2rml-api-parent/0.9.1-SNAPSHOT/maven-metadata.xml (368 B at 33 kB/s)
[INFO] Downloading from apache-snapshot: https://repository.apache.org/content/repositories/snapshots/org/aksw/r2rml/r2rml-jena-arq/0.9.1-SNAPSHOT/maven-metadata.xml
[INFO] Downloading from maven.aksw.snapshots: https://maven.aksw.org/archiva/repository/snapshots/org/aksw/r2rml/r2rml-jena-arq/0.9.1-SNAPSHOT/maven-metadata.xml
[INFO] Downloaded from maven.aksw.snapshots: https://maven.aksw.org/archiva/repository/snapshots/org/aksw/r2rml/r2rml-jena-arq/0.9.1-SNAPSHOT/maven-metadata.xml (366 B at 37 kB/s)
[INFO] Downloading from apache-snapshot: https://repository.apache.org/content/repositories/snapshots/org/aksw/commons/aksw-commons-entity-codecs-sql/0.9.1-SNAPSHOT/maven-metadata.xml
[INFO] Downloading from maven.aksw.snapshots: https://maven.aksw.org/archiva/repository/snapshots/org/aksw/commons/aksw-commons-entity-codecs-sql/0.9.1-SNAPSHOT/maven-metadata.xml
[INFO] Downloaded from maven.aksw.snapshots: https://maven.aksw.org/archiva/repository/snapshots/org/aksw/commons/aksw-commons-entity-codecs-sql/0.9.1-SNAPSHOT/maven-metadata.xml (384 B at 38 kB/s)
[INFO] Downloading from apache-snapshot: https://repository.apache.org/content/repositories/snapshots/org/aksw/commons/aksw-commons-entity-codecs-parent/0.9.1-SNAPSHOT/maven-metadata.xml
[INFO] Downloading from maven.aksw.snapshots: https://maven.aksw.org/archiva/repository/snapshots/org/aksw/commons/aksw-commons-entity-codecs-parent/0.9.1-SNAPSHOT/maven-metadata.xml
[INFO] Downloaded from maven.aksw.snapshots: https://maven.aksw.org/archiva/repository/snapshots/org/aksw/commons/aksw-commons-entity-codecs-parent/0.9.1-SNAPSHOT/maven-metadata.xml (387 B at 35 kB/s)
[INFO] Downloading from apache-snapshot: https://repository.apache.org/content/repositories/snapshots/org/aksw/commons/aksw-commons-entity-codecs-core/0.9.1-SNAPSHOT/maven-metadata.xml
[INFO] Downloading from maven.aksw.snapshots: https://maven.aksw.org/archiva/repository/snapshots/org/aksw/commons/aksw-commons-entity-codecs-core/0.9.1-SNAPSHOT/maven-metadata.xml
[INFO] Downloaded from maven.aksw.snapshots: https://maven.aksw.org/archiva/repository/snapshots/org/aksw/commons/aksw-commons-entity-codecs-core/0.9.1-SNAPSHOT/maven-metadata.xml (385 B at 43 kB/s)
[INFO] Downloading from apache-snapshot: https://repository.apache.org/content/repositories/snapshots/org/aksw/r2rml/r2rml-jena-api/0.9.1-SNAPSHOT/maven-metadata.xml
[INFO] Downloading from maven.aksw.snapshots: https://maven.aksw.org/archiva/repository/snapshots/org/aksw/r2rml/r2rml-jena-api/0.9.1-SNAPSHOT/maven-metadata.xml
[INFO] Downloaded from maven.aksw.snapshots: https://maven.aksw.org/archiva/repository/snapshots/org/aksw/r2rml/r2rml-jena-api/0.9.1-SNAPSHOT/maven-metadata.xml (366 B at 37 kB/s)
[INFO] Downloading from apache-snapshot: https://repository.apache.org/content/repositories/snapshots/org/aksw/r2rml/r2rml-jena-vocab/0.9.1-SNAPSHOT/maven-metadata.xml
[INFO] Downloading from maven.aksw.snapshots: https://maven.aksw.org/archiva/repository/snapshots/org/aksw/r2rml/r2rml-jena-vocab/0.9.1-SNAPSHOT/maven-metadata.xml
[INFO] Downloaded from maven.aksw.snapshots: https://maven.aksw.org/archiva/repository/snapshots/org/aksw/r2rml/r2rml-jena-vocab/0.9.1-SNAPSHOT/maven-metadata.xml (368 B at 26 kB/s)
[INFO] Downloading from apache-snapshot: https://repository.apache.org/content/repositories/snapshots/org/aksw/r2rml/r2rml-common-vocab/0.9.1-SNAPSHOT/maven-metadata.xml
[INFO] Downloading from maven.aksw.snapshots: https://maven.aksw.org/archiva/repository/snapshots/org/aksw/r2rml/r2rml-common-vocab/0.9.1-SNAPSHOT/maven-metadata.xml
[INFO] Downloaded from maven.aksw.snapshots: https://maven.aksw.org/archiva/repository/snapshots/org/aksw/r2rml/r2rml-common-vocab/0.9.1-SNAPSHOT/maven-metadata.xml (370 B at 37 kB/s)
[INFO] Downloading from apache-snapshot: https://repository.apache.org/content/repositories/snapshots/org/aksw/jenax/jenax-arq-langtag-validator/4.3.1-1-SNAPSHOT/maven-metadata.xml
[INFO] Downloading from maven.aksw.snapshots: https://maven.aksw.org/archiva/repository/snapshots/org/aksw/jenax/jenax-arq-langtag-validator/4.3.1-1-SNAPSHOT/maven-metadata.xml
[INFO] Downloaded from maven.aksw.snapshots: https://maven.aksw.org/archiva/repository/snapshots/org/aksw/jenax/jenax-arq-langtag-validator/4.3.1-1-SNAPSHOT/maven-metadata.xml (380 B at 38 kB/s)
[INFO] Downloading from apache-snapshot: https://repository.apache.org/content/repositories/snapshots/org/aksw/jenax/jenax-arq-parent/4.3.1-1-SNAPSHOT/maven-metadata.xml
[INFO] Downloading from maven.aksw.snapshots: https://maven.aksw.org/archiva/repository/snapshots/org/aksw/jenax/jenax-arq-parent/4.3.1-1-SNAPSHOT/maven-metadata.xml
[INFO] Downloaded from maven.aksw.snapshots: https://maven.aksw.org/archiva/repository/snapshots/org/aksw/jenax/jenax-arq-parent/4.3.1-1-SNAPSHOT/maven-metadata.xml (369 B at 34 kB/s)
[INFO] Downloading from apache-snapshot: https://repository.apache.org/content/repositories/snapshots/org/aksw/jenax/jenax-parent/4.3.1-1-SNAPSHOT/maven-metadata.xml
[INFO] Downloading from maven.aksw.snapshots: https://maven.aksw.org/archiva/repository/snapshots/org/aksw/jenax/jenax-parent/4.3.1-1-SNAPSHOT/maven-metadata.xml
[INFO] Downloaded from maven.aksw.snapshots: https://maven.aksw.org/archiva/repository/snapshots/org/aksw/jenax/jenax-parent/4.3.1-1-SNAPSHOT/maven-metadata.xml (365 B at 28 kB/s)
[INFO] Downloading from apache-snapshot: https://repository.apache.org/content/repositories/snapshots/org/aksw/r2rml/r2rml-resource-ontology/0.9.1-SNAPSHOT/maven-metadata.xml
[INFO] Downloading from maven.aksw.snapshots: https://maven.aksw.org/archiva/repository/snapshots/org/aksw/r2rml/r2rml-resource-ontology/0.9.1-SNAPSHOT/maven-metadata.xml
[INFO] Downloaded from maven.aksw.snapshots: https://maven.aksw.org/archiva/repository/snapshots/org/aksw/r2rml/r2rml-resource-ontology/0.9.1-SNAPSHOT/maven-metadata.xml (375 B at 38 kB/s)
[INFO] Downloading from apache-snapshot: https://repository.apache.org/content/repositories/snapshots/org/aksw/r2rml/r2rml-resource-shacl/0.9.1-SNAPSHOT/maven-metadata.xml
[INFO] Downloading from maven.aksw.snapshots: https://maven.aksw.org/archiva/repository/snapshots/org/aksw/r2rml/r2rml-resource-shacl/0.9.1-SNAPSHOT/maven-metadata.xml
[INFO] Downloaded from maven.aksw.snapshots: https://maven.aksw.org/archiva/repository/snapshots/org/aksw/r2rml/r2rml-resource-shacl/0.9.1-SNAPSHOT/maven-metadata.xml (372 B at 41 kB/s)
[INFO] Downloading from apache-snapshot: https://repository.apache.org/content/repositories/snapshots/org/aksw/r2rml/r2rmlx-jena-api/0.9.1-SNAPSHOT/maven-metadata.xml
[INFO] Downloading from maven.aksw.snapshots: https://maven.aksw.org/archiva/repository/snapshots/org/aksw/r2rml/r2rmlx-jena-api/0.9.1-SNAPSHOT/maven-metadata.xml
[INFO] Downloaded from maven.aksw.snapshots: https://maven.aksw.org/archiva/repository/snapshots/org/aksw/r2rml/r2rmlx-jena-api/0.9.1-SNAPSHOT/maven-metadata.xml (367 B at 37 kB/s)
[INFO] Downloading from apache-snapshot: https://repository.apache.org/content/repositories/snapshots/org/aksw/r2rml/r2rml-jena-sql-transforms/0.9.1-SNAPSHOT/maven-metadata.xml
[INFO] Downloading from maven.aksw.snapshots: https://maven.aksw.org/archiva/repository/snapshots/org/aksw/r2rml/r2rml-jena-sql-transforms/0.9.1-SNAPSHOT/maven-metadata.xml
[INFO] Downloaded from maven.aksw.snapshots: https://maven.aksw.org/archiva/repository/snapshots/org/aksw/r2rml/r2rml-jena-sql-transforms/0.9.1-SNAPSHOT/maven-metadata.xml (377 B at 38 kB/s)
[INFO] Downloading from apache-snapshot: https://repository.apache.org/content/repositories/snapshots/org/aksw/jenax/jenax-rx-dataaccess/4.3.2-1-SNAPSHOT/maven-metadata.xml
[INFO] Downloading from maven.aksw.snapshots: https://maven.aksw.org/archiva/repository/snapshots/org/aksw/jenax/jenax-rx-dataaccess/4.3.2-1-SNAPSHOT/maven-metadata.xml
[INFO] Downloaded from maven.aksw.snapshots: https://maven.aksw.org/archiva/repository/snapshots/org/aksw/jenax/jenax-rx-dataaccess/4.3.2-1-SNAPSHOT/maven-metadata.xml (373 B at 41 kB/s)
[INFO] Downloading from apache-snapshot: https://repository.apache.org/content/repositories/snapshots/org/aksw/jenax/jenax-rx-parent/4.3.2-1-SNAPSHOT/maven-metadata.xml
[INFO] Downloading from maven.aksw.snapshots: https://maven.aksw.org/archiva/repository/snapshots/org/aksw/jenax/jenax-rx-parent/4.3.2-1-SNAPSHOT/maven-metadata.xml
[INFO] Downloaded from maven.aksw.snapshots: https://maven.aksw.org/archiva/repository/snapshots/org/aksw/jenax/jenax-rx-parent/4.3.2-1-SNAPSHOT/maven-metadata.xml (369 B at 26 kB/s)
[INFO] Downloading from apache-snapshot: https://repository.apache.org/content/repositories/snapshots/org/aksw/jenax/jenax-analytics-core/4.3.2-1-SNAPSHOT/maven-metadata.xml
[INFO] Downloading from apache-repo-snapshots: https://repository.apache.org/content/repositories/snapshots/org/aksw/jenax/jenax-analytics-core/4.3.2-1-SNAPSHOT/maven-metadata.xml
[INFO] Downloading from maven.aksw.snapshots: https://maven.aksw.org/archiva/repository/snapshots/org/aksw/jenax/jenax-analytics-core/4.3.2-1-SNAPSHOT/maven-metadata.xml
[INFO] Downloaded from maven.aksw.snapshots: https://maven.aksw.org/archiva/repository/snapshots/org/aksw/jenax/jenax-analytics-core/4.3.2-1-SNAPSHOT/maven-metadata.xml (374 B at 42 kB/s)
[INFO] Downloading from maven.aksw.snapshots: https://maven.aksw.org/archiva/repository/snapshots/org/aksw/jenax/jenax-analytics-parent/4.3.2-1-SNAPSHOT/maven-metadata.xml
[INFO] Downloading from apache-snapshot: https://repository.apache.org/content/repositories/snapshots/org/aksw/jenax/jenax-analytics-parent/4.3.2-1-SNAPSHOT/maven-metadata.xml
[INFO] Downloading from apache-repo-snapshots: https://repository.apache.org/content/repositories/snapshots/org/aksw/jenax/jenax-analytics-parent/4.3.2-1-SNAPSHOT/maven-metadata.xml
[INFO] Downloaded from maven.aksw.snapshots: https://maven.aksw.org/archiva/repository/snapshots/org/aksw/jenax/jenax-analytics-parent/4.3.2-1-SNAPSHOT/maven-metadata.xml (376 B at 38 kB/s)
[INFO] Downloading from apache-snapshot: https://repository.apache.org/content/repositories/snapshots/org/aksw/jenax/jenax-arq-entityquery/4.3.2-1-SNAPSHOT/maven-metadata.xml
[INFO] Downloading from maven.aksw.snapshots: https://maven.aksw.org/archiva/repository/snapshots/org/aksw/jenax/jenax-arq-entityquery/4.3.2-1-SNAPSHOT/maven-metadata.xml
[INFO] Downloading from apache-repo-snapshots: https://repository.apache.org/content/repositories/snapshots/org/aksw/jenax/jenax-arq-entityquery/4.3.2-1-SNAPSHOT/maven-metadata.xml
[INFO] Downloaded from maven.aksw.snapshots: https://maven.aksw.org/archiva/repository/snapshots/org/aksw/jenax/jenax-arq-entityquery/4.3.2-1-SNAPSHOT/maven-metadata.xml (375 B at 42 kB/s)
[INFO] Downloading from apache-snapshot: https://repository.apache.org/content/repositories/snapshots/org/aksw/jenax/jenax-arq-algebra/4.3.2-1-SNAPSHOT/maven-metadata.xml
[INFO] Downloading from maven.aksw.snapshots: https://maven.aksw.org/archiva/repository/snapshots/org/aksw/jenax/jenax-arq-algebra/4.3.2-1-SNAPSHOT/maven-metadata.xml
[INFO] Downloaded from maven.aksw.snapshots: https://maven.aksw.org/archiva/repository/snapshots/org/aksw/jenax/jenax-arq-algebra/4.3.2-1-SNAPSHOT/maven-metadata.xml (371 B at 46 kB/s)
[INFO] Downloading from apache-snapshot: https://repository.apache.org/content/repositories/snapshots/org/aksw/commons/subgraph-isomorphism-index-jena/1.5.1-1-SNAPSHOT/maven-metadata.xml
[INFO] Downloading from maven.aksw.snapshots: https://maven.aksw.org/archiva/repository/snapshots/org/aksw/commons/subgraph-isomorphism-index-jena/1.5.1-1-SNAPSHOT/maven-metadata.xml
[INFO] Downloading from apache-repo-snapshots: https://repository.apache.org/content/repositories/snapshots/org/aksw/commons/subgraph-isomorphism-index-jena/1.5.1-1-SNAPSHOT/maven-metadata.xml
[INFO] Downloaded from maven.aksw.snapshots: https://maven.aksw.org/archiva/repository/snapshots/org/aksw/commons/subgraph-isomorphism-index-jena/1.5.1-1-SNAPSHOT/maven-metadata.xml (386 B at 43 kB/s)
[INFO] Downloading from apache-snapshot: https://repository.apache.org/content/repositories/snapshots/org/aksw/commons/subgraph-isomorphism-index-parent/1.5.1-1-SNAPSHOT/maven-metadata.xml
[INFO] Downloading from maven.aksw.snapshots: https://maven.aksw.org/archiva/repository/snapshots/org/aksw/commons/subgraph-isomorphism-index-parent/1.5.1-1-SNAPSHOT/maven-metadata.xml
[INFO] Downloading from apache-repo-snapshots: https://repository.apache.org/content/repositories/snapshots/org/aksw/commons/subgraph-isomorphism-index-parent/1.5.1-1-SNAPSHOT/maven-metadata.xml
[INFO] Downloaded from maven.aksw.snapshots: https://maven.aksw.org/archiva/repository/snapshots/org/aksw/commons/subgraph-isomorphism-index-parent/1.5.1-1-SNAPSHOT/maven-metadata.xml (388 B at 43 kB/s)
[INFO] Downloading from apache-snapshot: https://repository.apache.org/content/repositories/snapshots/org/aksw/commons/jena-jgrapht-bindings/1.5.1-1-SNAPSHOT/maven-metadata.xml
[INFO] Downloading from maven.aksw.snapshots: https://maven.aksw.org/archiva/repository/snapshots/org/aksw/commons/jena-jgrapht-bindings/1.5.1-1-SNAPSHOT/maven-metadata.xml
[INFO] Downloading from apache-repo-snapshots: https://repository.apache.org/content/repositories/snapshots/org/aksw/commons/jena-jgrapht-bindings/1.5.1-1-SNAPSHOT/maven-metadata.xml
[INFO] Downloaded from maven.aksw.snapshots: https://maven.aksw.org/archiva/repository/snapshots/org/aksw/commons/jena-jgrapht-bindings/1.5.1-1-SNAPSHOT/maven-metadata.xml (376 B at 47 kB/s)
[INFO] Downloading from apache-snapshot: https://repository.apache.org/content/repositories/snapshots/org/aksw/commons/subgraph-isomorphism-index-jgrapht/1.5.1-1-SNAPSHOT/maven-metadata.xml
[INFO] Downloading from maven.aksw.snapshots: https://maven.aksw.org/archiva/repository/snapshots/org/aksw/commons/subgraph-isomorphism-index-jgrapht/1.5.1-1-SNAPSHOT/maven-metadata.xml
[INFO] Downloading from apache-repo-snapshots: https://repository.apache.org/content/repositories/snapshots/org/aksw/commons/subgraph-isomorphism-index-jgrapht/1.5.1-1-SNAPSHOT/maven-metadata.xml
[INFO] Downloaded from maven.aksw.snapshots: https://maven.aksw.org/archiva/repository/snapshots/org/aksw/commons/subgraph-isomorphism-index-jgrapht/1.5.1-1-SNAPSHOT/maven-metadata.xml (389 B at 39 kB/s)
[INFO] Downloading from apache-snapshot: https://repository.apache.org/content/repositories/snapshots/org/aksw/commons/subgraph-isomorphism-index-core/1.5.1-1-SNAPSHOT/maven-metadata.xml
[INFO] Downloading from maven.aksw.snapshots: https://maven.aksw.org/archiva/repository/snapshots/org/aksw/commons/subgraph-isomorphism-index-core/1.5.1-1-SNAPSHOT/maven-metadata.xml
[INFO] Downloading from apache-repo-snapshots: https://repository.apache.org/content/repositories/snapshots/org/aksw/commons/subgraph-isomorphism-index-core/1.5.1-1-SNAPSHOT/maven-metadata.xml
[INFO] Downloaded from maven.aksw.snapshots: https://maven.aksw.org/archiva/repository/snapshots/org/aksw/commons/subgraph-isomorphism-index-core/1.5.1-1-SNAPSHOT/maven-metadata.xml (386 B at 43 kB/s)
[INFO] Downloading from apache-snapshot: https://repository.apache.org/content/repositories/snapshots/org/aksw/commons/tagmap-core/1.0.5-SNAPSHOT/maven-metadata.xml
[INFO] Downloading from maven.aksw.snapshots: https://maven.aksw.org/archiva/repository/snapshots/org/aksw/commons/tagmap-core/1.0.5-SNAPSHOT/maven-metadata.xml
[INFO] Downloading from apache-repo-snapshots: https://repository.apache.org/content/repositories/snapshots/org/aksw/commons/tagmap-core/1.0.5-SNAPSHOT/maven-metadata.xml
[INFO] Downloaded from maven.aksw.snapshots: https://maven.aksw.org/archiva/repository/snapshots/org/aksw/commons/tagmap-core/1.0.5-SNAPSHOT/maven-metadata.xml (364 B at 40 kB/s)
[INFO] Downloading from apache-snapshot: https://repository.apache.org/content/repositories/snapshots/org/aksw/commons/tagmap-parent/1.0.5-SNAPSHOT/maven-metadata.xml
[INFO] Downloading from maven.aksw.snapshots: https://maven.aksw.org/archiva/repository/snapshots/org/aksw/commons/tagmap-parent/1.0.5-SNAPSHOT/maven-metadata.xml
[INFO] Downloading from apache-repo-snapshots: https://repository.apache.org/content/repositories/snapshots/org/aksw/commons/tagmap-parent/1.0.5-SNAPSHOT/maven-metadata.xml
[INFO] Downloaded from maven.aksw.snapshots: https://maven.aksw.org/archiva/repository/snapshots/org/aksw/commons/tagmap-parent/1.0.5-SNAPSHOT/maven-metadata.xml (366 B at 28 kB/s)
[INFO] Downloading from apache-snapshot: https://repository.apache.org/content/repositories/snapshots/org/aksw/jenax/jenax-arq-propertypaths/4.3.2-1-SNAPSHOT/maven-metadata.xml
[INFO] Downloading from maven.aksw.snapshots: https://maven.aksw.org/archiva/repository/snapshots/org/aksw/jenax/jenax-arq-propertypaths/4.3.2-1-SNAPSHOT/maven-metadata.xml
[INFO] Downloading from apache-repo-snapshots: https://repository.apache.org/content/repositories/snapshots/org/aksw/jenax/jenax-arq-propertypaths/4.3.2-1-SNAPSHOT/maven-metadata.xml
[INFO] Downloaded from maven.aksw.snapshots: https://maven.aksw.org/archiva/repository/snapshots/org/aksw/jenax/jenax-arq-propertypaths/4.3.2-1-SNAPSHOT/maven-metadata.xml (377 B at 42 kB/s)
[INFO] Downloading from apache-snapshot: https://repository.apache.org/content/repositories/snapshots/org/aksw/jenax/jenax-arq-udf/4.3.2-1-SNAPSHOT/maven-metadata.xml
[INFO] Downloading from maven.aksw.snapshots: https://maven.aksw.org/archiva/repository/snapshots/org/aksw/jenax/jenax-arq-udf/4.3.2-1-SNAPSHOT/maven-metadata.xml
[INFO] Downloading from apache-repo-snapshots: https://repository.apache.org/content/repositories/snapshots/org/aksw/jenax/jenax-arq-udf/4.3.2-1-SNAPSHOT/maven-metadata.xml
[INFO] Downloaded from maven.aksw.snapshots: https://maven.aksw.org/archiva/repository/snapshots/org/aksw/jenax/jenax-arq-udf/4.3.2-1-SNAPSHOT/maven-metadata.xml (367 B at 24 kB/s)
[INFO] Downloading from apache-snapshot: https://repository.apache.org/content/repositories/snapshots/org/aksw/jenax/jenax-arq-views/4.3.0-1-SNAPSHOT/maven-metadata.xml
[INFO] Downloading from maven.aksw.snapshots: https://maven.aksw.org/archiva/repository/snapshots/org/aksw/jenax/jenax-arq-views/4.3.0-1-SNAPSHOT/maven-metadata.xml
[INFO] Downloaded from maven.aksw.snapshots: https://maven.aksw.org/archiva/repository/snapshots/org/aksw/jenax/jenax-arq-views/4.3.0-1-SNAPSHOT/maven-metadata.xml (369 B at 41 kB/s)
[INFO] Downloading from apache-snapshot: https://repository.apache.org/content/repositories/snapshots/org/aksw/jenax/jenax-arq-parent/4.3.0-1-SNAPSHOT/maven-metadata.xml
[INFO] Downloading from maven.aksw.snapshots: https://maven.aksw.org/archiva/repository/snapshots/org/aksw/jenax/jenax-arq-parent/4.3.0-1-SNAPSHOT/maven-metadata.xml
[INFO] Downloaded from maven.aksw.snapshots: https://maven.aksw.org/archiva/repository/snapshots/org/aksw/jenax/jenax-arq-parent/4.3.0-1-SNAPSHOT/maven-metadata.xml (370 B at 19 kB/s)
[INFO] Downloading from apache-snapshot: https://repository.apache.org/content/repositories/snapshots/org/aksw/jenax/jenax-parent/4.3.0-1-SNAPSHOT/maven-metadata.xml
[INFO] Downloading from maven.aksw.snapshots: https://maven.aksw.org/archiva/repository/snapshots/org/aksw/jenax/jenax-parent/4.3.0-1-SNAPSHOT/maven-metadata.xml
[INFO] Downloaded from maven.aksw.snapshots: https://maven.aksw.org/archiva/repository/snapshots/org/aksw/jenax/jenax-parent/4.3.0-1-SNAPSHOT/maven-metadata.xml (366 B at 23 kB/s)
[INFO] Downloading from apache-snapshot: https://repository.apache.org/content/repositories/snapshots/org/aksw/sparqlify/obda-api-bundle/0.9.1-SNAPSHOT/maven-metadata.xml
[INFO] Downloading from maven.aksw.snapshots: https://maven.aksw.org/archiva/repository/snapshots/org/aksw/sparqlify/obda-api-bundle/0.9.1-SNAPSHOT/maven-metadata.xml
[INFO] Downloaded from maven.aksw.snapshots: https://maven.aksw.org/archiva/repository/snapshots/org/aksw/sparqlify/obda-api-bundle/0.9.1-SNAPSHOT/maven-metadata.xml (370 B at 41 kB/s)
[INFO] Downloading from apache-snapshot: https://repository.apache.org/content/repositories/snapshots/org/aksw/sparqlify/obda-api-parent/0.9.1-SNAPSHOT/maven-metadata.xml
[INFO] Downloading from maven.aksw.snapshots: https://maven.aksw.org/archiva/repository/snapshots/org/aksw/sparqlify/obda-api-parent/0.9.1-SNAPSHOT/maven-metadata.xml
[INFO] Downloaded from maven.aksw.snapshots: https://maven.aksw.org/archiva/repository/snapshots/org/aksw/sparqlify/obda-api-parent/0.9.1-SNAPSHOT/maven-metadata.xml (370 B at 34 kB/s)
[INFO] Downloading from apache-snapshot: https://repository.apache.org/content/repositories/snapshots/org/aksw/sparqlify/obda-api-r2rml/0.9.1-SNAPSHOT/maven-metadata.xml
[INFO] Downloading from maven.aksw.snapshots: https://maven.aksw.org/archiva/repository/snapshots/org/aksw/sparqlify/obda-api-r2rml/0.9.1-SNAPSHOT/maven-metadata.xml
[INFO] Downloaded from maven.aksw.snapshots: https://maven.aksw.org/archiva/repository/snapshots/org/aksw/sparqlify/obda-api-r2rml/0.9.1-SNAPSHOT/maven-metadata.xml (369 B at 41 kB/s)
[INFO] Downloading from apache-snapshot: https://repository.apache.org/content/repositories/snapshots/org/aksw/sparqlify/obda-api-core/0.9.1-SNAPSHOT/maven-metadata.xml
[INFO] Downloading from maven.aksw.snapshots: https://maven.aksw.org/archiva/repository/snapshots/org/aksw/sparqlify/obda-api-core/0.9.1-SNAPSHOT/maven-metadata.xml
[INFO] Downloaded from maven.aksw.snapshots: https://maven.aksw.org/archiva/repository/snapshots/org/aksw/sparqlify/obda-api-core/0.9.1-SNAPSHOT/maven-metadata.xml (368 B at 33 kB/s)
[INFO] Downloading from apache-snapshot: https://repository.apache.org/content/repositories/snapshots/org/aksw/sparqlify/obda-api-sml/0.9.1-SNAPSHOT/maven-metadata.xml
[INFO] Downloading from maven.aksw.snapshots: https://maven.aksw.org/archiva/repository/snapshots/org/aksw/sparqlify/obda-api-sml/0.9.1-SNAPSHOT/maven-metadata.xml
[INFO] Downloaded from maven.aksw.snapshots: https://maven.aksw.org/archiva/repository/snapshots/org/aksw/sparqlify/obda-api-sml/0.9.1-SNAPSHOT/maven-metadata.xml (367 B at 37 kB/s)
[INFO] Downloading from apache-snapshot: https://repository.apache.org/content/repositories/snapshots/org/aksw/sparqlify/sparqlify-type-system/0.9.1-SNAPSHOT/maven-metadata.xml
[INFO] Downloading from maven.aksw.snapshots: https://maven.aksw.org/archiva/repository/snapshots/org/aksw/sparqlify/sparqlify-type-system/0.9.1-SNAPSHOT/maven-metadata.xml
[INFO] Downloaded from maven.aksw.snapshots: https://maven.aksw.org/archiva/repository/snapshots/org/aksw/sparqlify/sparqlify-type-system/0.9.1-SNAPSHOT/maven-metadata.xml (376 B at 34 kB/s)
[INFO] Downloading from apache-snapshot: https://repository.apache.org/content/repositories/snapshots/org/aksw/commons/aksw-commons-util-xml/0.9.1-SNAPSHOT/maven-metadata.xml
[INFO] Downloading from maven.aksw.snapshots: https://maven.aksw.org/archiva/repository/snapshots/org/aksw/commons/aksw-commons-util-xml/0.9.1-SNAPSHOT/maven-metadata.xml
[INFO] Downloaded from maven.aksw.snapshots: https://maven.aksw.org/archiva/repository/snapshots/org/aksw/commons/aksw-commons-util-xml/0.9.1-SNAPSHOT/maven-metadata.xml (375 B at 38 kB/s)
[INFO] Downloading from apache-snapshot: https://repository.apache.org/content/repositories/snapshots/org/aksw/jenax/jenax-arq-hdt/4.3.2-1-SNAPSHOT/maven-metadata.xml
[INFO] Downloading from maven.aksw.snapshots: https://maven.aksw.org/archiva/repository/snapshots/org/aksw/jenax/jenax-arq-hdt/4.3.2-1-SNAPSHOT/maven-metadata.xml
[INFO] Downloaded from maven.aksw.snapshots: https://maven.aksw.org/archiva/repository/snapshots/org/aksw/jenax/jenax-arq-hdt/4.3.2-1-SNAPSHOT/maven-metadata.xml (367 B at 37 kB/s)
[INFO] 
[INFO] --- maven-clean-plugin:2.5:clean (default-clean) @ sansa-rdf-common_2.12 ---
[INFO] Deleting /usr/share/tomcat8/.jenkins/jobs/SANSA-Stack/branches/develop/workspace@2/sansa-rdf/sansa-rdf-common/target
[INFO] 
[INFO] --- jacoco-maven-plugin:0.8.4:prepare-agent (prepare-agent) @ sansa-rdf-common_2.12 ---
[INFO] argLine set to -javaagent:/usr/share/tomcat8/.m2/repository/org/jacoco/org.jacoco.agent/0.8.4/org.jacoco.agent-0.8.4-runtime.jar=destfile=/usr/share/tomcat8/.jenkins/jobs/SANSA-Stack/branches/develop/workspace@2/sansa-rdf/sansa-rdf-common/target/jacoco.exec
[INFO] 
[INFO] --- maven-resources-plugin:3.0.2:resources (default-resources) @ sansa-rdf-common_2.12 ---
[INFO] Using 'UTF-8' encoding to copy filtered resources.
[INFO] Copying 1 resource
[INFO] 
[INFO] --- scala-maven-plugin:4.5.3:add-source (scala-compile-first) @ sansa-rdf-common_2.12 ---
[INFO] Add Source directory: /usr/share/tomcat8/.jenkins/jobs/SANSA-Stack/branches/develop/workspace@2/sansa-rdf/sansa-rdf-common/src/main/scala
[INFO] Add Test Source directory: /usr/share/tomcat8/.jenkins/jobs/SANSA-Stack/branches/develop/workspace@2/sansa-rdf/sansa-rdf-common/src/test/scala
[INFO] 
[INFO] --- scala-maven-plugin:4.5.3:compile (scala-compile-first) @ sansa-rdf-common_2.12 ---
[WARNING] net.minidev:json-smart/maven-metadata.xmlfailed to transfer from http://0.0.0.0/ during a previous attempt. This failure was cached in the local repository and resolution will not be reattempted until the update interval of maven-default-http-blocker has elapsed or updates are forced. Original error: Could not transfer metadata net.minidev:json-smart/maven-metadata.xml from/to maven-default-http-blocker (http://0.0.0.0/): transfer failed for http://0.0.0.0/net/minidev/json-smart/maven-metadata.xml
[WARNING] net.minidev:json-smart/maven-metadata.xmlfailed to transfer from http://0.0.0.0/ during a previous attempt. This failure was cached in the local repository and resolution will not be reattempted until the update interval of maven-default-http-blocker has elapsed or updates are forced. Original error: Could not transfer metadata net.minidev:json-smart/maven-metadata.xml from/to maven-default-http-blocker (http://0.0.0.0/): transfer failed for http://0.0.0.0/net/minidev/json-smart/maven-metadata.xml
[INFO] Using incremental compilation using Mixed compile order
[INFO] Compiler bridge file: /usr/share/tomcat8/.sbt/1.0/zinc/org.scala-sbt/org.scala-sbt-compiler-bridge_2.12-1.5.5-bin_2.12.11__55.0-1.5.5_20210607T021730.jar
[INFO] compiling 46 Scala sources and 9 Java sources to /usr/share/tomcat8/.jenkins/jobs/SANSA-Stack/branches/develop/workspace@2/sansa-rdf/sansa-rdf-common/target/classes ...
[WARNING] /usr/share/tomcat8/.jenkins/jobs/SANSA-Stack/branches/develop/workspace@2/sansa-rdf/sansa-rdf-common/src/main/scala/net/sansa_stack/rdf/common/partition/r2rml/R2rmlUtils.scala:143: abstract type pattern reflect.runtime.universe.MethodSymbol is unchecked since it is eliminated by erasure
[INFO] /usr/share/tomcat8/.jenkins/jobs/SANSA-Stack/branches/develop/workspace@2/sansa-rdf/sansa-rdf-common/src/main/scala/net/sansa_stack/rdf/common/partition/trash/RdfPartition.scala:1: 
Found names but no class, trait or object is defined in the compilation unit.
The incremental compiler cannot record the dependency information in such case.
Some errors like unused import referring to a non-existent class might not be reported.
    
[INFO] /usr/share/tomcat8/.jenkins/jobs/SANSA-Stack/branches/develop/workspace@2/sansa-rdf/sansa-rdf-common/src/main/scala/net/sansa_stack/rdf/common/partition/trash/RdfPartitionComplex.scala:1: 
Found names but no class, trait or object is defined in the compilation unit.
The incremental compiler cannot record the dependency information in such case.
Some errors like unused import referring to a non-existent class might not be reported.
    
[INFO] /usr/share/tomcat8/.jenkins/jobs/SANSA-Stack/branches/develop/workspace@2/sansa-rdf/sansa-rdf-common/src/main/scala/net/sansa_stack/rdf/common/partition/trash/RdfPartitionFromState.scala:1: 
Found names but no class, trait or object is defined in the compilation unit.
The incremental compiler cannot record the dependency information in such case.
Some errors like unused import referring to a non-existent class might not be reported.
    
[INFO] /usr/share/tomcat8/.jenkins/jobs/SANSA-Stack/branches/develop/workspace@2/sansa-rdf/sansa-rdf-common/src/main/scala/net/sansa_stack/rdf/common/partition/trash/RdfPartitionFromStateImpl.scala:1: 
Found names but no class, trait or object is defined in the compilation unit.
The incremental compiler cannot record the dependency information in such case.
Some errors like unused import referring to a non-existent class might not be reported.
    
[INFO] /usr/share/tomcat8/.jenkins/jobs/SANSA-Stack/branches/develop/workspace@2/sansa-rdf/sansa-rdf-common/src/main/scala/net/sansa_stack/rdf/common/partition/trash/RdfPartition.scala:1: 
Found top level imports but no class, trait or object is defined in the compilation unit.
The incremental compiler cannot record the dependency information in such case.
Some errors like unused import referring to a non-existent class might not be reported.
    
[INFO] /usr/share/tomcat8/.jenkins/jobs/SANSA-Stack/branches/develop/workspace@2/sansa-rdf/sansa-rdf-common/src/main/scala/net/sansa_stack/rdf/common/partition/trash/RdfPartitionComplex.scala:1: 
Found top level imports but no class, trait or object is defined in the compilation unit.
The incremental compiler cannot record the dependency information in such case.
Some errors like unused import referring to a non-existent class might not be reported.
    
[INFO] /usr/share/tomcat8/.jenkins/jobs/SANSA-Stack/branches/develop/workspace@2/sansa-rdf/sansa-rdf-common/src/main/scala/net/sansa_stack/rdf/common/partition/trash/RdfPartitionFromStateImpl.scala:1: 
Found top level imports but no class, trait or object is defined in the compilation unit.
The incremental compiler cannot record the dependency information in such case.
Some errors like unused import referring to a non-existent class might not be reported.
    
[WARNING] /usr/share/tomcat8/.jenkins/jobs/SANSA-Stack/branches/develop/workspace@2/sansa-rdf/sansa-rdf-common/src/main/scala/net/sansa_stack/rdf/common/io/ntriples/NTriplesStringToJenaTriple.scala:23: method createIteratorTriples in class RDFDataMgr is deprecated: see corresponding Javadoc for more information.
[WARNING] two warnings found
[INFO] done compiling
[INFO] compile in 19.2 s
[INFO] 
[INFO] --- maven-compiler-plugin:3.8.1:compile (default-compile) @ sansa-rdf-common_2.12 ---
[INFO] Changes detected - recompiling the module!
[INFO] Compiling 9 source files to /usr/share/tomcat8/.jenkins/jobs/SANSA-Stack/branches/develop/workspace@2/sansa-rdf/sansa-rdf-common/target/classes
[INFO] 
[INFO] --- maven-resources-plugin:3.0.2:testResources (default-testResources) @ sansa-rdf-common_2.12 ---
[INFO] Using 'UTF-8' encoding to copy filtered resources.
[INFO] Copying 8 resources
[INFO] 
[INFO] --- scala-maven-plugin:4.5.3:testCompile (scala-test-compile) @ sansa-rdf-common_2.12 ---
[WARNING] net.minidev:json-smart/maven-metadata.xmlfailed to transfer from http://0.0.0.0/ during a previous attempt. This failure was cached in the local repository and resolution will not be reattempted until the update interval of maven-default-http-blocker has elapsed or updates are forced. Original error: Could not transfer metadata net.minidev:json-smart/maven-metadata.xml from/to maven-default-http-blocker (http://0.0.0.0/): transfer failed for http://0.0.0.0/net/minidev/json-smart/maven-metadata.xml
[WARNING] net.minidev:json-smart/maven-metadata.xmlfailed to transfer from http://0.0.0.0/ during a previous attempt. This failure was cached in the local repository and resolution will not be reattempted until the update interval of maven-default-http-blocker has elapsed or updates are forced. Original error: Could not transfer metadata net.minidev:json-smart/maven-metadata.xml from/to maven-default-http-blocker (http://0.0.0.0/): transfer failed for http://0.0.0.0/net/minidev/json-smart/maven-metadata.xml
[INFO] Using incremental compilation using Mixed compile order
[INFO] Compiler bridge file: /usr/share/tomcat8/.sbt/1.0/zinc/org.scala-sbt/org.scala-sbt-compiler-bridge_2.12-1.5.5-bin_2.12.11__55.0-1.5.5_20210607T021730.jar
[INFO] compiling 10 Scala sources to /usr/share/tomcat8/.jenkins/jobs/SANSA-Stack/branches/develop/workspace@2/sansa-rdf/sansa-rdf-common/target/test-classes ...
[INFO] /usr/share/tomcat8/.jenkins/jobs/SANSA-Stack/branches/develop/workspace@2/sansa-rdf/sansa-rdf-common/src/test/scala/net/sansa_stack/rdf/common/partition/model/sparqlify/SparqlifyUtils2Tests.scala:1: 
Found names but no class, trait or object is defined in the compilation unit.
The incremental compiler cannot record the dependency information in such case.
Some errors like unused import referring to a non-existent class might not be reported.
    
[WARNING] : there were 9 deprecation warnings (since 3.1.0); re-run with -deprecation for details
[WARNING] one warning found
[INFO] done compiling
[INFO] compile in 8.7 s
[INFO] 
[INFO] --- maven-compiler-plugin:3.8.1:testCompile (default-testCompile) @ sansa-rdf-common_2.12 ---
[INFO] Changes detected - recompiling the module!
[INFO] 
[INFO] --- maven-surefire-plugin:2.22.2:test (default-test) @ sansa-rdf-common_2.12 ---
[INFO] Tests are skipped.
[INFO] 
[INFO] --- scalatest-maven-plugin:2.0.2:test (test) @ sansa-rdf-common_2.12 ---
[INFO] Tests are skipped.
[INFO] 
[INFO] --- maven-jar-plugin:3.2.0:jar (default-jar) @ sansa-rdf-common_2.12 ---
[INFO] Building jar: /usr/share/tomcat8/.jenkins/jobs/SANSA-Stack/branches/develop/workspace@2/sansa-rdf/sansa-rdf-common/target/sansa-rdf-common_2.12-0.8.0-RC2-SNAPSHOT.jar
[INFO] 
[INFO] --- maven-javadoc-plugin:3.1.1:jar (attach-javadocs) @ sansa-rdf-common_2.12 ---
[INFO] The goal 'org.apache.maven.plugins:maven-javadoc-plugin:3.1.1:javadoc' has not been previously called for the module: 'net.sansa-stack:sansa-resource-metadata:jar:0.8.0-RC2-SNAPSHOT'. Trying to invoke it...
NOTE: Picked up JDK_JAVA_OPTIONS:  --add-opens=java.base/java.lang=ALL-UNNAMED --add-opens=java.base/java.io=ALL-UNNAMED --add-opens=java.rmi/sun.rmi.transport=ALL-UNNAMED
[WARNING] Creating fake javadoc directory to prevent repeated invocations: /usr/share/tomcat8/.jenkins/jobs/SANSA-Stack/branches/develop/workspace@2/sansa-resource-metadata/target/apidocs
[INFO] The goal 'org.apache.maven.plugins:maven-javadoc-plugin:3.1.1:javadoc' has not been previously called for the module: 'net.sansa-stack:sansa-resource-testdata:jar:0.8.0-RC2-SNAPSHOT'. Trying to invoke it...
NOTE: Picked up JDK_JAVA_OPTIONS:  --add-opens=java.base/java.lang=ALL-UNNAMED --add-opens=java.base/java.io=ALL-UNNAMED --add-opens=java.rmi/sun.rmi.transport=ALL-UNNAMED
[WARNING] Creating fake javadoc directory to prevent repeated invocations: /usr/share/tomcat8/.jenkins/jobs/SANSA-Stack/branches/develop/workspace@2/sansa-resource-testdata/target/apidocs
[ERROR] Error fetching link: /usr/share/tomcat8/.jenkins/jobs/SANSA-Stack/branches/develop/workspace@2/sansa-test-resources/target/apidocs. Ignored it.
[ERROR] Error fetching link: /usr/share/tomcat8/.jenkins/jobs/SANSA-Stack/branches/develop/workspace@2/sansa-resource-metadata/target/apidocs. Ignored it.
[ERROR] Error fetching link: /usr/share/tomcat8/.jenkins/jobs/SANSA-Stack/branches/develop/workspace@2/sansa-resource-testdata/target/apidocs. Ignored it.
[WARNING] Unable to derive module descriptor for /usr/share/tomcat8/.jenkins/jobs/SANSA-Stack/branches/develop/workspace@2/sansa-rdf/sansa-rdf-common/target/sansa-rdf-common_2.12-0.8.0-RC2-SNAPSHOT.jar
[INFO] 
Loading source files for package org.apache.jena.system...
Loading source files for package net.sansa_stack.rdf.benchmark.io...
Loading source files for package net.sansa_stack.rdf.common.annotation...
Loading source files for package net.sansa_stack.rdf.common.io.riot.tokens...
Loading source files for package net.sansa_stack.rdf.common.io.riot.lang...
Constructing Javadoc information...
Standard Doclet version 11.0.13
Building tree for all the packages and classes...
Generating /usr/share/tomcat8/.jenkins/jobs/SANSA-Stack/branches/develop/workspace@2/sansa-rdf/sansa-rdf-common/target/apidocs/net/sansa_stack/rdf/benchmark/io/ReadableByteChannelFromIterator.html...
Generating /usr/share/tomcat8/.jenkins/jobs/SANSA-Stack/branches/develop/workspace@2/sansa-rdf/sansa-rdf-common/target/apidocs/net/sansa_stack/rdf/common/annotation/AlphaComponent.html...
Generating /usr/share/tomcat8/.jenkins/jobs/SANSA-Stack/branches/develop/workspace@2/sansa-rdf/sansa-rdf-common/target/apidocs/net/sansa_stack/rdf/common/annotation/DeveloperApi.html...
Generating /usr/share/tomcat8/.jenkins/jobs/SANSA-Stack/branches/develop/workspace@2/sansa-rdf/sansa-rdf-common/target/apidocs/net/sansa_stack/rdf/common/annotation/Experimental.html...
Generating /usr/share/tomcat8/.jenkins/jobs/SANSA-Stack/branches/develop/workspace@2/sansa-rdf/sansa-rdf-common/target/apidocs/net/sansa_stack/rdf/common/io/riot/lang/LangNQuadsSkipBad.html...
Generating /usr/share/tomcat8/.jenkins/jobs/SANSA-Stack/branches/develop/workspace@2/sansa-rdf/sansa-rdf-common/target/apidocs/net/sansa_stack/rdf/common/io/riot/lang/LangNTriplesSkipBad.html...
Generating /usr/share/tomcat8/.jenkins/jobs/SANSA-Stack/branches/develop/workspace@2/sansa-rdf/sansa-rdf-common/target/apidocs/net/sansa_stack/rdf/common/io/riot/tokens/TokenizerTextForgiving.html...
Generating /usr/share/tomcat8/.jenkins/jobs/SANSA-Stack/branches/develop/workspace@2/sansa-rdf/sansa-rdf-common/target/apidocs/net/sansa_stack/rdf/common/io/riot/tokens/TokenizerTextForgiving.ErrorHandlerTokenizer.html...
Generating /usr/share/tomcat8/.jenkins/jobs/SANSA-Stack/branches/develop/workspace@2/sansa-rdf/sansa-rdf-common/target/apidocs/org/apache/jena/system/JenaSystem.html...
Generating /usr/share/tomcat8/.jenkins/jobs/SANSA-Stack/branches/develop/workspace@2/sansa-rdf/sansa-rdf-common/target/apidocs/net/sansa_stack/rdf/benchmark/io/package-summary.html...
Generating /usr/share/tomcat8/.jenkins/jobs/SANSA-Stack/branches/develop/workspace@2/sansa-rdf/sansa-rdf-common/target/apidocs/net/sansa_stack/rdf/benchmark/io/package-tree.html...
Generating /usr/share/tomcat8/.jenkins/jobs/SANSA-Stack/branches/develop/workspace@2/sansa-rdf/sansa-rdf-common/target/apidocs/net/sansa_stack/rdf/common/annotation/package-summary.html...
Generating /usr/share/tomcat8/.jenkins/jobs/SANSA-Stack/branches/develop/workspace@2/sansa-rdf/sansa-rdf-common/target/apidocs/net/sansa_stack/rdf/common/annotation/package-tree.html...
Generating /usr/share/tomcat8/.jenkins/jobs/SANSA-Stack/branches/develop/workspace@2/sansa-rdf/sansa-rdf-common/target/apidocs/net/sansa_stack/rdf/common/io/riot/lang/package-summary.html...
Generating /usr/share/tomcat8/.jenkins/jobs/SANSA-Stack/branches/develop/workspace@2/sansa-rdf/sansa-rdf-common/target/apidocs/net/sansa_stack/rdf/common/io/riot/lang/package-tree.html...
Generating /usr/share/tomcat8/.jenkins/jobs/SANSA-Stack/branches/develop/workspace@2/sansa-rdf/sansa-rdf-common/target/apidocs/net/sansa_stack/rdf/common/io/riot/tokens/package-summary.html...
Generating /usr/share/tomcat8/.jenkins/jobs/SANSA-Stack/branches/develop/workspace@2/sansa-rdf/sansa-rdf-common/target/apidocs/net/sansa_stack/rdf/common/io/riot/tokens/package-tree.html...
Generating /usr/share/tomcat8/.jenkins/jobs/SANSA-Stack/branches/develop/workspace@2/sansa-rdf/sansa-rdf-common/target/apidocs/org/apache/jena/system/package-summary.html...
Generating /usr/share/tomcat8/.jenkins/jobs/SANSA-Stack/branches/develop/workspace@2/sansa-rdf/sansa-rdf-common/target/apidocs/org/apache/jena/system/package-tree.html...
Generating /usr/share/tomcat8/.jenkins/jobs/SANSA-Stack/branches/develop/workspace@2/sansa-rdf/sansa-rdf-common/target/apidocs/constant-values.html...
Generating /usr/share/tomcat8/.jenkins/jobs/SANSA-Stack/branches/develop/workspace@2/sansa-rdf/sansa-rdf-common/target/apidocs/org/apache/jena/system/class-use/JenaSystem.html...
Generating /usr/share/tomcat8/.jenkins/jobs/SANSA-Stack/branches/develop/workspace@2/sansa-rdf/sansa-rdf-common/target/apidocs/net/sansa_stack/rdf/benchmark/io/class-use/ReadableByteChannelFromIterator.html...
Generating /usr/share/tomcat8/.jenkins/jobs/SANSA-Stack/branches/develop/workspace@2/sansa-rdf/sansa-rdf-common/target/apidocs/net/sansa_stack/rdf/common/annotation/class-use/AlphaComponent.html...
Generating /usr/share/tomcat8/.jenkins/jobs/SANSA-Stack/branches/develop/workspace@2/sansa-rdf/sansa-rdf-common/target/apidocs/net/sansa_stack/rdf/common/annotation/class-use/Experimental.html...
Generating /usr/share/tomcat8/.jenkins/jobs/SANSA-Stack/branches/develop/workspace@2/sansa-rdf/sansa-rdf-common/target/apidocs/net/sansa_stack/rdf/common/annotation/class-use/DeveloperApi.html...
Generating /usr/share/tomcat8/.jenkins/jobs/SANSA-Stack/branches/develop/workspace@2/sansa-rdf/sansa-rdf-common/target/apidocs/net/sansa_stack/rdf/common/io/riot/tokens/class-use/TokenizerTextForgiving.html...
Generating /usr/share/tomcat8/.jenkins/jobs/SANSA-Stack/branches/develop/workspace@2/sansa-rdf/sansa-rdf-common/target/apidocs/net/sansa_stack/rdf/common/io/riot/tokens/class-use/TokenizerTextForgiving.ErrorHandlerTokenizer.html...
Generating /usr/share/tomcat8/.jenkins/jobs/SANSA-Stack/branches/develop/workspace@2/sansa-rdf/sansa-rdf-common/target/apidocs/net/sansa_stack/rdf/common/io/riot/lang/class-use/LangNQuadsSkipBad.html...
Generating /usr/share/tomcat8/.jenkins/jobs/SANSA-Stack/branches/develop/workspace@2/sansa-rdf/sansa-rdf-common/target/apidocs/net/sansa_stack/rdf/common/io/riot/lang/class-use/LangNTriplesSkipBad.html...
Generating /usr/share/tomcat8/.jenkins/jobs/SANSA-Stack/branches/develop/workspace@2/sansa-rdf/sansa-rdf-common/target/apidocs/net/sansa_stack/rdf/benchmark/io/package-use.html...
Generating /usr/share/tomcat8/.jenkins/jobs/SANSA-Stack/branches/develop/workspace@2/sansa-rdf/sansa-rdf-common/target/apidocs/net/sansa_stack/rdf/common/annotation/package-use.html...
Generating /usr/share/tomcat8/.jenkins/jobs/SANSA-Stack/branches/develop/workspace@2/sansa-rdf/sansa-rdf-common/target/apidocs/net/sansa_stack/rdf/common/io/riot/lang/package-use.html...
Generating /usr/share/tomcat8/.jenkins/jobs/SANSA-Stack/branches/develop/workspace@2/sansa-rdf/sansa-rdf-common/target/apidocs/net/sansa_stack/rdf/common/io/riot/tokens/package-use.html...
Generating /usr/share/tomcat8/.jenkins/jobs/SANSA-Stack/branches/develop/workspace@2/sansa-rdf/sansa-rdf-common/target/apidocs/org/apache/jena/system/package-use.html...
Building index for all the packages and classes...
Generating /usr/share/tomcat8/.jenkins/jobs/SANSA-Stack/branches/develop/workspace@2/sansa-rdf/sansa-rdf-common/target/apidocs/overview-tree.html...
Generating /usr/share/tomcat8/.jenkins/jobs/SANSA-Stack/branches/develop/workspace@2/sansa-rdf/sansa-rdf-common/target/apidocs/index-all.html...
Building index for all classes...
Generating /usr/share/tomcat8/.jenkins/jobs/SANSA-Stack/branches/develop/workspace@2/sansa-rdf/sansa-rdf-common/target/apidocs/allclasses-index.html...
Generating /usr/share/tomcat8/.jenkins/jobs/SANSA-Stack/branches/develop/workspace@2/sansa-rdf/sansa-rdf-common/target/apidocs/allpackages-index.html...
Generating /usr/share/tomcat8/.jenkins/jobs/SANSA-Stack/branches/develop/workspace@2/sansa-rdf/sansa-rdf-common/target/apidocs/deprecated-list.html...
Building index for all classes...
Generating /usr/share/tomcat8/.jenkins/jobs/SANSA-Stack/branches/develop/workspace@2/sansa-rdf/sansa-rdf-common/target/apidocs/allclasses.html...
Generating /usr/share/tomcat8/.jenkins/jobs/SANSA-Stack/branches/develop/workspace@2/sansa-rdf/sansa-rdf-common/target/apidocs/allclasses.html...
Generating /usr/share/tomcat8/.jenkins/jobs/SANSA-Stack/branches/develop/workspace@2/sansa-rdf/sansa-rdf-common/target/apidocs/index.html...
Generating /usr/share/tomcat8/.jenkins/jobs/SANSA-Stack/branches/develop/workspace@2/sansa-rdf/sansa-rdf-common/target/apidocs/overview-summary.html...
Generating /usr/share/tomcat8/.jenkins/jobs/SANSA-Stack/branches/develop/workspace@2/sansa-rdf/sansa-rdf-common/target/apidocs/help-doc.html...
[INFO] Building jar: /usr/share/tomcat8/.jenkins/jobs/SANSA-Stack/branches/develop/workspace@2/sansa-rdf/sansa-rdf-common/target/sansa-rdf-common_2.12-0.8.0-RC2-SNAPSHOT-javadoc.jar
[INFO] 
[INFO] --- scalastyle-maven-plugin:1.0.0:check (default) @ sansa-rdf-common_2.12 ---
warning file=/usr/share/tomcat8/.jenkins/jobs/SANSA-Stack/branches/develop/workspace@2/sansa-rdf/sansa-rdf-common/src/main/scala/net/sansa_stack/rdf/common/partition/utils/Symbols.scala message=Header does not match expected text line=1
warning file=/usr/share/tomcat8/.jenkins/jobs/SANSA-Stack/branches/develop/workspace@2/sansa-rdf/sansa-rdf-common/src/main/scala/net/sansa_stack/rdf/common/partition/utils/Symbols.scala message=Package name does not match the regular expression '^[a-z][A-Za-z]*$' line=1 column=12
warning file=/usr/share/tomcat8/.jenkins/jobs/SANSA-Stack/branches/develop/workspace@2/sansa-rdf/sansa-rdf-common/src/main/scala/net/sansa_stack/rdf/common/partition/utils/Symbols.scala message=Field name does not match the regular expression '^[A-Z][A-Za-z]*$' line=8 column=6
warning file=/usr/share/tomcat8/.jenkins/jobs/SANSA-Stack/branches/develop/workspace@2/sansa-rdf/sansa-rdf-common/src/main/scala/net/sansa_stack/rdf/common/partition/utils/RdfTerm.scala message=Header does not match expected text line=1
warning file=/usr/share/tomcat8/.jenkins/jobs/SANSA-Stack/branches/develop/workspace@2/sansa-rdf/sansa-rdf-common/src/main/scala/net/sansa_stack/rdf/common/partition/utils/RdfTerm.scala message=Package name does not match the regular expression '^[a-z][A-Za-z]*$' line=1 column=12
warning file=/usr/share/tomcat8/.jenkins/jobs/SANSA-Stack/branches/develop/workspace@2/sansa-rdf/sansa-rdf-common/src/main/scala/net/sansa_stack/rdf/common/partition/utils/RdfTerm.scala message=Avoid using null line=43 column=23
warning file=/usr/share/tomcat8/.jenkins/jobs/SANSA-Stack/branches/develop/workspace@2/sansa-rdf/sansa-rdf-common/src/main/scala/net/sansa_stack/rdf/common/partition/utils/RdfTerm.scala message=Avoid using null line=44 column=21
warning file=/usr/share/tomcat8/.jenkins/jobs/SANSA-Stack/branches/develop/workspace@2/sansa-rdf/sansa-rdf-common/src/main/scala/net/sansa_stack/rdf/common/partition/utils/RdfTerm.scala message=Regular expression matched 'println' line=60 column=22
warning file=/usr/share/tomcat8/.jenkins/jobs/SANSA-Stack/branches/develop/workspace@2/sansa-rdf/sansa-rdf-common/src/main/scala/net/sansa_stack/rdf/common/partition/utils/SQLUtils.scala message=Header does not match expected text line=1
warning file=/usr/share/tomcat8/.jenkins/jobs/SANSA-Stack/branches/develop/workspace@2/sansa-rdf/sansa-rdf-common/src/main/scala/net/sansa_stack/rdf/common/partition/utils/SQLUtils.scala message=Package name does not match the regular expression '^[a-z][A-Za-z]*$' line=1 column=12
warning file=/usr/share/tomcat8/.jenkins/jobs/SANSA-Stack/branches/develop/workspace@2/sansa-rdf/sansa-rdf-common/src/main/scala/net/sansa_stack/rdf/common/partition/utils/SQLUtils.scala message=Field name does not match the regular expression '^[A-Z][A-Za-z]*$' line=17 column=6
warning file=/usr/share/tomcat8/.jenkins/jobs/SANSA-Stack/branches/develop/workspace@2/sansa-rdf/sansa-rdf-common/src/main/scala/net/sansa_stack/rdf/common/partition/utils/SQLUtils.scala message=Field name does not match the regular expression '^[A-Z][A-Za-z]*$' line=18 column=6
warning file=/usr/share/tomcat8/.jenkins/jobs/SANSA-Stack/branches/develop/workspace@2/sansa-rdf/sansa-rdf-common/src/main/scala/net/sansa_stack/rdf/common/partition/utils/SQLUtils.scala message=Argument should be named line=23 column=25
warning file=/usr/share/tomcat8/.jenkins/jobs/SANSA-Stack/branches/develop/workspace@2/sansa-rdf/sansa-rdf-common/src/main/scala/net/sansa_stack/rdf/common/partition/utils/SQLUtils.scala message=Argument should be named line=24 column=32
warning file=/usr/share/tomcat8/.jenkins/jobs/SANSA-Stack/branches/develop/workspace@2/sansa-rdf/sansa-rdf-common/src/main/scala/net/sansa_stack/rdf/common/partition/utils/SQLUtils.scala message=Argument should be named line=39 column=15
warning file=/usr/share/tomcat8/.jenkins/jobs/SANSA-Stack/branches/develop/workspace@2/sansa-rdf/sansa-rdf-common/src/main/scala/net/sansa_stack/rdf/common/partition/utils/SQLUtils.scala message=Argument should be named line=39 column=20
warning file=/usr/share/tomcat8/.jenkins/jobs/SANSA-Stack/branches/develop/workspace@2/sansa-rdf/sansa-rdf-common/src/main/scala/net/sansa_stack/rdf/common/partition/utils/SQLUtils.scala message=Argument should be named line=40 column=15
warning file=/usr/share/tomcat8/.jenkins/jobs/SANSA-Stack/branches/develop/workspace@2/sansa-rdf/sansa-rdf-common/src/main/scala/net/sansa_stack/rdf/common/partition/utils/SQLUtils.scala message=Argument should be named line=40 column=20
warning file=/usr/share/tomcat8/.jenkins/jobs/SANSA-Stack/branches/develop/workspace@2/sansa-rdf/sansa-rdf-common/src/main/scala/net/sansa_stack/rdf/common/partition/model/sparqlify/SparqlifyUtils2.scala message=Header does not match expected text line=1
warning file=/usr/share/tomcat8/.jenkins/jobs/SANSA-Stack/branches/develop/workspace@2/sansa-rdf/sansa-rdf-common/src/main/scala/net/sansa_stack/rdf/common/partition/model/sparqlify/SparqlifyUtils2.scala message=File line length exceeds 160 characters line=98
warning file=/usr/share/tomcat8/.jenkins/jobs/SANSA-Stack/branches/develop/workspace@2/sansa-rdf/sansa-rdf-common/src/main/scala/net/sansa_stack/rdf/common/partition/model/sparqlify/SparqlifyUtils2.scala message=Package name does not match the regular expression '^[a-z][A-Za-z]*$' line=1 column=12
warning file=/usr/share/tomcat8/.jenkins/jobs/SANSA-Stack/branches/develop/workspace@2/sansa-rdf/sansa-rdf-common/src/main/scala/net/sansa_stack/rdf/common/partition/model/sparqlify/SparqlifyUtils2.scala message=Regular expression matched 'println' line=32 column=7
warning file=/usr/share/tomcat8/.jenkins/jobs/SANSA-Stack/branches/develop/workspace@2/sansa-rdf/sansa-rdf-common/src/main/scala/net/sansa_stack/rdf/common/partition/model/sparqlify/SparqlifyUtils2.scala message=Regular expression matched 'println' line=34 column=26
warning file=/usr/share/tomcat8/.jenkins/jobs/SANSA-Stack/branches/develop/workspace@2/sansa-rdf/sansa-rdf-common/src/main/scala/net/sansa_stack/rdf/common/partition/model/sparqlify/SparqlifyUtils2.scala message=Regular expression matched 'println' line=40 column=7
warning file=/usr/share/tomcat8/.jenkins/jobs/SANSA-Stack/branches/develop/workspace@2/sansa-rdf/sansa-rdf-common/src/main/scala/net/sansa_stack/rdf/common/partition/model/sparqlify/SparqlifyUtils2.scala message=Regular expression matched 'println' line=80 column=7
warning file=/usr/share/tomcat8/.jenkins/jobs/SANSA-Stack/branches/develop/workspace@2/sansa-rdf/sansa-rdf-common/src/main/scala/net/sansa_stack/rdf/common/partition/model/sparqlify/SparqlifyUtils2.scala message=Method is longer than 50 lines line=30 column=6
warning file=/usr/share/tomcat8/.jenkins/jobs/SANSA-Stack/branches/develop/workspace@2/sansa-rdf/sansa-rdf-common/src/main/scala/net/sansa_stack/rdf/common/partition/model/sparqlify/SparqlifyUtils2.scala message=Argument should be named line=62 column=34
warning file=/usr/share/tomcat8/.jenkins/jobs/SANSA-Stack/branches/develop/workspace@2/sansa-rdf/sansa-rdf-common/src/main/scala/net/sansa_stack/rdf/common/partition/model/sparqlify/SparqlifyUtils2.scala message=Argument should be named line=63 column=34
warning file=/usr/share/tomcat8/.jenkins/jobs/SANSA-Stack/branches/develop/workspace@2/sansa-rdf/sansa-rdf-common/src/main/scala/net/sansa_stack/rdf/common/partition/core/RdfPartitioner.scala message=Header does not match expected text line=1
warning file=/usr/share/tomcat8/.jenkins/jobs/SANSA-Stack/branches/develop/workspace@2/sansa-rdf/sansa-rdf-common/src/main/scala/net/sansa_stack/rdf/common/partition/core/RdfPartitioner.scala message=Package name does not match the regular expression '^[a-z][A-Za-z]*$' line=1 column=12
warning file=/usr/share/tomcat8/.jenkins/jobs/SANSA-Stack/branches/develop/workspace@2/sansa-rdf/sansa-rdf-common/src/main/scala/net/sansa_stack/rdf/common/partition/core/RdfPartitionerComplex.scala message=Header does not match expected text line=1
warning file=/usr/share/tomcat8/.jenkins/jobs/SANSA-Stack/branches/develop/workspace@2/sansa-rdf/sansa-rdf-common/src/main/scala/net/sansa_stack/rdf/common/partition/core/RdfPartitionerComplex.scala message=File line length exceeds 160 characters line=6
warning file=/usr/share/tomcat8/.jenkins/jobs/SANSA-Stack/branches/develop/workspace@2/sansa-rdf/sansa-rdf-common/src/main/scala/net/sansa_stack/rdf/common/partition/core/RdfPartitionerComplex.scala message=Package name does not match the regular expression '^[a-z][A-Za-z]*$' line=1 column=12
warning file=/usr/share/tomcat8/.jenkins/jobs/SANSA-Stack/branches/develop/workspace@2/sansa-rdf/sansa-rdf-common/src/main/scala/net/sansa_stack/rdf/common/partition/core/RdfPartitionerComplex.scala message=Cyclomatic complexity of 25 exceeds max of 10 line=27 column=15
warning file=/usr/share/tomcat8/.jenkins/jobs/SANSA-Stack/branches/develop/workspace@2/sansa-rdf/sansa-rdf-common/src/main/scala/net/sansa_stack/rdf/common/partition/core/RdfPartitionerBase.scala message=Header does not match expected text line=1
warning file=/usr/share/tomcat8/.jenkins/jobs/SANSA-Stack/branches/develop/workspace@2/sansa-rdf/sansa-rdf-common/src/main/scala/net/sansa_stack/rdf/common/partition/core/RdfPartitionerBase.scala message=File line length exceeds 160 characters line=3
warning file=/usr/share/tomcat8/.jenkins/jobs/SANSA-Stack/branches/develop/workspace@2/sansa-rdf/sansa-rdf-common/src/main/scala/net/sansa_stack/rdf/common/partition/core/RdfPartitionerBase.scala message=Package name does not match the regular expression '^[a-z][A-Za-z]*$' line=1 column=12
warning file=/usr/share/tomcat8/.jenkins/jobs/SANSA-Stack/branches/develop/workspace@2/sansa-rdf/sansa-rdf-common/src/main/scala/net/sansa_stack/rdf/common/partition/core/RdfPartitionerBase.scala message=Avoid using null line=95 column=6
warning file=/usr/share/tomcat8/.jenkins/jobs/SANSA-Stack/branches/develop/workspace@2/sansa-rdf/sansa-rdf-common/src/main/scala/net/sansa_stack/rdf/common/partition/core/RdfPartitionerBase.scala message=Avoid using null line=99 column=95
warning file=/usr/share/tomcat8/.jenkins/jobs/SANSA-Stack/branches/develop/workspace@2/sansa-rdf/sansa-rdf-common/src/main/scala/net/sansa_stack/rdf/common/partition/core/RdfPartitionerBase.scala message=Use of TODO/FIXME comment line=71 column=4
warning file=/usr/share/tomcat8/.jenkins/jobs/SANSA-Stack/branches/develop/workspace@2/sansa-rdf/sansa-rdf-common/src/main/scala/net/sansa_stack/rdf/common/partition/core/RdfPartitionerDefault.scala message=Header does not match expected text line=1
warning file=/usr/share/tomcat8/.jenkins/jobs/SANSA-Stack/branches/develop/workspace@2/sansa-rdf/sansa-rdf-common/src/main/scala/net/sansa_stack/rdf/common/partition/core/RdfPartitionerDefault.scala message=File line length exceeds 160 characters line=28
warning file=/usr/share/tomcat8/.jenkins/jobs/SANSA-Stack/branches/develop/workspace@2/sansa-rdf/sansa-rdf-common/src/main/scala/net/sansa_stack/rdf/common/partition/core/RdfPartitionerDefault.scala message=Package name does not match the regular expression '^[a-z][A-Za-z]*$' line=1 column=12
warning file=/usr/share/tomcat8/.jenkins/jobs/SANSA-Stack/branches/develop/workspace@2/sansa-rdf/sansa-rdf-common/src/main/scala/net/sansa_stack/rdf/common/partition/core/RdfPartitionerDefault.scala message=Cyclomatic complexity of 15 exceeds max of 10 line=16 column=6
warning file=/usr/share/tomcat8/.jenkins/jobs/SANSA-Stack/branches/develop/workspace@2/sansa-rdf/sansa-rdf-common/src/main/scala/net/sansa_stack/rdf/common/partition/core/RdfPartitionerDefault.scala message=If block needs braces line=17 column=14
warning file=/usr/share/tomcat8/.jenkins/jobs/SANSA-Stack/branches/develop/workspace@2/sansa-rdf/sansa-rdf-common/src/main/scala/net/sansa_stack/rdf/common/partition/core/TermType.scala message=Header does not match expected text line=1
warning file=/usr/share/tomcat8/.jenkins/jobs/SANSA-Stack/branches/develop/workspace@2/sansa-rdf/sansa-rdf-common/src/main/scala/net/sansa_stack/rdf/common/partition/core/TermType.scala message=Package name does not match the regular expression '^[a-z][A-Za-z]*$' line=1 column=12
warning file=/usr/share/tomcat8/.jenkins/jobs/SANSA-Stack/branches/develop/workspace@2/sansa-rdf/sansa-rdf-common/src/main/scala/net/sansa_stack/rdf/common/partition/core/RdfPartitionStateDefault.scala message=Header does not match expected text line=1
warning file=/usr/share/tomcat8/.jenkins/jobs/SANSA-Stack/branches/develop/workspace@2/sansa-rdf/sansa-rdf-common/src/main/scala/net/sansa_stack/rdf/common/partition/core/RdfPartitionStateDefault.scala message=Package name does not match the regular expression '^[a-z][A-Za-z]*$' line=1 column=12
warning file=/usr/share/tomcat8/.jenkins/jobs/SANSA-Stack/branches/develop/workspace@2/sansa-rdf/sansa-rdf-common/src/main/scala/net/sansa_stack/rdf/common/partition/core/RdfPartitionStateDefault.scala message=File must end with newline character
warning file=/usr/share/tomcat8/.jenkins/jobs/SANSA-Stack/branches/develop/workspace@2/sansa-rdf/sansa-rdf-common/src/main/scala/net/sansa_stack/rdf/common/partition/schema/SchemaStringDecimal.scala message=Header does not match expected text line=1
warning file=/usr/share/tomcat8/.jenkins/jobs/SANSA-Stack/branches/develop/workspace@2/sansa-rdf/sansa-rdf-common/src/main/scala/net/sansa_stack/rdf/common/partition/schema/SchemaStringDecimal.scala message=Package name does not match the regular expression '^[a-z][A-Za-z]*$' line=1 column=12
warning file=/usr/share/tomcat8/.jenkins/jobs/SANSA-Stack/branches/develop/workspace@2/sansa-rdf/sansa-rdf-common/src/main/scala/net/sansa_stack/rdf/common/partition/schema/SchemaStringStringType.scala message=Header does not match expected text line=1
warning file=/usr/share/tomcat8/.jenkins/jobs/SANSA-Stack/branches/develop/workspace@2/sansa-rdf/sansa-rdf-common/src/main/scala/net/sansa_stack/rdf/common/partition/schema/SchemaStringStringType.scala message=Package name does not match the regular expression '^[a-z][A-Za-z]*$' line=1 column=12
warning file=/usr/share/tomcat8/.jenkins/jobs/SANSA-Stack/branches/develop/workspace@2/sansa-rdf/sansa-rdf-common/src/main/scala/net/sansa_stack/rdf/common/partition/schema/SchemaStringDouble.scala message=Header does not match expected text line=1
warning file=/usr/share/tomcat8/.jenkins/jobs/SANSA-Stack/branches/develop/workspace@2/sansa-rdf/sansa-rdf-common/src/main/scala/net/sansa_stack/rdf/common/partition/schema/SchemaStringDouble.scala message=Package name does not match the regular expression '^[a-z][A-Za-z]*$' line=1 column=12
warning file=/usr/share/tomcat8/.jenkins/jobs/SANSA-Stack/branches/develop/workspace@2/sansa-rdf/sansa-rdf-common/src/main/scala/net/sansa_stack/rdf/common/partition/schema/SchemaStringString.scala message=Header does not match expected text line=1
warning file=/usr/share/tomcat8/.jenkins/jobs/SANSA-Stack/branches/develop/workspace@2/sansa-rdf/sansa-rdf-common/src/main/scala/net/sansa_stack/rdf/common/partition/schema/SchemaStringString.scala message=Package name does not match the regular expression '^[a-z][A-Za-z]*$' line=1 column=12
warning file=/usr/share/tomcat8/.jenkins/jobs/SANSA-Stack/branches/develop/workspace@2/sansa-rdf/sansa-rdf-common/src/main/scala/net/sansa_stack/rdf/common/partition/schema/SchemaStringStringLang.scala message=Header does not match expected text line=1
warning file=/usr/share/tomcat8/.jenkins/jobs/SANSA-Stack/branches/develop/workspace@2/sansa-rdf/sansa-rdf-common/src/main/scala/net/sansa_stack/rdf/common/partition/schema/SchemaStringStringLang.scala message=Package name does not match the regular expression '^[a-z][A-Za-z]*$' line=1 column=12
warning file=/usr/share/tomcat8/.jenkins/jobs/SANSA-Stack/branches/develop/workspace@2/sansa-rdf/sansa-rdf-common/src/main/scala/net/sansa_stack/rdf/common/partition/schema/SchemaStringLong.scala message=Header does not match expected text line=1
warning file=/usr/share/tomcat8/.jenkins/jobs/SANSA-Stack/branches/develop/workspace@2/sansa-rdf/sansa-rdf-common/src/main/scala/net/sansa_stack/rdf/common/partition/schema/SchemaStringLong.scala message=Package name does not match the regular expression '^[a-z][A-Za-z]*$' line=1 column=12
warning file=/usr/share/tomcat8/.jenkins/jobs/SANSA-Stack/branches/develop/workspace@2/sansa-rdf/sansa-rdf-common/src/main/scala/net/sansa_stack/rdf/common/partition/schema/SchemaStringBoolean.scala message=Header does not match expected text line=1
warning file=/usr/share/tomcat8/.jenkins/jobs/SANSA-Stack/branches/develop/workspace@2/sansa-rdf/sansa-rdf-common/src/main/scala/net/sansa_stack/rdf/common/partition/schema/SchemaStringBoolean.scala message=Package name does not match the regular expression '^[a-z][A-Za-z]*$' line=1 column=12
warning file=/usr/share/tomcat8/.jenkins/jobs/SANSA-Stack/branches/develop/workspace@2/sansa-rdf/sansa-rdf-common/src/main/scala/net/sansa_stack/rdf/common/partition/schema/SchemaStringFloat.scala message=Header does not match expected text line=1
warning file=/usr/share/tomcat8/.jenkins/jobs/SANSA-Stack/branches/develop/workspace@2/sansa-rdf/sansa-rdf-common/src/main/scala/net/sansa_stack/rdf/common/partition/schema/SchemaStringFloat.scala message=Package name does not match the regular expression '^[a-z][A-Za-z]*$' line=1 column=12
warning file=/usr/share/tomcat8/.jenkins/jobs/SANSA-Stack/branches/develop/workspace@2/sansa-rdf/sansa-rdf-common/src/main/scala/net/sansa_stack/rdf/common/partition/schema/SchemaStringTimestamp.scala message=Header does not match expected text line=1
warning file=/usr/share/tomcat8/.jenkins/jobs/SANSA-Stack/branches/develop/workspace@2/sansa-rdf/sansa-rdf-common/src/main/scala/net/sansa_stack/rdf/common/partition/schema/SchemaStringTimestamp.scala message=Package name does not match the regular expression '^[a-z][A-Za-z]*$' line=1 column=12
warning file=/usr/share/tomcat8/.jenkins/jobs/SANSA-Stack/branches/develop/workspace@2/sansa-rdf/sansa-rdf-common/src/main/scala/net/sansa_stack/rdf/common/partition/schema/SchemaStringDate.scala message=Header does not match expected text line=1
warning file=/usr/share/tomcat8/.jenkins/jobs/SANSA-Stack/branches/develop/workspace@2/sansa-rdf/sansa-rdf-common/src/main/scala/net/sansa_stack/rdf/common/partition/schema/SchemaStringDate.scala message=Package name does not match the regular expression '^[a-z][A-Za-z]*$' line=1 column=12
warning file=/usr/share/tomcat8/.jenkins/jobs/SANSA-Stack/branches/develop/workspace@2/sansa-rdf/sansa-rdf-common/src/main/scala/net/sansa_stack/rdf/common/partition/layout/TripleLayoutBoolean.scala message=Header does not match expected text line=1
warning file=/usr/share/tomcat8/.jenkins/jobs/SANSA-Stack/branches/develop/workspace@2/sansa-rdf/sansa-rdf-common/src/main/scala/net/sansa_stack/rdf/common/partition/layout/TripleLayoutBoolean.scala message=Package name does not match the regular expression '^[a-z][A-Za-z]*$' line=1 column=12
warning file=/usr/share/tomcat8/.jenkins/jobs/SANSA-Stack/branches/develop/workspace@2/sansa-rdf/sansa-rdf-common/src/main/scala/net/sansa_stack/rdf/common/partition/layout/TripleLayoutBoolean.scala message=If block needs braces line=26 column=12
warning file=/usr/share/tomcat8/.jenkins/jobs/SANSA-Stack/branches/develop/workspace@2/sansa-rdf/sansa-rdf-common/src/main/scala/net/sansa_stack/rdf/common/partition/layout/TripleLayoutStringDate.scala message=Header does not match expected text line=1
warning file=/usr/share/tomcat8/.jenkins/jobs/SANSA-Stack/branches/develop/workspace@2/sansa-rdf/sansa-rdf-common/src/main/scala/net/sansa_stack/rdf/common/partition/layout/TripleLayoutStringDate.scala message=Package name does not match the regular expression '^[a-z][A-Za-z]*$' line=1 column=12
warning file=/usr/share/tomcat8/.jenkins/jobs/SANSA-Stack/branches/develop/workspace@2/sansa-rdf/sansa-rdf-common/src/main/scala/net/sansa_stack/rdf/common/partition/layout/TripleLayoutStringDate.scala message=If block needs braces line=30 column=12
warning file=/usr/share/tomcat8/.jenkins/jobs/SANSA-Stack/branches/develop/workspace@2/sansa-rdf/sansa-rdf-common/src/main/scala/net/sansa_stack/rdf/common/partition/layout/TripleLayoutStringDate.scala message=Field name does not match the regular expression '^[A-Z][A-Za-z]*$' line=25 column=14
warning file=/usr/share/tomcat8/.jenkins/jobs/SANSA-Stack/branches/develop/workspace@2/sansa-rdf/sansa-rdf-common/src/main/scala/net/sansa_stack/rdf/common/partition/layout/TripleLayoutString.scala message=Header does not match expected text line=1
warning file=/usr/share/tomcat8/.jenkins/jobs/SANSA-Stack/branches/develop/workspace@2/sansa-rdf/sansa-rdf-common/src/main/scala/net/sansa_stack/rdf/common/partition/layout/TripleLayoutString.scala message=Package name does not match the regular expression '^[a-z][A-Za-z]*$' line=1 column=12
warning file=/usr/share/tomcat8/.jenkins/jobs/SANSA-Stack/branches/develop/workspace@2/sansa-rdf/sansa-rdf-common/src/main/scala/net/sansa_stack/rdf/common/partition/layout/TripleLayoutStringDatatype.scala message=Header does not match expected text line=1
warning file=/usr/share/tomcat8/.jenkins/jobs/SANSA-Stack/branches/develop/workspace@2/sansa-rdf/sansa-rdf-common/src/main/scala/net/sansa_stack/rdf/common/partition/layout/TripleLayoutStringDatatype.scala message=Package name does not match the regular expression '^[a-z][A-Za-z]*$' line=1 column=12
warning file=/usr/share/tomcat8/.jenkins/jobs/SANSA-Stack/branches/develop/workspace@2/sansa-rdf/sansa-rdf-common/src/main/scala/net/sansa_stack/rdf/common/partition/layout/TripleLayoutDouble.scala message=Header does not match expected text line=1
warning file=/usr/share/tomcat8/.jenkins/jobs/SANSA-Stack/branches/develop/workspace@2/sansa-rdf/sansa-rdf-common/src/main/scala/net/sansa_stack/rdf/common/partition/layout/TripleLayoutDouble.scala message=Package name does not match the regular expression '^[a-z][A-Za-z]*$' line=1 column=12
warning file=/usr/share/tomcat8/.jenkins/jobs/SANSA-Stack/branches/develop/workspace@2/sansa-rdf/sansa-rdf-common/src/main/scala/net/sansa_stack/rdf/common/partition/layout/TripleLayoutDouble.scala message=If block needs braces line=17 column=12
warning file=/usr/share/tomcat8/.jenkins/jobs/SANSA-Stack/branches/develop/workspace@2/sansa-rdf/sansa-rdf-common/src/main/scala/net/sansa_stack/rdf/common/partition/layout/TripleLayoutLong.scala message=Header does not match expected text line=1
warning file=/usr/share/tomcat8/.jenkins/jobs/SANSA-Stack/branches/develop/workspace@2/sansa-rdf/sansa-rdf-common/src/main/scala/net/sansa_stack/rdf/common/partition/layout/TripleLayoutLong.scala message=Package name does not match the regular expression '^[a-z][A-Za-z]*$' line=1 column=12
warning file=/usr/share/tomcat8/.jenkins/jobs/SANSA-Stack/branches/develop/workspace@2/sansa-rdf/sansa-rdf-common/src/main/scala/net/sansa_stack/rdf/common/partition/layout/TripleLayoutLong.scala message=If block needs braces line=17 column=12
warning file=/usr/share/tomcat8/.jenkins/jobs/SANSA-Stack/branches/develop/workspace@2/sansa-rdf/sansa-rdf-common/src/main/scala/net/sansa_stack/rdf/common/partition/layout/TripleLayout.scala message=Header does not match expected text line=1
warning file=/usr/share/tomcat8/.jenkins/jobs/SANSA-Stack/branches/develop/workspace@2/sansa-rdf/sansa-rdf-common/src/main/scala/net/sansa_stack/rdf/common/partition/layout/TripleLayout.scala message=Package name does not match the regular expression '^[a-z][A-Za-z]*$' line=1 column=12
warning file=/usr/share/tomcat8/.jenkins/jobs/SANSA-Stack/branches/develop/workspace@2/sansa-rdf/sansa-rdf-common/src/main/scala/net/sansa_stack/rdf/common/partition/layout/TripleLayoutFloat.scala message=Header does not match expected text line=1
warning file=/usr/share/tomcat8/.jenkins/jobs/SANSA-Stack/branches/develop/workspace@2/sansa-rdf/sansa-rdf-common/src/main/scala/net/sansa_stack/rdf/common/partition/layout/TripleLayoutFloat.scala message=Package name does not match the regular expression '^[a-z][A-Za-z]*$' line=1 column=12
warning file=/usr/share/tomcat8/.jenkins/jobs/SANSA-Stack/branches/develop/workspace@2/sansa-rdf/sansa-rdf-common/src/main/scala/net/sansa_stack/rdf/common/partition/layout/TripleLayoutFloat.scala message=If block needs braces line=17 column=12
warning file=/usr/share/tomcat8/.jenkins/jobs/SANSA-Stack/branches/develop/workspace@2/sansa-rdf/sansa-rdf-common/src/main/scala/net/sansa_stack/rdf/common/partition/layout/TripleLayoutStringLang.scala message=Header does not match expected text line=1
warning file=/usr/share/tomcat8/.jenkins/jobs/SANSA-Stack/branches/develop/workspace@2/sansa-rdf/sansa-rdf-common/src/main/scala/net/sansa_stack/rdf/common/partition/layout/TripleLayoutStringLang.scala message=Package name does not match the regular expression '^[a-z][A-Za-z]*$' line=1 column=12
warning file=/usr/share/tomcat8/.jenkins/jobs/SANSA-Stack/branches/develop/workspace@2/sansa-rdf/sansa-rdf-common/src/main/scala/net/sansa_stack/rdf/common/partition/layout/TripleLayoutDecimal.scala message=Header does not match expected text line=1
warning file=/usr/share/tomcat8/.jenkins/jobs/SANSA-Stack/branches/develop/workspace@2/sansa-rdf/sansa-rdf-common/src/main/scala/net/sansa_stack/rdf/common/partition/layout/TripleLayoutDecimal.scala message=Package name does not match the regular expression '^[a-z][A-Za-z]*$' line=1 column=12
warning file=/usr/share/tomcat8/.jenkins/jobs/SANSA-Stack/branches/develop/workspace@2/sansa-rdf/sansa-rdf-common/src/main/scala/net/sansa_stack/rdf/common/partition/layout/TripleLayoutDecimal.scala message=If block needs braces line=18 column=12
warning file=/usr/share/tomcat8/.jenkins/jobs/SANSA-Stack/branches/develop/workspace@2/sansa-rdf/sansa-rdf-common/src/main/scala/net/sansa_stack/rdf/common/partition/layout/TripleLayoutStringTimestamp.scala message=Header does not match expected text line=1
warning file=/usr/share/tomcat8/.jenkins/jobs/SANSA-Stack/branches/develop/workspace@2/sansa-rdf/sansa-rdf-common/src/main/scala/net/sansa_stack/rdf/common/partition/layout/TripleLayoutStringTimestamp.scala message=Package name does not match the regular expression '^[a-z][A-Za-z]*$' line=1 column=12
warning file=/usr/share/tomcat8/.jenkins/jobs/SANSA-Stack/branches/develop/workspace@2/sansa-rdf/sansa-rdf-common/src/main/scala/net/sansa_stack/rdf/common/partition/layout/TripleLayoutStringTimestamp.scala message=If block needs braces line=29 column=12
warning file=/usr/share/tomcat8/.jenkins/jobs/SANSA-Stack/branches/develop/workspace@2/sansa-rdf/sansa-rdf-common/src/main/scala/net/sansa_stack/rdf/common/partition/layout/TripleLayoutStringTimestamp.scala message=Field name does not match the regular expression '^[A-Z][A-Za-z]*$' line=24 column=14
warning file=/usr/share/tomcat8/.jenkins/jobs/SANSA-Stack/branches/develop/workspace@2/sansa-rdf/sansa-rdf-common/src/main/scala/net/sansa_stack/rdf/common/partition/trash/RdfPartition.scala message=Header does not match expected text line=1
warning file=/usr/share/tomcat8/.jenkins/jobs/SANSA-Stack/branches/develop/workspace@2/sansa-rdf/sansa-rdf-common/src/main/scala/net/sansa_stack/rdf/common/partition/trash/RdfPartition.scala message=Package name does not match the regular expression '^[a-z][A-Za-z]*$' line=1 column=12
warning file=/usr/share/tomcat8/.jenkins/jobs/SANSA-Stack/branches/develop/workspace@2/sansa-rdf/sansa-rdf-common/src/main/scala/net/sansa_stack/rdf/common/partition/trash/RdfPartition.scala message=File must end with newline character
warning file=/usr/share/tomcat8/.jenkins/jobs/SANSA-Stack/branches/develop/workspace@2/sansa-rdf/sansa-rdf-common/src/main/scala/net/sansa_stack/rdf/common/partition/trash/RdfPartitionFromStateImpl.scala message=Header does not match expected text line=1
warning file=/usr/share/tomcat8/.jenkins/jobs/SANSA-Stack/branches/develop/workspace@2/sansa-rdf/sansa-rdf-common/src/main/scala/net/sansa_stack/rdf/common/partition/trash/RdfPartitionFromStateImpl.scala message=Package name does not match the regular expression '^[a-z][A-Za-z]*$' line=1 column=12
warning file=/usr/share/tomcat8/.jenkins/jobs/SANSA-Stack/branches/develop/workspace@2/sansa-rdf/sansa-rdf-common/src/main/scala/net/sansa_stack/rdf/common/partition/trash/RdfPartitionFromStateImpl.scala message=File must end with newline character
warning file=/usr/share/tomcat8/.jenkins/jobs/SANSA-Stack/branches/develop/workspace@2/sansa-rdf/sansa-rdf-common/src/main/scala/net/sansa_stack/rdf/common/partition/trash/RdfPartitionComplex.scala message=Header does not match expected text line=1
warning file=/usr/share/tomcat8/.jenkins/jobs/SANSA-Stack/branches/develop/workspace@2/sansa-rdf/sansa-rdf-common/src/main/scala/net/sansa_stack/rdf/common/partition/trash/RdfPartitionComplex.scala message=Package name does not match the regular expression '^[a-z][A-Za-z]*$' line=1 column=12
warning file=/usr/share/tomcat8/.jenkins/jobs/SANSA-Stack/branches/develop/workspace@2/sansa-rdf/sansa-rdf-common/src/main/scala/net/sansa_stack/rdf/common/partition/trash/RdfPartitionComplex.scala message=Use of TODO/FIXME comment line=7 column=0
warning file=/usr/share/tomcat8/.jenkins/jobs/SANSA-Stack/branches/develop/workspace@2/sansa-rdf/sansa-rdf-common/src/main/scala/net/sansa_stack/rdf/common/partition/trash/RdfPartitionFromState.scala message=Header does not match expected text line=1
warning file=/usr/share/tomcat8/.jenkins/jobs/SANSA-Stack/branches/develop/workspace@2/sansa-rdf/sansa-rdf-common/src/main/scala/net/sansa_stack/rdf/common/partition/trash/RdfPartitionFromState.scala message=Package name does not match the regular expression '^[a-z][A-Za-z]*$' line=1 column=12
warning file=/usr/share/tomcat8/.jenkins/jobs/SANSA-Stack/branches/develop/workspace@2/sansa-rdf/sansa-rdf-common/src/main/scala/net/sansa_stack/rdf/common/partition/r2rml/R2rmlUtils.scala message=Header does not match expected text line=1
warning file=/usr/share/tomcat8/.jenkins/jobs/SANSA-Stack/branches/develop/workspace@2/sansa-rdf/sansa-rdf-common/src/main/scala/net/sansa_stack/rdf/common/partition/r2rml/R2rmlUtils.scala message=Package name does not match the regular expression '^[a-z][A-Za-z]*$' line=1 column=12
warning file=/usr/share/tomcat8/.jenkins/jobs/SANSA-Stack/branches/develop/workspace@2/sansa-rdf/sansa-rdf-common/src/main/scala/net/sansa_stack/rdf/common/partition/r2rml/R2rmlUtils.scala message=Package name does not match the regular expression '^[a-z][A-Za-z]*$' line=1 column=45
warning file=/usr/share/tomcat8/.jenkins/jobs/SANSA-Stack/branches/develop/workspace@2/sansa-rdf/sansa-rdf-common/src/main/scala/net/sansa_stack/rdf/common/partition/r2rml/R2rmlUtils.scala message=Method is longer than 50 lines line=132 column=6
warning file=/usr/share/tomcat8/.jenkins/jobs/SANSA-Stack/branches/develop/workspace@2/sansa-rdf/sansa-rdf-common/src/main/scala/net/sansa_stack/rdf/common/partition/r2rml/R2rmlUtils.scala message=Use of TODO/FIXME comment line=28 column=2
warning file=/usr/share/tomcat8/.jenkins/jobs/SANSA-Stack/branches/develop/workspace@2/sansa-rdf/sansa-rdf-common/src/main/scala/net/sansa_stack/rdf/common/partition/r2rml/R2rmlUtils.scala message=Use of TODO/FIXME comment line=54 column=2
warning file=/usr/share/tomcat8/.jenkins/jobs/SANSA-Stack/branches/develop/workspace@2/sansa-rdf/sansa-rdf-common/src/main/scala/net/sansa_stack/rdf/common/partition/r2rml/R2rmlUtils.scala message=Use of TODO/FIXME comment line=88 column=2
warning file=/usr/share/tomcat8/.jenkins/jobs/SANSA-Stack/branches/develop/workspace@2/sansa-rdf/sansa-rdf-common/src/main/scala/net/sansa_stack/rdf/common/partition/r2rml/R2rmlUtils.scala message=Use of TODO/FIXME comment line=116 column=2
warning file=/usr/share/tomcat8/.jenkins/jobs/SANSA-Stack/branches/develop/workspace@2/sansa-rdf/sansa-rdf-common/src/main/scala/net/sansa_stack/rdf/common/partition/r2rml/R2rmlUtils.scala message=Use of TODO/FIXME comment line=162 column=8
warning file=/usr/share/tomcat8/.jenkins/jobs/SANSA-Stack/branches/develop/workspace@2/sansa-rdf/sansa-rdf-common/src/main/scala/net/sansa_stack/rdf/common/partition/r2rml/R2rmlUtils.scala message=Use of TODO/FIXME comment line=163 column=8
warning file=/usr/share/tomcat8/.jenkins/jobs/SANSA-Stack/branches/develop/workspace@2/sansa-rdf/sansa-rdf-common/src/main/scala/net/sansa_stack/rdf/common/partition/r2rml/R2rmlUtils.scala message=Use of TODO/FIXME comment line=230 column=6
warning file=/usr/share/tomcat8/.jenkins/jobs/SANSA-Stack/branches/develop/workspace@2/sansa-rdf/sansa-rdf-common/src/main/scala/net/sansa_stack/rdf/common/partition/r2rml/R2rmlUtils.scala message=Argument should be named line=156 column=54
warning file=/usr/share/tomcat8/.jenkins/jobs/SANSA-Stack/branches/develop/workspace@2/sansa-rdf/sansa-rdf-common/src/main/scala/net/sansa_stack/rdf/common/partition/r2rml/R2rmlUtils.scala message=Argument should be named line=156 column=57
warning file=/usr/share/tomcat8/.jenkins/jobs/SANSA-Stack/branches/develop/workspace@2/sansa-rdf/sansa-rdf-common/src/main/scala/net/sansa_stack/rdf/common/partition/r2rml/R2rmlUtils.scala message=Argument should be named line=158 column=42
warning file=/usr/share/tomcat8/.jenkins/jobs/SANSA-Stack/branches/develop/workspace@2/sansa-rdf/sansa-rdf-common/src/main/scala/net/sansa_stack/rdf/common/partition/r2rml/R2rmlModel.scala message=Header does not match expected text line=1
warning file=/usr/share/tomcat8/.jenkins/jobs/SANSA-Stack/branches/develop/workspace@2/sansa-rdf/sansa-rdf-common/src/main/scala/net/sansa_stack/rdf/common/partition/r2rml/R2rmlModel.scala message=Package name does not match the regular expression '^[a-z][A-Za-z]*$' line=1 column=12
warning file=/usr/share/tomcat8/.jenkins/jobs/SANSA-Stack/branches/develop/workspace@2/sansa-rdf/sansa-rdf-common/src/main/scala/net/sansa_stack/rdf/common/partition/r2rml/R2rmlModel.scala message=Package name does not match the regular expression '^[a-z][A-Za-z]*$' line=1 column=45
warning file=/usr/share/tomcat8/.jenkins/jobs/SANSA-Stack/branches/develop/workspace@2/sansa-rdf/sansa-rdf-common/src/main/scala/net/sansa_stack/rdf/common/io/ntriples/NTriplesStringToJenaTriple.scala message=Header does not match expected text line=1
warning file=/usr/share/tomcat8/.jenkins/jobs/SANSA-Stack/branches/develop/workspace@2/sansa-rdf/sansa-rdf-common/src/main/scala/net/sansa_stack/rdf/common/io/ntriples/NTriplesStringToJenaTriple.scala message=Package name does not match the regular expression '^[a-z][A-Za-z]*$' line=1 column=12
warning file=/usr/share/tomcat8/.jenkins/jobs/SANSA-Stack/branches/develop/workspace@2/sansa-rdf/sansa-rdf-common/src/main/scala/net/sansa_stack/rdf/common/io/ntriples/NTriplesStringToJenaTriple.scala message=Avoid using null line=23 column=90
warning file=/usr/share/tomcat8/.jenkins/jobs/SANSA-Stack/branches/develop/workspace@2/sansa-rdf/sansa-rdf-common/src/main/scala/net/sansa_stack/rdf/common/io/ntriples/NTriplesStringToJenaTriple.scala message=Argument should be named line=23 column=90
warning file=/usr/share/tomcat8/.jenkins/jobs/SANSA-Stack/branches/develop/workspace@2/sansa-rdf/sansa-rdf-common/src/main/scala/net/sansa_stack/rdf/common/io/ntriples/JenaTripleToNTripleString.scala message=Header does not match expected text line=1
warning file=/usr/share/tomcat8/.jenkins/jobs/SANSA-Stack/branches/develop/workspace@2/sansa-rdf/sansa-rdf-common/src/main/scala/net/sansa_stack/rdf/common/io/ntriples/JenaTripleToNTripleString.scala message=Package name does not match the regular expression '^[a-z][A-Za-z]*$' line=1 column=12
warning file=/usr/share/tomcat8/.jenkins/jobs/SANSA-Stack/branches/develop/workspace@2/sansa-rdf/sansa-rdf-common/src/main/scala/net/sansa_stack/rdf/common/io/hadoop/RiotFileInputFormat.scala message=Header does not match expected text line=1
warning file=/usr/share/tomcat8/.jenkins/jobs/SANSA-Stack/branches/develop/workspace@2/sansa-rdf/sansa-rdf-common/src/main/scala/net/sansa_stack/rdf/common/io/hadoop/RiotFileInputFormat.scala message=Package name does not match the regular expression '^[a-z][A-Za-z]*$' line=1 column=12
warning file=/usr/share/tomcat8/.jenkins/jobs/SANSA-Stack/branches/develop/workspace@2/sansa-rdf/sansa-rdf-common/src/main/scala/net/sansa_stack/rdf/common/io/hadoop/RiotFileInputFormat.scala message=Avoid using null line=57 column=35
warning file=/usr/share/tomcat8/.jenkins/jobs/SANSA-Stack/branches/develop/workspace@2/sansa-rdf/sansa-rdf-common/src/main/scala/net/sansa_stack/rdf/common/io/hadoop/RiotFileInputFormat.scala message=Avoid using null line=58 column=34
warning file=/usr/share/tomcat8/.jenkins/jobs/SANSA-Stack/branches/develop/workspace@2/sansa-rdf/sansa-rdf-common/src/main/scala/net/sansa_stack/rdf/common/io/hadoop/RiotFileInputFormat.scala message=Avoid using null line=59 column=37
warning file=/usr/share/tomcat8/.jenkins/jobs/SANSA-Stack/branches/develop/workspace@2/sansa-rdf/sansa-rdf-common/src/main/scala/net/sansa_stack/rdf/common/io/hadoop/RiotFileInputFormat.scala message=Avoid using null line=61 column=68
warning file=/usr/share/tomcat8/.jenkins/jobs/SANSA-Stack/branches/develop/workspace@2/sansa-rdf/sansa-rdf-common/src/main/scala/net/sansa_stack/rdf/common/io/hadoop/RiotFileInputFormat.scala message=Avoid using null line=87 column=15
warning file=/usr/share/tomcat8/.jenkins/jobs/SANSA-Stack/branches/develop/workspace@2/sansa-rdf/sansa-rdf-common/src/main/scala/net/sansa_stack/rdf/common/io/hadoop/RiotFileInputFormat.scala message=Avoid using null line=91 column=21
warning file=/usr/share/tomcat8/.jenkins/jobs/SANSA-Stack/branches/develop/workspace@2/sansa-rdf/sansa-rdf-common/src/main/scala/net/sansa_stack/rdf/common/io/hadoop/RiotFileInputFormat.scala message=Avoid using null line=107 column=34
warning file=/usr/share/tomcat8/.jenkins/jobs/SANSA-Stack/branches/develop/workspace@2/sansa-rdf/sansa-rdf-common/src/main/scala/net/sansa_stack/rdf/common/io/hadoop/RiotFileInputFormat.scala message=Avoid using null line=111 column=35
warning file=/usr/share/tomcat8/.jenkins/jobs/SANSA-Stack/branches/develop/workspace@2/sansa-rdf/sansa-rdf-common/src/main/scala/net/sansa_stack/rdf/common/io/hadoop/RiotFileInputFormat.scala message=Avoid using null line=112 column=36
warning file=/usr/share/tomcat8/.jenkins/jobs/SANSA-Stack/branches/develop/workspace@2/sansa-rdf/sansa-rdf-common/src/main/scala/net/sansa_stack/rdf/common/io/hadoop/RiotFileInputFormat.scala message=Avoid using null line=207 column=32
warning file=/usr/share/tomcat8/.jenkins/jobs/SANSA-Stack/branches/develop/workspace@2/sansa-rdf/sansa-rdf-common/src/main/scala/net/sansa_stack/rdf/common/io/hadoop/RiotFileInputFormat.scala message=Avoid using null line=213 column=24
warning file=/usr/share/tomcat8/.jenkins/jobs/SANSA-Stack/branches/develop/workspace@2/sansa-rdf/sansa-rdf-common/src/main/scala/net/sansa_stack/rdf/common/io/hadoop/RiotFileInputFormat.scala message=Regular expression matched 'println' line=150 column=20
warning file=/usr/share/tomcat8/.jenkins/jobs/SANSA-Stack/branches/develop/workspace@2/sansa-rdf/sansa-rdf-common/src/main/scala/net/sansa_stack/rdf/common/io/hadoop/RiotFileInputFormat.scala message=If block needs braces line=66 column=6
warning file=/usr/share/tomcat8/.jenkins/jobs/SANSA-Stack/branches/develop/workspace@2/sansa-rdf/sansa-rdf-common/src/main/scala/net/sansa_stack/rdf/common/io/hadoop/RiotFileInputFormat.scala message=If block needs braces line=207 column=8
warning file=/usr/share/tomcat8/.jenkins/jobs/SANSA-Stack/branches/develop/workspace@2/sansa-rdf/sansa-rdf-common/src/main/scala/net/sansa_stack/rdf/common/io/hadoop/RiotFileInputFormat.scala message=If block needs braces line=308 column=14
warning file=/usr/share/tomcat8/.jenkins/jobs/SANSA-Stack/branches/develop/workspace@2/sansa-rdf/sansa-rdf-common/src/main/scala/net/sansa_stack/rdf/common/io/hadoop/RiotFileInputFormat.scala message=Use braces in for comprehensions line=230 column=14
warning file=/usr/share/tomcat8/.jenkins/jobs/SANSA-Stack/branches/develop/workspace@2/sansa-rdf/sansa-rdf-common/src/main/scala/net/sansa_stack/rdf/common/io/hadoop/RiotFileInputFormat.scala message=Field name does not match the regular expression '^[a-z][A-Za-z]*$' line=95 column=16
warning file=/usr/share/tomcat8/.jenkins/jobs/SANSA-Stack/branches/develop/workspace@2/sansa-rdf/sansa-rdf-common/src/main/scala/net/sansa_stack/rdf/common/io/hadoop/RiotFileInputFormat.scala message=Field name does not match the regular expression '^[a-z][A-Za-z]*$' line=96 column=16
warning file=/usr/share/tomcat8/.jenkins/jobs/SANSA-Stack/branches/develop/workspace@2/sansa-rdf/sansa-rdf-common/src/main/scala/net/sansa_stack/rdf/common/io/hadoop/RiotFileInputFormat.scala message=Field name does not match the regular expression '^[a-z][A-Za-z]*$' line=98 column=8
warning file=/usr/share/tomcat8/.jenkins/jobs/SANSA-Stack/branches/develop/workspace@2/sansa-rdf/sansa-rdf-common/src/main/scala/net/sansa_stack/rdf/common/io/hadoop/RiotFileInputFormat.scala message=Field name does not match the regular expression '^[a-z][A-Za-z]*$' line=99 column=8
warning file=/usr/share/tomcat8/.jenkins/jobs/SANSA-Stack/branches/develop/workspace@2/sansa-rdf/sansa-rdf-common/src/main/scala/net/sansa_stack/rdf/common/io/hadoop/RiotFileInputFormat.scala message=Argument should be named line=105 column=100
warning file=/usr/share/tomcat8/.jenkins/jobs/SANSA-Stack/branches/develop/workspace@2/sansa-rdf/sansa-rdf-common/src/main/scala/net/sansa_stack/rdf/common/io/hadoop/RiotFileInputFormat.scala message=Argument should be named line=106 column=90
warning file=/usr/share/tomcat8/.jenkins/jobs/SANSA-Stack/branches/develop/workspace@2/sansa-rdf/sansa-rdf-common/src/main/scala/net/sansa_stack/rdf/common/io/hadoop/RiotFileInputFormat.scala message=Argument should be named line=237 column=32
warning file=/usr/share/tomcat8/.jenkins/jobs/SANSA-Stack/branches/develop/workspace@2/sansa-rdf/sansa-rdf-common/src/main/scala/net/sansa_stack/rdf/common/qualityassessment/utils/vocabularies/DQV.scala message=Header does not match expected text line=1
warning file=/usr/share/tomcat8/.jenkins/jobs/SANSA-Stack/branches/develop/workspace@2/sansa-rdf/sansa-rdf-common/src/main/scala/net/sansa_stack/rdf/common/qualityassessment/utils/vocabularies/DQV.scala message=Package name does not match the regular expression '^[a-z][A-Za-z]*$' line=1 column=12
warning file=/usr/share/tomcat8/.jenkins/jobs/SANSA-Stack/branches/develop/workspace@2/sansa-rdf/sansa-rdf-common/src/main/scala/net/sansa_stack/rdf/common/qualityassessment/utils/vocabularies/DQV.scala message=Field name does not match the regular expression '^[A-Z][A-Za-z]*$' line=11 column=6
warning file=/usr/share/tomcat8/.jenkins/jobs/SANSA-Stack/branches/develop/workspace@2/sansa-rdf/sansa-rdf-common/src/main/scala/net/sansa_stack/rdf/common/qualityassessment/utils/vocabularies/DQV.scala message=Field name does not match the regular expression '^[A-Z][A-Za-z]*$' line=12 column=6
warning file=/usr/share/tomcat8/.jenkins/jobs/SANSA-Stack/branches/develop/workspace@2/sansa-rdf/sansa-rdf-common/src/main/scala/net/sansa_stack/rdf/common/qualityassessment/utils/vocabularies/DQV.scala message=Field name does not match the regular expression '^[A-Z][A-Za-z]*$' line=13 column=6
warning file=/usr/share/tomcat8/.jenkins/jobs/SANSA-Stack/branches/develop/workspace@2/sansa-rdf/sansa-rdf-common/src/main/scala/net/sansa_stack/rdf/common/qualityassessment/utils/vocabularies/DQV.scala message=Field name does not match the regular expression '^[A-Z][A-Za-z]*$' line=14 column=6
warning file=/usr/share/tomcat8/.jenkins/jobs/SANSA-Stack/branches/develop/workspace@2/sansa-rdf/sansa-rdf-common/src/main/scala/net/sansa_stack/rdf/common/qualityassessment/utils/vocabularies/DQV.scala message=Field name does not match the regular expression '^[A-Z][A-Za-z]*$' line=15 column=6
warning file=/usr/share/tomcat8/.jenkins/jobs/SANSA-Stack/branches/develop/workspace@2/sansa-rdf/sansa-rdf-common/src/main/scala/net/sansa_stack/rdf/common/qualityassessment/utils/vocabularies/DQV.scala message=Field name does not match the regular expression '^[A-Z][A-Za-z]*$' line=16 column=6
warning file=/usr/share/tomcat8/.jenkins/jobs/SANSA-Stack/branches/develop/workspace@2/sansa-rdf/sansa-rdf-common/src/main/scala/net/sansa_stack/rdf/common/qualityassessment/utils/vocabularies/DQV.scala message=Field name does not match the regular expression '^[A-Z][A-Za-z]*$' line=17 column=6
warning file=/usr/share/tomcat8/.jenkins/jobs/SANSA-Stack/branches/develop/workspace@2/sansa-rdf/sansa-rdf-common/src/main/scala/net/sansa_stack/rdf/common/qualityassessment/utils/vocabularies/DQV.scala message=Field name does not match the regular expression '^[A-Z][A-Za-z]*$' line=18 column=6
warning file=/usr/share/tomcat8/.jenkins/jobs/SANSA-Stack/branches/develop/workspace@2/sansa-rdf/sansa-rdf-common/src/main/scala/net/sansa_stack/rdf/common/qualityassessment/utils/vocabularies/DQV.scala message=Field name does not match the regular expression '^[A-Z][A-Za-z]*$' line=19 column=6
warning file=/usr/share/tomcat8/.jenkins/jobs/SANSA-Stack/branches/develop/workspace@2/sansa-rdf/sansa-rdf-common/src/main/scala/net/sansa_stack/rdf/common/qualityassessment/utils/vocabularies/DQV.scala message=Field name does not match the regular expression '^[A-Z][A-Za-z]*$' line=22 column=6
warning file=/usr/share/tomcat8/.jenkins/jobs/SANSA-Stack/branches/develop/workspace@2/sansa-rdf/sansa-rdf-common/src/main/scala/net/sansa_stack/rdf/common/qualityassessment/utils/vocabularies/DQV.scala message=Field name does not match the regular expression '^[A-Z][A-Za-z]*$' line=23 column=6
warning file=/usr/share/tomcat8/.jenkins/jobs/SANSA-Stack/branches/develop/workspace@2/sansa-rdf/sansa-rdf-common/src/main/scala/net/sansa_stack/rdf/common/qualityassessment/utils/vocabularies/DQV.scala message=Field name does not match the regular expression '^[A-Z][A-Za-z]*$' line=24 column=6
warning file=/usr/share/tomcat8/.jenkins/jobs/SANSA-Stack/branches/develop/workspace@2/sansa-rdf/sansa-rdf-common/src/main/scala/net/sansa_stack/rdf/common/qualityassessment/utils/vocabularies/DQV.scala message=Field name does not match the regular expression '^[A-Z][A-Za-z]*$' line=25 column=6
warning file=/usr/share/tomcat8/.jenkins/jobs/SANSA-Stack/branches/develop/workspace@2/sansa-rdf/sansa-rdf-common/src/main/scala/net/sansa_stack/rdf/common/qualityassessment/utils/vocabularies/DQV.scala message=Field name does not match the regular expression '^[A-Z][A-Za-z]*$' line=26 column=6
warning file=/usr/share/tomcat8/.jenkins/jobs/SANSA-Stack/branches/develop/workspace@2/sansa-rdf/sansa-rdf-common/src/main/scala/net/sansa_stack/rdf/common/qualityassessment/utils/vocabularies/DQV.scala message=Field name does not match the regular expression '^[A-Z][A-Za-z]*$' line=27 column=6
warning file=/usr/share/tomcat8/.jenkins/jobs/SANSA-Stack/branches/develop/workspace@2/sansa-rdf/sansa-rdf-common/src/main/scala/net/sansa_stack/rdf/common/qualityassessment/utils/vocabularies/DQV.scala message=Field name does not match the regular expression '^[A-Z][A-Za-z]*$' line=28 column=6
warning file=/usr/share/tomcat8/.jenkins/jobs/SANSA-Stack/branches/develop/workspace@2/sansa-rdf/sansa-rdf-common/src/main/scala/net/sansa_stack/rdf/common/qualityassessment/utils/vocabularies/DQV.scala message=Field name does not match the regular expression '^[A-Z][A-Za-z]*$' line=29 column=6
warning file=/usr/share/tomcat8/.jenkins/jobs/SANSA-Stack/branches/develop/workspace@2/sansa-rdf/sansa-rdf-common/src/main/scala/net/sansa_stack/rdf/common/qualityassessment/utils/vocabularies/DQV.scala message=Field name does not match the regular expression '^[A-Z][A-Za-z]*$' line=30 column=6
warning file=/usr/share/tomcat8/.jenkins/jobs/SANSA-Stack/branches/develop/workspace@2/sansa-rdf/sansa-rdf-common/src/main/scala/net/sansa_stack/rdf/common/qualityassessment/utils/vocabularies/DQV.scala message=Field name does not match the regular expression '^[A-Z][A-Za-z]*$' line=31 column=6
warning file=/usr/share/tomcat8/.jenkins/jobs/SANSA-Stack/branches/develop/workspace@2/sansa-rdf/sansa-rdf-common/src/main/scala/net/sansa_stack/rdf/common/qualityassessment/utils/vocabularies/DQV.scala message=Field name does not match the regular expression '^[A-Z][A-Za-z]*$' line=34 column=6
warning file=/usr/share/tomcat8/.jenkins/jobs/SANSA-Stack/branches/develop/workspace@2/sansa-rdf/sansa-rdf-common/src/main/scala/net/sansa_stack/rdf/common/qualityassessment/utils/vocabularies/DQV.scala message=Field name does not match the regular expression '^[A-Z][A-Za-z]*$' line=37 column=6
warning file=/usr/share/tomcat8/.jenkins/jobs/SANSA-Stack/branches/develop/workspace@2/sansa-rdf/sansa-rdf-common/src/main/scala/net/sansa_stack/rdf/common/qualityassessment/utils/vocabularies/DQV.scala message=Field name does not match the regular expression '^[A-Z][A-Za-z]*$' line=38 column=6
warning file=/usr/share/tomcat8/.jenkins/jobs/SANSA-Stack/branches/develop/workspace@2/sansa-rdf/sansa-rdf-common/src/main/scala/net/sansa_stack/rdf/common/qualityassessment/utils/vocabularies/DQV.scala message=Field name does not match the regular expression '^[A-Z][A-Za-z]*$' line=40 column=6
warning file=/usr/share/tomcat8/.jenkins/jobs/SANSA-Stack/branches/develop/workspace@2/sansa-rdf/sansa-rdf-common/src/main/scala/net/sansa_stack/rdf/common/qualityassessment/utils/DatasetUtils.scala message=Header does not match expected text line=1
warning file=/usr/share/tomcat8/.jenkins/jobs/SANSA-Stack/branches/develop/workspace@2/sansa-rdf/sansa-rdf-common/src/main/scala/net/sansa_stack/rdf/common/qualityassessment/utils/DatasetUtils.scala message=Package name does not match the regular expression '^[a-z][A-Za-z]*$' line=1 column=12
warning file=/usr/share/tomcat8/.jenkins/jobs/SANSA-Stack/branches/develop/workspace@2/sansa-rdf/sansa-rdf-common/src/main/scala/net/sansa_stack/rdf/common/qualityassessment/utils/DatasetUtils.scala message=Field name does not match the regular expression '^[A-Z][A-Za-z]*$' line=12 column=22
warning file=/usr/share/tomcat8/.jenkins/jobs/SANSA-Stack/branches/develop/workspace@2/sansa-rdf/sansa-rdf-common/src/main/scala/net/sansa_stack/rdf/common/qualityassessment/utils/DatasetUtils.scala message=Field name does not match the regular expression '^[A-Z][A-Za-z]*$' line=14 column=6
warning file=/usr/share/tomcat8/.jenkins/jobs/SANSA-Stack/branches/develop/workspace@2/sansa-rdf/sansa-rdf-common/src/main/scala/net/sansa_stack/rdf/common/qualityassessment/utils/DatasetUtils.scala message=Field name does not match the regular expression '^[A-Z][A-Za-z]*$' line=20 column=6
warning file=/usr/share/tomcat8/.jenkins/jobs/SANSA-Stack/branches/develop/workspace@2/sansa-rdf/sansa-rdf-common/src/main/scala/net/sansa_stack/rdf/common/qualityassessment/utils/DatasetUtils.scala message=Field name does not match the regular expression '^[A-Z][A-Za-z]*$' line=26 column=6
warning file=/usr/share/tomcat8/.jenkins/jobs/SANSA-Stack/branches/develop/workspace@2/sansa-rdf/sansa-rdf-common/src/main/scala/net/sansa_stack/rdf/common/qualityassessment/utils/DatasetUtils.scala message=Field name does not match the regular expression '^[A-Z][A-Za-z]*$' line=32 column=6
warning file=/usr/share/tomcat8/.jenkins/jobs/SANSA-Stack/branches/develop/workspace@2/sansa-rdf/sansa-rdf-common/src/main/scala/net/sansa_stack/rdf/common/qualityassessment/utils/DatasetUtils.scala message=Field name does not match the regular expression '^[A-Z][A-Za-z]*$' line=38 column=6
warning file=/usr/share/tomcat8/.jenkins/jobs/SANSA-Stack/branches/develop/workspace@2/sansa-rdf/sansa-rdf-common/src/main/scala/net/sansa_stack/rdf/common/qualityassessment/utils/DatasetUtils.scala message=Field name does not match the regular expression '^[A-Z][A-Za-z]*$' line=40 column=6
warning file=/usr/share/tomcat8/.jenkins/jobs/SANSA-Stack/branches/develop/workspace@2/sansa-rdf/sansa-rdf-common/src/main/scala/net/sansa_stack/rdf/common/qualityassessment/utils/NodeUtils.scala message=Header does not match expected text line=1
warning file=/usr/share/tomcat8/.jenkins/jobs/SANSA-Stack/branches/develop/workspace@2/sansa-rdf/sansa-rdf-common/src/main/scala/net/sansa_stack/rdf/common/qualityassessment/utils/NodeUtils.scala message=Package name does not match the regular expression '^[a-z][A-Za-z]*$' line=1 column=12
warning file=/usr/share/tomcat8/.jenkins/jobs/SANSA-Stack/branches/develop/workspace@2/sansa-rdf/sansa-rdf-common/src/main/scala/net/sansa_stack/rdf/common/qualityassessment/utils/NodeUtils.scala message=If block needs braces line=96 column=6
warning file=/usr/share/tomcat8/.jenkins/jobs/SANSA-Stack/branches/develop/workspace@2/sansa-rdf/sansa-rdf-common/src/main/scala/net/sansa_stack/rdf/common/qualityassessment/utils/NodeUtils.scala message=Field name does not match the regular expression '^[A-Z][A-Za-z]*$' line=41 column=6
warning file=/usr/share/tomcat8/.jenkins/jobs/SANSA-Stack/branches/develop/workspace@2/sansa-rdf/sansa-rdf-common/src/main/scala/net/sansa_stack/rdf/common/qualityassessment/utils/NodeUtils.scala message=Field name does not match the regular expression '^[A-Z][A-Za-z]*$' line=42 column=6
warning file=/usr/share/tomcat8/.jenkins/jobs/SANSA-Stack/branches/develop/workspace@2/sansa-rdf/sansa-rdf-common/src/main/scala/net/sansa_stack/rdf/common/qualityassessment/utils/NodeUtils.scala message=Field name does not match the regular expression '^[A-Z][A-Za-z]*$' line=63 column=6
warning file=/usr/share/tomcat8/.jenkins/jobs/SANSA-Stack/branches/develop/workspace@2/sansa-rdf/sansa-rdf-common/src/main/scala/net/sansa_stack/rdf/common/qualityassessment/utils/NodeUtils.scala message=Argument should be named line=94 column=48
warning file=/usr/share/tomcat8/.jenkins/jobs/SANSA-Stack/branches/develop/workspace@2/sansa-rdf/sansa-rdf-common/src/main/scala/net/sansa_stack/rdf/common/qualityassessment/utils/NodeUtils.scala message=Argument should be named line=97 column=42
warning file=/usr/share/tomcat8/.jenkins/jobs/SANSA-Stack/branches/develop/workspace@2/sansa-rdf/sansa-rdf-common/src/test/scala/net/sansa_stack/rdf/common/partition/utils/RdfTermTests.scala message=Header does not match expected text line=1
warning file=/usr/share/tomcat8/.jenkins/jobs/SANSA-Stack/branches/develop/workspace@2/sansa-rdf/sansa-rdf-common/src/test/scala/net/sansa_stack/rdf/common/partition/utils/RdfTermTests.scala message=Package name does not match the regular expression '^[a-z][A-Za-z]*$' line=1 column=12
warning file=/usr/share/tomcat8/.jenkins/jobs/SANSA-Stack/branches/develop/workspace@2/sansa-rdf/sansa-rdf-common/src/test/scala/net/sansa_stack/rdf/common/partition/utils/RdfTermTests.scala message=Avoid using null line=23 column=80
warning file=/usr/share/tomcat8/.jenkins/jobs/SANSA-Stack/branches/develop/workspace@2/sansa-rdf/sansa-rdf-common/src/test/scala/net/sansa_stack/rdf/common/partition/utils/RdfTermTests.scala message=Avoid using null line=23 column=86
warning file=/usr/share/tomcat8/.jenkins/jobs/SANSA-Stack/branches/develop/workspace@2/sansa-rdf/sansa-rdf-common/src/test/scala/net/sansa_stack/rdf/common/partition/utils/RdfTermTests.scala message=Argument should be named line=23 column=38
warning file=/usr/share/tomcat8/.jenkins/jobs/SANSA-Stack/branches/develop/workspace@2/sansa-rdf/sansa-rdf-common/src/test/scala/net/sansa_stack/rdf/common/partition/utils/RdfTermTests.scala message=Argument should be named line=23 column=80
warning file=/usr/share/tomcat8/.jenkins/jobs/SANSA-Stack/branches/develop/workspace@2/sansa-rdf/sansa-rdf-common/src/test/scala/net/sansa_stack/rdf/common/partition/utils/RdfTermTests.scala message=Argument should be named line=23 column=86
warning file=/usr/share/tomcat8/.jenkins/jobs/SANSA-Stack/branches/develop/workspace@2/sansa-rdf/sansa-rdf-common/src/test/scala/net/sansa_stack/rdf/common/partition/model/sparqlify/SparqlifyUtils2Tests.scala message=Header does not match expected text line=1
warning file=/usr/share/tomcat8/.jenkins/jobs/SANSA-Stack/branches/develop/workspace@2/sansa-rdf/sansa-rdf-common/src/test/scala/net/sansa_stack/rdf/common/partition/model/sparqlify/SparqlifyUtils2Tests.scala message=File line length exceeds 160 characters line=17
warning file=/usr/share/tomcat8/.jenkins/jobs/SANSA-Stack/branches/develop/workspace@2/sansa-rdf/sansa-rdf-common/src/test/scala/net/sansa_stack/rdf/common/partition/model/sparqlify/SparqlifyUtils2Tests.scala message=Package name does not match the regular expression '^[a-z][A-Za-z]*$' line=1 column=12
warning file=/usr/share/tomcat8/.jenkins/jobs/SANSA-Stack/branches/develop/workspace@2/sansa-rdf/sansa-rdf-common/src/test/scala/net/sansa_stack/rdf/common/partition/core/RdfPartitionerDefaultTests.scala message=Header does not match expected text line=1
warning file=/usr/share/tomcat8/.jenkins/jobs/SANSA-Stack/branches/develop/workspace@2/sansa-rdf/sansa-rdf-common/src/test/scala/net/sansa_stack/rdf/common/partition/core/RdfPartitionerDefaultTests.scala message=Package name does not match the regular expression '^[a-z][A-Za-z]*$' line=1 column=12
warning file=/usr/share/tomcat8/.jenkins/jobs/SANSA-Stack/branches/develop/workspace@2/sansa-rdf/sansa-rdf-common/src/test/scala/net/sansa_stack/rdf/common/partition/core/RdfPartitionerDefaultTests.scala message=Use of TODO/FIXME comment line=154 column=4
warning file=/usr/share/tomcat8/.jenkins/jobs/SANSA-Stack/branches/develop/workspace@2/sansa-rdf/sansa-rdf-common/src/test/scala/net/sansa_stack/rdf/common/partition/core/RdfPartitionerDefaultTests.scala message=Argument should be named line=45 column=57
warning file=/usr/share/tomcat8/.jenkins/jobs/SANSA-Stack/branches/develop/workspace@2/sansa-rdf/sansa-rdf-common/src/test/scala/net/sansa_stack/rdf/common/partition/core/RdfPartitionerDefaultTests.scala message=Argument should be named line=46 column=6
warning file=/usr/share/tomcat8/.jenkins/jobs/SANSA-Stack/branches/develop/workspace@2/sansa-rdf/sansa-rdf-common/src/test/scala/net/sansa_stack/rdf/common/partition/core/RdfPartitionerDefaultTests.scala message=Argument should be named line=46 column=52
warning file=/usr/share/tomcat8/.jenkins/jobs/SANSA-Stack/branches/develop/workspace@2/sansa-rdf/sansa-rdf-common/src/test/scala/net/sansa_stack/rdf/common/partition/core/RdfPartitionerDefaultTests.scala message=Argument should be named line=69 column=50
warning file=/usr/share/tomcat8/.jenkins/jobs/SANSA-Stack/branches/develop/workspace@2/sansa-rdf/sansa-rdf-common/src/test/scala/net/sansa_stack/rdf/common/partition/core/RdfPartitionerDefaultTests.scala message=Argument should be named line=70 column=6
warning file=/usr/share/tomcat8/.jenkins/jobs/SANSA-Stack/branches/develop/workspace@2/sansa-rdf/sansa-rdf-common/src/test/scala/net/sansa_stack/rdf/common/partition/core/RdfPartitionerDefaultTests.scala message=Argument should be named line=70 column=52
warning file=/usr/share/tomcat8/.jenkins/jobs/SANSA-Stack/branches/develop/workspace@2/sansa-rdf/sansa-rdf-common/src/test/scala/net/sansa_stack/rdf/common/partition/core/RdfPartitionerDefaultTests.scala message=Argument should be named line=74 column=99
warning file=/usr/share/tomcat8/.jenkins/jobs/SANSA-Stack/branches/develop/workspace@2/sansa-rdf/sansa-rdf-common/src/test/scala/net/sansa_stack/rdf/common/partition/core/RdfPartitionerDefaultTests.scala message=Argument should be named line=81 column=33
warning file=/usr/share/tomcat8/.jenkins/jobs/SANSA-Stack/branches/develop/workspace@2/sansa-rdf/sansa-rdf-common/src/test/scala/net/sansa_stack/rdf/common/partition/core/RdfPartitionerDefaultTests.scala message=Argument should be named line=129 column=50
warning file=/usr/share/tomcat8/.jenkins/jobs/SANSA-Stack/branches/develop/workspace@2/sansa-rdf/sansa-rdf-common/src/test/scala/net/sansa_stack/rdf/common/partition/core/RdfPartitionerDefaultTests.scala message=Argument should be named line=130 column=6
warning file=/usr/share/tomcat8/.jenkins/jobs/SANSA-Stack/branches/develop/workspace@2/sansa-rdf/sansa-rdf-common/src/test/scala/net/sansa_stack/rdf/common/partition/core/RdfPartitionerDefaultTests.scala message=Argument should be named line=130 column=52
warning file=/usr/share/tomcat8/.jenkins/jobs/SANSA-Stack/branches/develop/workspace@2/sansa-rdf/sansa-rdf-common/src/test/scala/net/sansa_stack/rdf/common/partition/core/RdfPartitionerDefaultTests.scala message=Argument should be named line=134 column=100
warning file=/usr/share/tomcat8/.jenkins/jobs/SANSA-Stack/branches/develop/workspace@2/sansa-rdf/sansa-rdf-common/src/test/scala/net/sansa_stack/rdf/common/partition/core/RdfPartitionerDefaultTests.scala message=Argument should be named line=145 column=50
warning file=/usr/share/tomcat8/.jenkins/jobs/SANSA-Stack/branches/develop/workspace@2/sansa-rdf/sansa-rdf-common/src/test/scala/net/sansa_stack/rdf/common/partition/core/RdfPartitionerDefaultTests.scala message=Argument should be named line=146 column=6
warning file=/usr/share/tomcat8/.jenkins/jobs/SANSA-Stack/branches/develop/workspace@2/sansa-rdf/sansa-rdf-common/src/test/scala/net/sansa_stack/rdf/common/partition/core/RdfPartitionerDefaultTests.scala message=Argument should be named line=146 column=52
warning file=/usr/share/tomcat8/.jenkins/jobs/SANSA-Stack/branches/develop/workspace@2/sansa-rdf/sansa-rdf-common/src/test/scala/net/sansa_stack/rdf/common/partition/core/RdfPartitionerDefaultTests.scala message=Argument should be named line=149 column=105
warning file=/usr/share/tomcat8/.jenkins/jobs/SANSA-Stack/branches/develop/workspace@2/sansa-rdf/sansa-rdf-common/src/test/scala/net/sansa_stack/rdf/common/partition/core/RdfPartitionDefaultTests.scala message=Header does not match expected text line=1
warning file=/usr/share/tomcat8/.jenkins/jobs/SANSA-Stack/branches/develop/workspace@2/sansa-rdf/sansa-rdf-common/src/test/scala/net/sansa_stack/rdf/common/partition/core/RdfPartitionDefaultTests.scala message=Package name does not match the regular expression '^[a-z][A-Za-z]*$' line=1 column=12
warning file=/usr/share/tomcat8/.jenkins/jobs/SANSA-Stack/branches/develop/workspace@2/sansa-rdf/sansa-rdf-common/src/test/scala/net/sansa_stack/rdf/common/partition/core/RdfPartitionDefaultTests.scala message=Field name does not match the regular expression '^[a-z][A-Za-z]*$' line=36 column=8
warning file=/usr/share/tomcat8/.jenkins/jobs/SANSA-Stack/branches/develop/workspace@2/sansa-rdf/sansa-rdf-common/src/test/scala/net/sansa_stack/rdf/common/partition/core/RdfPartitionDefaultTests.scala message=Argument should be named line=32 column=57
warning file=/usr/share/tomcat8/.jenkins/jobs/SANSA-Stack/branches/develop/workspace@2/sansa-rdf/sansa-rdf-common/src/test/scala/net/sansa_stack/rdf/common/partition/layout/TripleLayoutStringLangTests.scala message=Header does not match expected text line=1
warning file=/usr/share/tomcat8/.jenkins/jobs/SANSA-Stack/branches/develop/workspace@2/sansa-rdf/sansa-rdf-common/src/test/scala/net/sansa_stack/rdf/common/partition/layout/TripleLayoutStringLangTests.scala message=Package name does not match the regular expression '^[a-z][A-Za-z]*$' line=1 column=12
warning file=/usr/share/tomcat8/.jenkins/jobs/SANSA-Stack/branches/develop/workspace@2/sansa-rdf/sansa-rdf-common/src/test/scala/net/sansa_stack/rdf/common/partition/layout/TripleLayoutLongTests.scala message=Header does not match expected text line=1
warning file=/usr/share/tomcat8/.jenkins/jobs/SANSA-Stack/branches/develop/workspace@2/sansa-rdf/sansa-rdf-common/src/test/scala/net/sansa_stack/rdf/common/partition/layout/TripleLayoutLongTests.scala message=Package name does not match the regular expression '^[a-z][A-Za-z]*$' line=1 column=12
warning file=/usr/share/tomcat8/.jenkins/jobs/SANSA-Stack/branches/develop/workspace@2/sansa-rdf/sansa-rdf-common/src/test/scala/net/sansa_stack/rdf/common/partition/layout/TripleLayoutDoubleTests.scala message=Header does not match expected text line=1
warning file=/usr/share/tomcat8/.jenkins/jobs/SANSA-Stack/branches/develop/workspace@2/sansa-rdf/sansa-rdf-common/src/test/scala/net/sansa_stack/rdf/common/partition/layout/TripleLayoutDoubleTests.scala message=Package name does not match the regular expression '^[a-z][A-Za-z]*$' line=1 column=12
warning file=/usr/share/tomcat8/.jenkins/jobs/SANSA-Stack/branches/develop/workspace@2/sansa-rdf/sansa-rdf-common/src/test/scala/net/sansa_stack/rdf/common/partition/layout/TripleLayoutStringTests.scala message=Header does not match expected text line=1
warning file=/usr/share/tomcat8/.jenkins/jobs/SANSA-Stack/branches/develop/workspace@2/sansa-rdf/sansa-rdf-common/src/test/scala/net/sansa_stack/rdf/common/partition/layout/TripleLayoutStringTests.scala message=Package name does not match the regular expression '^[a-z][A-Za-z]*$' line=1 column=12
warning file=/usr/share/tomcat8/.jenkins/jobs/SANSA-Stack/branches/develop/workspace@2/sansa-rdf/sansa-rdf-common/src/test/scala/net/sansa_stack/rdf/common/partition/layout/TripleLayoutStringDatatypeTests.scala message=Header does not match expected text line=1
warning file=/usr/share/tomcat8/.jenkins/jobs/SANSA-Stack/branches/develop/workspace@2/sansa-rdf/sansa-rdf-common/src/test/scala/net/sansa_stack/rdf/common/partition/layout/TripleLayoutStringDatatypeTests.scala message=File line length exceeds 160 characters line=20
warning file=/usr/share/tomcat8/.jenkins/jobs/SANSA-Stack/branches/develop/workspace@2/sansa-rdf/sansa-rdf-common/src/test/scala/net/sansa_stack/rdf/common/partition/layout/TripleLayoutStringDatatypeTests.scala message=Package name does not match the regular expression '^[a-z][A-Za-z]*$' line=1 column=12
warning file=/usr/share/tomcat8/.jenkins/jobs/SANSA-Stack/branches/develop/workspace@2/sansa-rdf/sansa-rdf-common/src/test/scala/net/sansa_stack/rdf/common/qualityassessment/utils/QANodeUtilsTests.scala message=Header does not match expected text line=1
warning file=/usr/share/tomcat8/.jenkins/jobs/SANSA-Stack/branches/develop/workspace@2/sansa-rdf/sansa-rdf-common/src/test/scala/net/sansa_stack/rdf/common/qualityassessment/utils/QANodeUtilsTests.scala message=Package name does not match the regular expression '^[a-z][A-Za-z]*$' line=1 column=12
Saving to outputFile=/usr/share/tomcat8/.jenkins/jobs/SANSA-Stack/branches/develop/workspace@2/sansa-rdf/sansa-rdf-common/scalastyle-output.xml
Processed 53 file(s)
Found 0 errors
Found 248 warnings
Found 0 infos
Finished in 2645 ms
[INFO] 
[INFO] --- maven-install-plugin:2.4:install (default-install) @ sansa-rdf-common_2.12 ---
[INFO] Installing /usr/share/tomcat8/.jenkins/jobs/SANSA-Stack/branches/develop/workspace@2/sansa-rdf/sansa-rdf-common/target/sansa-rdf-common_2.12-0.8.0-RC2-SNAPSHOT.jar to /usr/share/tomcat8/.m2/repository/net/sansa-stack/sansa-rdf-common_2.12/0.8.0-RC2-SNAPSHOT/sansa-rdf-common_2.12-0.8.0-RC2-SNAPSHOT.jar
[INFO] Installing /usr/share/tomcat8/.jenkins/jobs/SANSA-Stack/branches/develop/workspace@2/sansa-rdf/sansa-rdf-common/pom.xml to /usr/share/tomcat8/.m2/repository/net/sansa-stack/sansa-rdf-common_2.12/0.8.0-RC2-SNAPSHOT/sansa-rdf-common_2.12-0.8.0-RC2-SNAPSHOT.pom
[INFO] Installing /usr/share/tomcat8/.jenkins/jobs/SANSA-Stack/branches/develop/workspace@2/sansa-rdf/sansa-rdf-common/target/sansa-rdf-common_2.12-0.8.0-RC2-SNAPSHOT-javadoc.jar to /usr/share/tomcat8/.m2/repository/net/sansa-stack/sansa-rdf-common_2.12/0.8.0-RC2-SNAPSHOT/sansa-rdf-common_2.12-0.8.0-RC2-SNAPSHOT-javadoc.jar
[INFO] 
[INFO] --- maven-deploy-plugin:2.7:deploy (default-deploy) @ sansa-rdf-common_2.12 ---
[INFO] Downloading from maven.aksw.snapshots: https://maven.aksw.org/archiva/repository/snapshots/net/sansa-stack/sansa-rdf-common_2.12/0.8.0-RC2-SNAPSHOT/maven-metadata.xml
[INFO] Downloaded from maven.aksw.snapshots: https://maven.aksw.org/archiva/repository/snapshots/net/sansa-stack/sansa-rdf-common_2.12/0.8.0-RC2-SNAPSHOT/maven-metadata.xml (1.0 kB at 38 kB/s)
[INFO] Uploading to maven.aksw.snapshots: https://maven.aksw.org/archiva/repository/snapshots/net/sansa-stack/sansa-rdf-common_2.12/0.8.0-RC2-SNAPSHOT/sansa-rdf-common_2.12-0.8.0-RC2-20220121.200657-78.jar
[INFO] Uploaded to maven.aksw.snapshots: https://maven.aksw.org/archiva/repository/snapshots/net/sansa-stack/sansa-rdf-common_2.12/0.8.0-RC2-SNAPSHOT/sansa-rdf-common_2.12-0.8.0-RC2-20220121.200657-78.jar (219 kB at 1.8 MB/s)
[INFO] Uploading to maven.aksw.snapshots: https://maven.aksw.org/archiva/repository/snapshots/net/sansa-stack/sansa-rdf-common_2.12/0.8.0-RC2-SNAPSHOT/sansa-rdf-common_2.12-0.8.0-RC2-20220121.200657-78.pom
[INFO] Uploaded to maven.aksw.snapshots: https://maven.aksw.org/archiva/repository/snapshots/net/sansa-stack/sansa-rdf-common_2.12/0.8.0-RC2-SNAPSHOT/sansa-rdf-common_2.12-0.8.0-RC2-20220121.200657-78.pom (4.1 kB at 71 kB/s)
[INFO] Downloading from maven.aksw.snapshots: https://maven.aksw.org/archiva/repository/snapshots/net/sansa-stack/sansa-rdf-common_2.12/maven-metadata.xml
[INFO] Downloaded from maven.aksw.snapshots: https://maven.aksw.org/archiva/repository/snapshots/net/sansa-stack/sansa-rdf-common_2.12/maven-metadata.xml (431 B at 54 kB/s)
[INFO] Uploading to maven.aksw.snapshots: https://maven.aksw.org/archiva/repository/snapshots/net/sansa-stack/sansa-rdf-common_2.12/0.8.0-RC2-SNAPSHOT/maven-metadata.xml
[INFO] Uploaded to maven.aksw.snapshots: https://maven.aksw.org/archiva/repository/snapshots/net/sansa-stack/sansa-rdf-common_2.12/0.8.0-RC2-SNAPSHOT/maven-metadata.xml (1.0 kB at 68 kB/s)
[INFO] Uploading to maven.aksw.snapshots: https://maven.aksw.org/archiva/repository/snapshots/net/sansa-stack/sansa-rdf-common_2.12/maven-metadata.xml
[INFO] Uploaded to maven.aksw.snapshots: https://maven.aksw.org/archiva/repository/snapshots/net/sansa-stack/sansa-rdf-common_2.12/maven-metadata.xml (431 B at 29 kB/s)
[INFO] Uploading to maven.aksw.snapshots: https://maven.aksw.org/archiva/repository/snapshots/net/sansa-stack/sansa-rdf-common_2.12/0.8.0-RC2-SNAPSHOT/sansa-rdf-common_2.12-0.8.0-RC2-20220121.200657-78-javadoc.jar
[INFO] Uploaded to maven.aksw.snapshots: https://maven.aksw.org/archiva/repository/snapshots/net/sansa-stack/sansa-rdf-common_2.12/0.8.0-RC2-SNAPSHOT/sansa-rdf-common_2.12-0.8.0-RC2-20220121.200657-78-javadoc.jar (475 kB at 4.6 MB/s)
[INFO] Uploading to maven.aksw.snapshots: https://maven.aksw.org/archiva/repository/snapshots/net/sansa-stack/sansa-rdf-common_2.12/0.8.0-RC2-SNAPSHOT/maven-metadata.xml
[INFO] Uploaded to maven.aksw.snapshots: https://maven.aksw.org/archiva/repository/snapshots/net/sansa-stack/sansa-rdf-common_2.12/0.8.0-RC2-SNAPSHOT/maven-metadata.xml (1.0 kB at 64 kB/s)
[INFO] 
[INFO] ----------------< net.sansa-stack:sansa-rdf-spark_2.12 >----------------
[INFO] Building sansa-rdf-spark_2.12 0.8.0-RC2-SNAPSHOT                 [10/15]
[INFO] --------------------------------[ jar ]---------------------------------
[WARNING] net.minidev:json-smart/maven-metadata.xmlfailed to transfer from http://0.0.0.0/ during a previous attempt. This failure was cached in the local repository and resolution will not be reattempted until the update interval of maven-default-http-blocker has elapsed or updates are forced. Original error: Could not transfer metadata net.minidev:json-smart/maven-metadata.xml from/to maven-default-http-blocker (http://0.0.0.0/): transfer failed for http://0.0.0.0/net/minidev/json-smart/maven-metadata.xml
[WARNING] net.minidev:json-smart/maven-metadata.xmlfailed to transfer from http://0.0.0.0/ during a previous attempt. This failure was cached in the local repository and resolution will not be reattempted until the update interval of maven-default-http-blocker has elapsed or updates are forced. Original error: Could not transfer metadata net.minidev:json-smart/maven-metadata.xml from/to maven-default-http-blocker (http://0.0.0.0/): transfer failed for http://0.0.0.0/net/minidev/json-smart/maven-metadata.xml
[WARNING] net.minidev:json-smart/maven-metadata.xmlfailed to transfer from http://0.0.0.0/ during a previous attempt. This failure was cached in the local repository and resolution will not be reattempted until the update interval of maven-default-http-blocker has elapsed or updates are forced. Original error: Could not transfer metadata net.minidev:json-smart/maven-metadata.xml from/to maven-default-http-blocker (http://0.0.0.0/): transfer failed for http://0.0.0.0/net/minidev/json-smart/maven-metadata.xml
[WARNING] net.minidev:json-smart/maven-metadata.xmlfailed to transfer from http://0.0.0.0/ during a previous attempt. This failure was cached in the local repository and resolution will not be reattempted until the update interval of maven-default-http-blocker has elapsed or updates are forced. Original error: Could not transfer metadata net.minidev:json-smart/maven-metadata.xml from/to maven-default-http-blocker (http://0.0.0.0/): transfer failed for http://0.0.0.0/net/minidev/json-smart/maven-metadata.xml
[INFO] 
[INFO] --- maven-clean-plugin:2.5:clean (default-clean) @ sansa-rdf-spark_2.12 ---
[INFO] Deleting /usr/share/tomcat8/.jenkins/jobs/SANSA-Stack/branches/develop/workspace@2/sansa-rdf/sansa-rdf-spark/target
[INFO] 
[INFO] --- jacoco-maven-plugin:0.8.4:prepare-agent (prepare-agent) @ sansa-rdf-spark_2.12 ---
[INFO] argLine set to -javaagent:/usr/share/tomcat8/.m2/repository/org/jacoco/org.jacoco.agent/0.8.4/org.jacoco.agent-0.8.4-runtime.jar=destfile=/usr/share/tomcat8/.jenkins/jobs/SANSA-Stack/branches/develop/workspace@2/sansa-rdf/sansa-rdf-spark/target/jacoco.exec
[INFO] 
[INFO] --- maven-resources-plugin:3.0.2:resources (default-resources) @ sansa-rdf-spark_2.12 ---
[INFO] Using 'UTF-8' encoding to copy filtered resources.
[INFO] Copying 6 resources
[INFO] 
[INFO] --- scala-maven-plugin:4.5.3:add-source (scala-compile-first) @ sansa-rdf-spark_2.12 ---
[INFO] Add Source directory: /usr/share/tomcat8/.jenkins/jobs/SANSA-Stack/branches/develop/workspace@2/sansa-rdf/sansa-rdf-spark/src/main/scala
[INFO] Add Test Source directory: /usr/share/tomcat8/.jenkins/jobs/SANSA-Stack/branches/develop/workspace@2/sansa-rdf/sansa-rdf-spark/src/test/scala
[INFO] 
[INFO] --- scala-maven-plugin:4.5.3:compile (scala-compile-first) @ sansa-rdf-spark_2.12 ---
[WARNING] net.minidev:json-smart/maven-metadata.xmlfailed to transfer from http://0.0.0.0/ during a previous attempt. This failure was cached in the local repository and resolution will not be reattempted until the update interval of maven-default-http-blocker has elapsed or updates are forced. Original error: Could not transfer metadata net.minidev:json-smart/maven-metadata.xml from/to maven-default-http-blocker (http://0.0.0.0/): transfer failed for http://0.0.0.0/net/minidev/json-smart/maven-metadata.xml
[WARNING] net.minidev:json-smart/maven-metadata.xmlfailed to transfer from http://0.0.0.0/ during a previous attempt. This failure was cached in the local repository and resolution will not be reattempted until the update interval of maven-default-http-blocker has elapsed or updates are forced. Original error: Could not transfer metadata net.minidev:json-smart/maven-metadata.xml from/to maven-default-http-blocker (http://0.0.0.0/): transfer failed for http://0.0.0.0/net/minidev/json-smart/maven-metadata.xml
[WARNING] net.minidev:json-smart/maven-metadata.xmlfailed to transfer from http://0.0.0.0/ during a previous attempt. This failure was cached in the local repository and resolution will not be reattempted until the update interval of maven-default-http-blocker has elapsed or updates are forced. Original error: Could not transfer metadata net.minidev:json-smart/maven-metadata.xml from/to maven-default-http-blocker (http://0.0.0.0/): transfer failed for http://0.0.0.0/net/minidev/json-smart/maven-metadata.xml
[WARNING] net.minidev:json-smart/maven-metadata.xmlfailed to transfer from http://0.0.0.0/ during a previous attempt. This failure was cached in the local repository and resolution will not be reattempted until the update interval of maven-default-http-blocker has elapsed or updates are forced. Original error: Could not transfer metadata net.minidev:json-smart/maven-metadata.xml from/to maven-default-http-blocker (http://0.0.0.0/): transfer failed for http://0.0.0.0/net/minidev/json-smart/maven-metadata.xml
[INFO] Using incremental compilation using Mixed compile order
[INFO] Compiler bridge file: /usr/share/tomcat8/.sbt/1.0/zinc/org.scala-sbt/org.scala-sbt-compiler-bridge_2.12-1.5.5-bin_2.12.11__55.0-1.5.5_20210607T021730.jar
[INFO] compiling 90 Scala sources and 3 Java sources to /usr/share/tomcat8/.jenkins/jobs/SANSA-Stack/branches/develop/workspace@2/sansa-rdf/sansa-rdf-spark/target/classes ...
[WARNING] /usr/share/tomcat8/.jenkins/jobs/SANSA-Stack/branches/develop/workspace@2/sansa-rdf/sansa-rdf-spark/src/main/scala/net/sansa_stack/rdf/spark/io/NTripleReader.scala:18: imported `NTripleReader' is permanently hidden by definition of object NTripleReader in package io
[WARNING] /usr/share/tomcat8/.jenkins/jobs/SANSA-Stack/branches/develop/workspace@2/sansa-rdf/sansa-rdf-spark/src/main/scala/net/sansa_stack/rdf/spark/io/package.scala:263: @deprecated now takes two arguments; see the scaladoc.
[WARNING] /usr/share/tomcat8/.jenkins/jobs/SANSA-Stack/branches/develop/workspace@2/sansa-rdf/sansa-rdf-spark/src/main/scala/net/sansa_stack/rdf/spark/model/graph/GraphOps.scala:301: inferred existential type Array[(Long, _$4)] forSome { type _$4 }, which cannot be expressed by wildcards,  should be enabled
by making the implicit value scala.language.existentials visible.
This can be achieved by adding the import clause 'import scala.language.existentials'
or by setting the compiler option -language:existentials.
See the Scaladoc for value scala.language.existentials for a discussion
why the feature should be explicitly enabled.
[WARNING] /usr/share/tomcat8/.jenkins/jobs/SANSA-Stack/branches/develop/workspace@2/sansa-rdf/sansa-rdf-spark/src/main/scala/net/sansa_stack/rdf/spark/model/graph/GraphOps.scala:302: inferred existential type Array[org.apache.spark.graphx.Edge[_$5]] forSome { type _$5 }, which cannot be expressed by wildcards,  should be enabled
by making the implicit value scala.language.existentials visible.
[WARNING] /usr/share/tomcat8/.jenkins/jobs/SANSA-Stack/branches/develop/workspace@2/sansa-rdf/sansa-rdf-spark/src/main/scala/net/sansa_stack/rdf/spark/rdd/op/RddOfDatasetsOps.scala:74: @deprecated now takes two arguments; see the scaladoc.
[WARNING] /usr/share/tomcat8/.jenkins/jobs/SANSA-Stack/branches/develop/workspace@2/sansa-rdf/sansa-rdf-spark/src/main/scala/net/sansa_stack/rdf/spark/io/NTripleReader.scala:87: method closeQuietly in class IOUtils is deprecated: see corresponding Javadoc for more information.
[WARNING] /usr/share/tomcat8/.jenkins/jobs/SANSA-Stack/branches/develop/workspace@2/sansa-rdf/sansa-rdf-spark/src/main/scala/net/sansa_stack/rdf/spark/io/NTripleReader.scala:196: method createIteratorNTriples in class RiotParsers is deprecated: see corresponding Javadoc for more information.
[WARNING] /usr/share/tomcat8/.jenkins/jobs/SANSA-Stack/branches/develop/workspace@2/sansa-rdf/sansa-rdf-spark/src/main/scala/net/sansa_stack/rdf/spark/io/nquads/NQuadsReader.scala:156: method createIteratorNQuads in class RiotParsers is deprecated: see corresponding Javadoc for more information.
[WARNING] /usr/share/tomcat8/.jenkins/jobs/SANSA-Stack/branches/develop/workspace@2/sansa-rdf/sansa-rdf-spark/src/main/scala/net/sansa_stack/rdf/spark/io/nquads/NQuadsStringToJenaQuad.scala:17: method createIteratorQuads in class RDFDataMgr is deprecated: see corresponding Javadoc for more information.
[WARNING] /usr/share/tomcat8/.jenkins/jobs/SANSA-Stack/branches/develop/workspace@2/sansa-rdf/sansa-rdf-spark/src/main/scala/net/sansa_stack/rdf/spark/io/package.scala:315: method saveAsNQuadsFile in class RDFQuadsWriter is deprecated
[WARNING] /usr/share/tomcat8/.jenkins/jobs/SANSA-Stack/branches/develop/workspace@2/sansa-rdf/sansa-rdf-spark/src/main/scala/net/sansa_stack/rdf/spark/streaming/FileReader.scala:38: method createIteratorTriples in class RDFDataMgr is deprecated: see corresponding Javadoc for more information.
[WARNING] /usr/share/tomcat8/.jenkins/jobs/SANSA-Stack/branches/develop/workspace@2/sansa-rdf/sansa-rdf-spark/src/main/scala/net/sansa_stack/rdf/spark/streaming/KafkaReader.scala:35: method createIteratorTriples in class RDFDataMgr is deprecated: see corresponding Javadoc for more information.
[WARNING] 12 warnings found
[INFO] done compiling
[INFO] compile in 31.7 s
[INFO] 
[INFO] --- maven-compiler-plugin:3.8.1:compile (default-compile) @ sansa-rdf-spark_2.12 ---
[INFO] Changes detected - recompiling the module!
[INFO] Compiling 3 source files to /usr/share/tomcat8/.jenkins/jobs/SANSA-Stack/branches/develop/workspace@2/sansa-rdf/sansa-rdf-spark/target/classes
[INFO] 
[INFO] --- maven-resources-plugin:3.0.2:testResources (default-testResources) @ sansa-rdf-spark_2.12 ---
[INFO] Using 'UTF-8' encoding to copy filtered resources.
[INFO] Copying 12 resources
[INFO] 
[INFO] --- scala-maven-plugin:4.5.3:testCompile (scala-test-compile) @ sansa-rdf-spark_2.12 ---
[WARNING] net.minidev:json-smart/maven-metadata.xmlfailed to transfer from http://0.0.0.0/ during a previous attempt. This failure was cached in the local repository and resolution will not be reattempted until the update interval of maven-default-http-blocker has elapsed or updates are forced. Original error: Could not transfer metadata net.minidev:json-smart/maven-metadata.xml from/to maven-default-http-blocker (http://0.0.0.0/): transfer failed for http://0.0.0.0/net/minidev/json-smart/maven-metadata.xml
[WARNING] net.minidev:json-smart/maven-metadata.xmlfailed to transfer from http://0.0.0.0/ during a previous attempt. This failure was cached in the local repository and resolution will not be reattempted until the update interval of maven-default-http-blocker has elapsed or updates are forced. Original error: Could not transfer metadata net.minidev:json-smart/maven-metadata.xml from/to maven-default-http-blocker (http://0.0.0.0/): transfer failed for http://0.0.0.0/net/minidev/json-smart/maven-metadata.xml
[WARNING] net.minidev:json-smart/maven-metadata.xmlfailed to transfer from http://0.0.0.0/ during a previous attempt. This failure was cached in the local repository and resolution will not be reattempted until the update interval of maven-default-http-blocker has elapsed or updates are forced. Original error: Could not transfer metadata net.minidev:json-smart/maven-metadata.xml from/to maven-default-http-blocker (http://0.0.0.0/): transfer failed for http://0.0.0.0/net/minidev/json-smart/maven-metadata.xml
[WARNING] net.minidev:json-smart/maven-metadata.xmlfailed to transfer from http://0.0.0.0/ during a previous attempt. This failure was cached in the local repository and resolution will not be reattempted until the update interval of maven-default-http-blocker has elapsed or updates are forced. Original error: Could not transfer metadata net.minidev:json-smart/maven-metadata.xml from/to maven-default-http-blocker (http://0.0.0.0/): transfer failed for http://0.0.0.0/net/minidev/json-smart/maven-metadata.xml
[INFO] Using incremental compilation using Mixed compile order
[INFO] Compiler bridge file: /usr/share/tomcat8/.sbt/1.0/zinc/org.scala-sbt/org.scala-sbt-compiler-bridge_2.12-1.5.5-bin_2.12.11__55.0-1.5.5_20210607T021730.jar
[INFO] compiling 29 Scala sources and 4 Java sources to /usr/share/tomcat8/.jenkins/jobs/SANSA-Stack/branches/develop/workspace@2/sansa-rdf/sansa-rdf-spark/target/test-classes ...
[WARNING] /usr/share/tomcat8/.jenkins/jobs/SANSA-Stack/branches/develop/workspace@2/sansa-rdf/sansa-rdf-spark/src/test/scala/net/sansa_stack/rdf/spark/io/RDFSerializationTests.scala:38: A try without a catch or finally is equivalent to putting its body in a block; no exceptions are handled.
[WARNING] : there were 28 deprecation warnings (since 3.1.0); re-run with -deprecation for details
[WARNING] two warnings found
[ERROR] /usr/share/tomcat8/.jenkins/jobs/SANSA-Stack/branches/develop/workspace@2/sansa-rdf/sansa-rdf-spark/src/test/java/net/sansa_stack/rdf/spark/mapper/Cluster.java:3:49:  error: package org.aksw.jena_sparql_api.mapper.annotation does not exist
[ERROR] /usr/share/tomcat8/.jenkins/jobs/SANSA-Stack/branches/develop/workspace@2/sansa-rdf/sansa-rdf-spark/src/test/java/net/sansa_stack/rdf/spark/mapper/Cluster.java:10:1:  error: cannot find symbol
[ERROR] /usr/share/tomcat8/.jenkins/jobs/SANSA-Stack/branches/develop/workspace@2/sansa-rdf/sansa-rdf-spark/src/test/java/net/sansa_stack/rdf/spark/mapper/ClusterEntry.java:3:49:  error: package org.aksw.jena_sparql_api.mapper.annotation does not exist
[ERROR] /usr/share/tomcat8/.jenkins/jobs/SANSA-Stack/branches/develop/workspace@2/sansa-rdf/sansa-rdf-spark/src/test/java/net/sansa_stack/rdf/spark/mapper/ClusterEntry.java:7:1:  error: cannot find symbol
[ERROR] /usr/share/tomcat8/.jenkins/jobs/SANSA-Stack/branches/develop/workspace@2/sansa-rdf/sansa-rdf-spark/src/test/java/net/sansa_stack/rdf/spark/mapper/LevenshteinMatcherConfig.java:3:49:  error: package org.aksw.jena_sparql_api.mapper.annotation does not exist
[ERROR] /usr/share/tomcat8/.jenkins/jobs/SANSA-Stack/branches/develop/workspace@2/sansa-rdf/sansa-rdf-spark/src/test/java/net/sansa_stack/rdf/spark/mapper/LevenshteinMatcherConfig.java:9:1:  error: cannot find symbol
[ERROR] /usr/share/tomcat8/.jenkins/jobs/SANSA-Stack/branches/develop/workspace@2/sansa-rdf/sansa-rdf-spark/src/test/java/net/sansa_stack/rdf/spark/mapper/Person.java:3:49:  error: package org.aksw.jena_sparql_api.mapper.annotation does not exist
[ERROR] /usr/share/tomcat8/.jenkins/jobs/SANSA-Stack/branches/develop/workspace@2/sansa-rdf/sansa-rdf-spark/src/test/java/net/sansa_stack/rdf/spark/mapper/Person.java:8:1:  error: cannot find symbol
[ERROR] /usr/share/tomcat8/.jenkins/jobs/SANSA-Stack/branches/develop/workspace@2/sansa-rdf/sansa-rdf-spark/src/test/java/net/sansa_stack/rdf/spark/mapper/Cluster.java:14:5:  error: cannot find symbol
[ERROR] /usr/share/tomcat8/.jenkins/jobs/SANSA-Stack/branches/develop/workspace@2/sansa-rdf/sansa-rdf-spark/src/test/java/net/sansa_stack/rdf/spark/mapper/ClusterEntry.java:11:5:  error: cannot find symbol
[ERROR] /usr/share/tomcat8/.jenkins/jobs/SANSA-Stack/branches/develop/workspace@2/sansa-rdf/sansa-rdf-spark/src/test/java/net/sansa_stack/rdf/spark/mapper/LevenshteinMatcherConfig.java:14:5:  error: cannot find symbol
[ERROR] /usr/share/tomcat8/.jenkins/jobs/SANSA-Stack/branches/develop/workspace@2/sansa-rdf/sansa-rdf-spark/src/test/java/net/sansa_stack/rdf/spark/mapper/Person.java:10:5:  error: cannot find symbol
[WARNING] javac exited with exit code 1
[INFO] ------------------------------------------------------------------------
[INFO] Reactor Summary for SANSA - Parent 0.8.0-RC2-SNAPSHOT:
[INFO] 
[INFO] SANSA - Parent ..................................... SUCCESS [  3.892 s]
[INFO] sansa-test-resources_2.12 .......................... SUCCESS [  1.002 s]
[INFO] sansa-hadoop-jena .................................. SUCCESS [ 30.214 s]
[INFO] sansa-kryo-jena .................................... SUCCESS [ 13.332 s]
[INFO] sansa-spark-jena-java_2.12 ......................... SUCCESS [ 18.696 s]
[INFO] sansa-resource-metadata ............................ SUCCESS [  0.602 s]
[INFO] sansa-resource-testdata ............................ SUCCESS [  0.475 s]
[INFO] SANSA Stack - RDF Layer - Parent ................... SUCCESS [  0.197 s]
[INFO] sansa-rdf-common_2.12 .............................. SUCCESS [ 47.424 s]
[INFO] sansa-rdf-spark_2.12 ............................... FAILURE [ 59.548 s]
[INFO] SANSA Stack - DataLake Layer - Parent .............. SKIPPED
[INFO] sansa-datalake-spark_2.12 .......................... SKIPPED
[INFO] SANSA Stack - Query Layer - Parent ................. SKIPPED
[INFO] sansa-query-tests_2.12 ............................. SKIPPED
[INFO] sansa-query-spark_2.12 ............................. SKIPPED
[INFO] ------------------------------------------------------------------------
[INFO] BUILD FAILURE
[INFO] ------------------------------------------------------------------------
[INFO] Total time:  02:56 min
[INFO] Finished at: 2022-01-21T21:07:57+01:00
[INFO] ------------------------------------------------------------------------
[ERROR] Failed to execute goal net.alchim31.maven:scala-maven-plugin:4.5.3:testCompile (scala-test-compile) on project sansa-rdf-spark_2.12: Execution scala-test-compile of goal net.alchim31.maven:scala-maven-plugin:4.5.3:testCompile failed. CompileFailed -> [Help 1]
org.apache.maven.lifecycle.LifecycleExecutionException: Failed to execute goal net.alchim31.maven:scala-maven-plugin:4.5.3:testCompile (scala-test-compile) on project sansa-rdf-spark_2.12: Execution scala-test-compile of goal net.alchim31.maven:scala-maven-plugin:4.5.3:testCompile failed.
    at org.apache.maven.lifecycle.internal.MojoExecutor.execute (MojoExecutor.java:215)
    at org.apache.maven.lifecycle.internal.MojoExecutor.execute (MojoExecutor.java:156)
    at org.apache.maven.lifecycle.internal.MojoExecutor.execute (MojoExecutor.java:148)
    at org.apache.maven.lifecycle.internal.LifecycleModuleBuilder.buildProject (LifecycleModuleBuilder.java:117)
    at org.apache.maven.lifecycle.internal.LifecycleModuleBuilder.buildProject (LifecycleModuleBuilder.java:81)
    at org.apache.maven.lifecycle.internal.builder.singlethreaded.SingleThreadedBuilder.build (SingleThreadedBuilder.java:56)
    at org.apache.maven.lifecycle.internal.LifecycleStarter.execute (LifecycleStarter.java:128)
    at org.apache.maven.DefaultMaven.doExecute (DefaultMaven.java:305)
    at org.apache.maven.DefaultMaven.doExecute (DefaultMaven.java:192)
    at org.apache.maven.DefaultMaven.execute (DefaultMaven.java:105)
    at org.apache.maven.cli.MavenCli.execute (MavenCli.java:957)
    at org.apache.maven.cli.MavenCli.doMain (MavenCli.java:289)
    at org.apache.maven.cli.MavenCli.main (MavenCli.java:193)
    at jdk.internal.reflect.NativeMethodAccessorImpl.invoke0 (Native Method)
    at jdk.internal.reflect.NativeMethodAccessorImpl.invoke (NativeMethodAccessorImpl.java:62)
    at jdk.internal.reflect.DelegatingMethodAccessorImpl.invoke (DelegatingMethodAccessorImpl.java:43)
    at java.lang.reflect.Method.invoke (Method.java:566)
    at org.codehaus.plexus.classworlds.launcher.Launcher.launchEnhanced (Launcher.java:282)
    at org.codehaus.plexus.classworlds.launcher.Launcher.launch (Launcher.java:225)
    at org.codehaus.plexus.classworlds.launcher.Launcher.mainWithExitCode (Launcher.java:406)
    at org.codehaus.plexus.classworlds.launcher.Launcher.main (Launcher.java:347)
Caused by: org.apache.maven.plugin.PluginExecutionException: Execution scala-test-compile of goal net.alchim31.maven:scala-maven-plugin:4.5.3:testCompile failed.
    at org.apache.maven.plugin.DefaultBuildPluginManager.executeMojo (DefaultBuildPluginManager.java:148)
    at org.apache.maven.lifecycle.internal.MojoExecutor.execute (MojoExecutor.java:210)
    at org.apache.maven.lifecycle.internal.MojoExecutor.execute (MojoExecutor.java:156)
    at org.apache.maven.lifecycle.internal.MojoExecutor.execute (MojoExecutor.java:148)
    at org.apache.maven.lifecycle.internal.LifecycleModuleBuilder.buildProject (LifecycleModuleBuilder.java:117)
    at org.apache.maven.lifecycle.internal.LifecycleModuleBuilder.buildProject (LifecycleModuleBuilder.java:81)
    at org.apache.maven.lifecycle.internal.builder.singlethreaded.SingleThreadedBuilder.build (SingleThreadedBuilder.java:56)
    at org.apache.maven.lifecycle.internal.LifecycleStarter.execute (LifecycleStarter.java:128)
    at org.apache.maven.DefaultMaven.doExecute (DefaultMaven.java:305)
    at org.apache.maven.DefaultMaven.doExecute (DefaultMaven.java:192)
    at org.apache.maven.DefaultMaven.execute (DefaultMaven.java:105)
    at org.apache.maven.cli.MavenCli.execute (MavenCli.java:957)
    at org.apache.maven.cli.MavenCli.doMain (MavenCli.java:289)
    at org.apache.maven.cli.MavenCli.main (MavenCli.java:193)
    at jdk.internal.reflect.NativeMethodAccessorImpl.invoke0 (Native Method)
    at jdk.internal.reflect.NativeMethodAccessorImpl.invoke (NativeMethodAccessorImpl.java:62)
    at jdk.internal.reflect.DelegatingMethodAccessorImpl.invoke (DelegatingMethodAccessorImpl.java:43)
    at java.lang.reflect.Method.invoke (Method.java:566)
    at org.codehaus.plexus.classworlds.launcher.Launcher.launchEnhanced (Launcher.java:282)
    at org.codehaus.plexus.classworlds.launcher.Launcher.launch (Launcher.java:225)
    at org.codehaus.plexus.classworlds.launcher.Launcher.mainWithExitCode (Launcher.java:406)
    at org.codehaus.plexus.classworlds.launcher.Launcher.main (Launcher.java:347)
Caused by: sbt.internal.inc.CompileFailed
    at sbt.internal.inc.IncrementalCompilerImpl.handleCompilationError (IncrementalCompilerImpl.scala:335)
    at sbt.internal.inc.IncrementalCompilerImpl.compileIncrementally (IncrementalCompilerImpl.scala:420)
    at sbt.internal.inc.IncrementalCompilerImpl.compile (IncrementalCompilerImpl.scala:137)
    at sbt_inc.SbtIncrementalCompiler.compile (SbtIncrementalCompiler.java:179)
    at scala_maven.ScalaCompilerSupport.incrementalCompile (ScalaCompilerSupport.java:361)
    at scala_maven.ScalaCompilerSupport.compile (ScalaCompilerSupport.java:118)
    at scala_maven.ScalaCompilerSupport.doExecute (ScalaCompilerSupport.java:88)
    at scala_maven.ScalaMojoSupport.execute (ScalaMojoSupport.java:305)
    at scala_maven.ScalaTestCompileMojo.execute (ScalaTestCompileMojo.java:50)
    at org.apache.maven.plugin.DefaultBuildPluginManager.executeMojo (DefaultBuildPluginManager.java:137)
    at org.apache.maven.lifecycle.internal.MojoExecutor.execute (MojoExecutor.java:210)
    at org.apache.maven.lifecycle.internal.MojoExecutor.execute (MojoExecutor.java:156)
    at org.apache.maven.lifecycle.internal.MojoExecutor.execute (MojoExecutor.java:148)
    at org.apache.maven.lifecycle.internal.LifecycleModuleBuilder.buildProject (LifecycleModuleBuilder.java:117)
    at org.apache.maven.lifecycle.internal.LifecycleModuleBuilder.buildProject (LifecycleModuleBuilder.java:81)
    at org.apache.maven.lifecycle.internal.builder.singlethreaded.SingleThreadedBuilder.build (SingleThreadedBuilder.java:56)
    at org.apache.maven.lifecycle.internal.LifecycleStarter.execute (LifecycleStarter.java:128)
    at org.apache.maven.DefaultMaven.doExecute (DefaultMaven.java:305)
    at org.apache.maven.DefaultMaven.doExecute (DefaultMaven.java:192)
    at org.apache.maven.DefaultMaven.execute (DefaultMaven.java:105)
    at org.apache.maven.cli.MavenCli.execute (MavenCli.java:957)
    at org.apache.maven.cli.MavenCli.doMain (MavenCli.java:289)
    at org.apache.maven.cli.MavenCli.main (MavenCli.java:193)
    at jdk.internal.reflect.NativeMethodAccessorImpl.invoke0 (Native Method)
    at jdk.internal.reflect.NativeMethodAccessorImpl.invoke (NativeMethodAccessorImpl.java:62)
    at jdk.internal.reflect.DelegatingMethodAccessorImpl.invoke (DelegatingMethodAccessorImpl.java:43)
    at java.lang.reflect.Method.invoke (Method.java:566)
    at org.codehaus.plexus.classworlds.launcher.Launcher.launchEnhanced (Launcher.java:282)
    at org.codehaus.plexus.classworlds.launcher.Launcher.launch (Launcher.java:225)
    at org.codehaus.plexus.classworlds.launcher.Launcher.mainWithExitCode (Launcher.java:406)
    at org.codehaus.plexus.classworlds.launcher.Launcher.main (Launcher.java:347)
[ERROR] 
[ERROR] Re-run Maven using the -X switch to enable full debug logging.
[ERROR] 
[ERROR] For more information about the errors and possible solutions, please read the following articles:
[ERROR] [Help 1] http://cwiki.apache.org/confluence/display/MAVEN/PluginExecutionException
[ERROR] 
[ERROR] After correcting the problems, you can resume the build with the command
[ERROR]   mvn <args> -rf :sansa-rdf-spark_2.12
[Pipeline] }
[Pipeline] // withEnv
[Pipeline] }
[Pipeline] // stage
[Pipeline] }
[Pipeline] // withEnv
[Pipeline] }
[Pipeline] // withEnv
[Pipeline] }
[Pipeline] // withEnv
[Pipeline] }
[Pipeline] // node
[Pipeline] End of Pipeline

GitHub has been notified of this commit’s build result

ERROR: script returned exit code 1
Finished: FAILURE