FailedConsole Output

+ mvn --batch-mode -V -U -e -DskipTests clean deploy -pl :sansa-query-spark_2.12 -am
NOTE: Picked up JDK_JAVA_OPTIONS:  --add-opens=java.base/java.lang=ALL-UNNAMED --add-opens=java.base/java.io=ALL-UNNAMED --add-opens=java.rmi/sun.rmi.transport=ALL-UNNAMED
Apache Maven 3.8.1 (05c21c65bdfed0f71a2f2ada8b84da59348c4c5d)
Maven home: /opt/maven
Java version: 11.0.13, vendor: Ubuntu, runtime: /usr/lib/jvm/java-11-openjdk-amd64
Default locale: en_US, platform encoding: UTF-8
OS name: "linux", version: "5.4.0-1064-azure", arch: "amd64", family: "unix"
[INFO] Error stacktraces are turned on.
[INFO] Scanning for projects...
[WARNING] 
[WARNING] Some problems were encountered while building the effective model for net.sansa-stack:sansa-hadoop-jena:jar:0.8.0-RC2-SNAPSHOT
[WARNING] 'dependencyManagement.dependencies.dependency.(groupId:artifactId:type:classifier)' must be unique: org.aksw.jenax:jenax-analytics-core:jar -> duplicate declaration of version ${jsa.version} @ net.sansa-stack:sansa-parent_2.12:0.8.0-RC2-SNAPSHOT, /usr/share/tomcat8/.jenkins/jobs/SANSA-Stack/branches/develop/workspace/pom.xml, line 588, column 25
[WARNING] 'profiles.profile[root-dir].activation.file.exists' Failed to interpolate file location ${project.basedir}/scalastyle-config.xml for profile root-dir: ${project.basedir} expression not supported during profile activation, use ${basedir} instead @ net.sansa-stack:sansa-parent_2.12:0.8.0-RC2-SNAPSHOT, /usr/share/tomcat8/.jenkins/jobs/SANSA-Stack/branches/develop/workspace/pom.xml
[WARNING] 'profiles.profile[child-dir].activation.file.exists' Failed to interpolate file location ${project.basedir}/../lib for profile child-dir: ${project.basedir} expression not supported during profile activation, use ${basedir} instead @ net.sansa-stack:sansa-parent_2.12:0.8.0-RC2-SNAPSHOT, /usr/share/tomcat8/.jenkins/jobs/SANSA-Stack/branches/develop/workspace/pom.xml
[WARNING] 
[WARNING] Some problems were encountered while building the effective model for net.sansa-stack:sansa-query-spark_2.12:jar:0.8.0-RC2-SNAPSHOT
[WARNING] 'dependencies.dependency.(groupId:artifactId:type:classifier)' must be unique: org.aksw.jenax:jenax-analytics-core:jar -> duplicate declaration of version (?) @ line 116, column 21
[WARNING] 
[WARNING] Some problems were encountered while building the effective model for net.sansa-stack:sansa-query-tests_2.12:jar:0.8.0-RC2-SNAPSHOT
[WARNING] 'build.plugins.plugin.version' for org.scala-tools:maven-scala-plugin is missing. @ line 51, column 21
[WARNING] 
[WARNING] Some problems were encountered while building the effective model for net.sansa-stack:sansa-debian-spark-cli:jar:0.8.0-RC2-SNAPSHOT
[WARNING] 'build.plugins.plugin.version' for org.sonatype.plugins:nexus-staging-maven-plugin is missing. @ line 40, column 21
[WARNING] 'build.plugins.plugin.version' for org.apache.maven.plugins:maven-deploy-plugin is missing. @ line 32, column 21
[WARNING] 
[WARNING] Some problems were encountered while building the effective model for net.sansa-stack:sansa-parent_2.12:pom:0.8.0-RC2-SNAPSHOT
[WARNING] 'dependencyManagement.dependencies.dependency.(groupId:artifactId:type:classifier)' must be unique: org.aksw.jenax:jenax-analytics-core:jar -> duplicate declaration of version ${jsa.version} @ line 588, column 25
[WARNING] 'profiles.profile[root-dir].activation.file.exists' Failed to interpolate file location ${project.basedir}/scalastyle-config.xml for profile root-dir: ${project.basedir} expression not supported during profile activation, use ${basedir} instead
[WARNING] 'profiles.profile[child-dir].activation.file.exists' Failed to interpolate file location ${project.basedir}/../lib for profile child-dir: ${project.basedir} expression not supported during profile activation, use ${basedir} instead
[WARNING] 
[WARNING] It is highly recommended to fix these problems because they threaten the stability of your build.
[WARNING] 
[WARNING] For this reason, future Maven versions might no longer support building such malformed projects.
[WARNING] 
[WARNING] The project net.sansa-stack:sansa-parent_2.12:pom:0.8.0-RC2-SNAPSHOT uses prerequisites which is only intended for maven-plugin projects but not for non maven-plugin projects. For such purposes you should use the maven-enforcer-plugin. See https://maven.apache.org/enforcer/enforcer-rules/requireMavenVersion.html
[INFO] ------------------------------------------------------------------------
[INFO] Reactor Build Order:
[INFO] 
[INFO] SANSA - Parent                                                     [pom]
[INFO] sansa-test-resources_2.12                                          [jar]
[INFO] sansa-hadoop-jena                                                  [jar]
[INFO] sansa-kryo-jena                                                    [jar]
[INFO] sansa-spark-jena-java_2.12                                         [jar]
[INFO] sansa-resource-metadata                                            [jar]
[INFO] sansa-resource-testdata                                            [jar]
[INFO] SANSA Stack - RDF Layer - Parent                                   [pom]
[INFO] sansa-rdf-common_2.12                                              [jar]
[INFO] sansa-rdf-spark_2.12                                               [jar]
[INFO] SANSA Stack - DataLake Layer - Parent                              [pom]
[INFO] sansa-datalake-spark_2.12                                          [jar]
[INFO] SANSA Stack - Query Layer - Parent                                 [pom]
[INFO] sansa-query-tests_2.12                                             [jar]
[INFO] sansa-query-spark_2.12                                             [jar]
[INFO] 
[INFO] -----------------< net.sansa-stack:sansa-parent_2.12 >------------------
[INFO] Building SANSA - Parent 0.8.0-RC2-SNAPSHOT                        [1/15]
[INFO] --------------------------------[ pom ]---------------------------------
[INFO] 
[INFO] --- maven-clean-plugin:2.5:clean (default-clean) @ sansa-parent_2.12 ---
[INFO] 
[INFO] --- jacoco-maven-plugin:0.8.4:prepare-agent (prepare-agent) @ sansa-parent_2.12 ---
[INFO] argLine set to -javaagent:/usr/share/tomcat8/.m2/repository/org/jacoco/org.jacoco.agent/0.8.4/org.jacoco.agent-0.8.4-runtime.jar=destfile=/usr/share/tomcat8/.jenkins/jobs/SANSA-Stack/branches/develop/workspace/target/jacoco.exec
[INFO] 
[INFO] --- scala-maven-plugin:4.5.3:add-source (scala-compile-first) @ sansa-parent_2.12 ---
[INFO] Add Source directory: /usr/share/tomcat8/.jenkins/jobs/SANSA-Stack/branches/develop/workspace/src/main/scala
[INFO] Add Test Source directory: /usr/share/tomcat8/.jenkins/jobs/SANSA-Stack/branches/develop/workspace/src/test/scala
[INFO] 
[INFO] --- scala-maven-plugin:4.5.3:compile (scala-compile-first) @ sansa-parent_2.12 ---
[INFO] compile in 0.0 s
[INFO] No sources to compile
[INFO] 
[INFO] --- scala-maven-plugin:4.5.3:testCompile (scala-test-compile) @ sansa-parent_2.12 ---
[INFO] compile in 0.0 s
[INFO] No sources to compile
[INFO] 
[INFO] --- scalatest-maven-plugin:2.0.2:test (test) @ sansa-parent_2.12 ---
[INFO] Tests are skipped.
[INFO] 
[INFO] --- maven-javadoc-plugin:3.1.1:jar (attach-javadocs) @ sansa-parent_2.12 ---
[INFO] Not executing Javadoc as the project is not a Java classpath-capable package
[INFO] 
[INFO] --- maven-install-plugin:2.4:install (default-install) @ sansa-parent_2.12 ---
[INFO] Installing /usr/share/tomcat8/.jenkins/jobs/SANSA-Stack/branches/develop/workspace/pom.xml to /usr/share/tomcat8/.m2/repository/net/sansa-stack/sansa-parent_2.12/0.8.0-RC2-SNAPSHOT/sansa-parent_2.12-0.8.0-RC2-SNAPSHOT.pom
[INFO] 
[INFO] --- maven-deploy-plugin:2.7:deploy (default-deploy) @ sansa-parent_2.12 ---
[INFO] Downloading from maven.aksw.snapshots: https://maven.aksw.org/archiva/repository/snapshots/net/sansa-stack/sansa-parent_2.12/0.8.0-RC2-SNAPSHOT/maven-metadata.xml
[INFO] Downloaded from maven.aksw.snapshots: https://maven.aksw.org/archiva/repository/snapshots/net/sansa-stack/sansa-parent_2.12/0.8.0-RC2-SNAPSHOT/maven-metadata.xml (374 B at 1.5 kB/s)
[INFO] Uploading to maven.aksw.snapshots: https://maven.aksw.org/archiva/repository/snapshots/net/sansa-stack/sansa-parent_2.12/0.8.0-RC2-SNAPSHOT/sansa-parent_2.12-0.8.0-RC2-20220221.184405-71.pom
[INFO] ------------------------------------------------------------------------
[INFO] Reactor Summary for SANSA - Parent 0.8.0-RC2-SNAPSHOT:
[INFO] 
[INFO] SANSA - Parent ..................................... FAILURE [ 43.420 s]
[INFO] sansa-test-resources_2.12 .......................... SKIPPED
[INFO] sansa-hadoop-jena .................................. SKIPPED
[INFO] sansa-kryo-jena .................................... SKIPPED
[INFO] sansa-spark-jena-java_2.12 ......................... SKIPPED
[INFO] sansa-resource-metadata ............................ SKIPPED
[INFO] sansa-resource-testdata ............................ SKIPPED
[INFO] SANSA Stack - RDF Layer - Parent ................... SKIPPED
[INFO] sansa-rdf-common_2.12 .............................. SKIPPED
[INFO] sansa-rdf-spark_2.12 ............................... SKIPPED
[INFO] SANSA Stack - DataLake Layer - Parent .............. SKIPPED
[INFO] sansa-datalake-spark_2.12 .......................... SKIPPED
[INFO] SANSA Stack - Query Layer - Parent ................. SKIPPED
[INFO] sansa-query-tests_2.12 ............................. SKIPPED
[INFO] sansa-query-spark_2.12 ............................. SKIPPED
[INFO] ------------------------------------------------------------------------
[INFO] BUILD FAILURE
[INFO] ------------------------------------------------------------------------
[INFO] Total time:  43.870 s
[INFO] Finished at: 2022-02-21T19:44:05+01:00
[INFO] ------------------------------------------------------------------------
[ERROR] Failed to execute goal org.apache.maven.plugins:maven-deploy-plugin:2.7:deploy (default-deploy) on project sansa-parent_2.12: Failed to deploy artifacts: Could not transfer artifact net.sansa-stack:sansa-parent_2.12:pom:0.8.0-RC2-20220221.184405-71 from/to maven.aksw.snapshots (https://maven.aksw.org/archiva/repository/snapshots): authentication failed for https://maven.aksw.org/archiva/repository/snapshots/net/sansa-stack/sansa-parent_2.12/0.8.0-RC2-SNAPSHOT/sansa-parent_2.12-0.8.0-RC2-20220221.184405-71.pom, status: 401 Unauthorized -> [Help 1]
org.apache.maven.lifecycle.LifecycleExecutionException: Failed to execute goal org.apache.maven.plugins:maven-deploy-plugin:2.7:deploy (default-deploy) on project sansa-parent_2.12: Failed to deploy artifacts: Could not transfer artifact net.sansa-stack:sansa-parent_2.12:pom:0.8.0-RC2-20220221.184405-71 from/to maven.aksw.snapshots (https://maven.aksw.org/archiva/repository/snapshots): authentication failed for https://maven.aksw.org/archiva/repository/snapshots/net/sansa-stack/sansa-parent_2.12/0.8.0-RC2-SNAPSHOT/sansa-parent_2.12-0.8.0-RC2-20220221.184405-71.pom, status: 401 Unauthorized
    at org.apache.maven.lifecycle.internal.MojoExecutor.execute (MojoExecutor.java:215)
    at org.apache.maven.lifecycle.internal.MojoExecutor.execute (MojoExecutor.java:156)
    at org.apache.maven.lifecycle.internal.MojoExecutor.execute (MojoExecutor.java:148)
    at org.apache.maven.lifecycle.internal.LifecycleModuleBuilder.buildProject (LifecycleModuleBuilder.java:117)
    at org.apache.maven.lifecycle.internal.LifecycleModuleBuilder.buildProject (LifecycleModuleBuilder.java:81)
    at org.apache.maven.lifecycle.internal.builder.singlethreaded.SingleThreadedBuilder.build (SingleThreadedBuilder.java:56)
    at org.apache.maven.lifecycle.internal.LifecycleStarter.execute (LifecycleStarter.java:128)
    at org.apache.maven.DefaultMaven.doExecute (DefaultMaven.java:305)
    at org.apache.maven.DefaultMaven.doExecute (DefaultMaven.java:192)
    at org.apache.maven.DefaultMaven.execute (DefaultMaven.java:105)
    at org.apache.maven.cli.MavenCli.execute (MavenCli.java:957)
    at org.apache.maven.cli.MavenCli.doMain (MavenCli.java:289)
    at org.apache.maven.cli.MavenCli.main (MavenCli.java:193)
    at jdk.internal.reflect.NativeMethodAccessorImpl.invoke0 (Native Method)
    at jdk.internal.reflect.NativeMethodAccessorImpl.invoke (NativeMethodAccessorImpl.java:62)
    at jdk.internal.reflect.DelegatingMethodAccessorImpl.invoke (DelegatingMethodAccessorImpl.java:43)
    at java.lang.reflect.Method.invoke (Method.java:566)
    at org.codehaus.plexus.classworlds.launcher.Launcher.launchEnhanced (Launcher.java:282)
    at org.codehaus.plexus.classworlds.launcher.Launcher.launch (Launcher.java:225)
    at org.codehaus.plexus.classworlds.launcher.Launcher.mainWithExitCode (Launcher.java:406)
    at org.codehaus.plexus.classworlds.launcher.Launcher.main (Launcher.java:347)
Caused by: org.apache.maven.plugin.MojoExecutionException: Failed to deploy artifacts: Could not transfer artifact net.sansa-stack:sansa-parent_2.12:pom:0.8.0-RC2-20220221.184405-71 from/to maven.aksw.snapshots (https://maven.aksw.org/archiva/repository/snapshots): authentication failed for https://maven.aksw.org/archiva/repository/snapshots/net/sansa-stack/sansa-parent_2.12/0.8.0-RC2-SNAPSHOT/sansa-parent_2.12-0.8.0-RC2-20220221.184405-71.pom, status: 401 Unauthorized
    at org.apache.maven.plugin.deploy.DeployMojo.execute (DeployMojo.java:193)
    at org.apache.maven.plugin.DefaultBuildPluginManager.executeMojo (DefaultBuildPluginManager.java:137)
    at org.apache.maven.lifecycle.internal.MojoExecutor.execute (MojoExecutor.java:210)
    at org.apache.maven.lifecycle.internal.MojoExecutor.execute (MojoExecutor.java:156)
    at org.apache.maven.lifecycle.internal.MojoExecutor.execute (MojoExecutor.java:148)
    at org.apache.maven.lifecycle.internal.LifecycleModuleBuilder.buildProject (LifecycleModuleBuilder.java:117)
    at org.apache.maven.lifecycle.internal.LifecycleModuleBuilder.buildProject (LifecycleModuleBuilder.java:81)
    at org.apache.maven.lifecycle.internal.builder.singlethreaded.SingleThreadedBuilder.build (SingleThreadedBuilder.java:56)
    at org.apache.maven.lifecycle.internal.LifecycleStarter.execute (LifecycleStarter.java:128)
    at org.apache.maven.DefaultMaven.doExecute (DefaultMaven.java:305)
    at org.apache.maven.DefaultMaven.doExecute (DefaultMaven.java:192)
    at org.apache.maven.DefaultMaven.execute (DefaultMaven.java:105)
    at org.apache.maven.cli.MavenCli.execute (MavenCli.java:957)
    at org.apache.maven.cli.MavenCli.doMain (MavenCli.java:289)
    at org.apache.maven.cli.MavenCli.main (MavenCli.java:193)
    at jdk.internal.reflect.NativeMethodAccessorImpl.invoke0 (Native Method)
    at jdk.internal.reflect.NativeMethodAccessorImpl.invoke (NativeMethodAccessorImpl.java:62)
    at jdk.internal.reflect.DelegatingMethodAccessorImpl.invoke (DelegatingMethodAccessorImpl.java:43)
    at java.lang.reflect.Method.invoke (Method.java:566)
    at org.codehaus.plexus.classworlds.launcher.Launcher.launchEnhanced (Launcher.java:282)
    at org.codehaus.plexus.classworlds.launcher.Launcher.launch (Launcher.java:225)
    at org.codehaus.plexus.classworlds.launcher.Launcher.mainWithExitCode (Launcher.java:406)
    at org.codehaus.plexus.classworlds.launcher.Launcher.main (Launcher.java:347)
Caused by: org.apache.maven.artifact.deployer.ArtifactDeploymentException: Failed to deploy artifacts: Could not transfer artifact net.sansa-stack:sansa-parent_2.12:pom:0.8.0-RC2-20220221.184405-71 from/to maven.aksw.snapshots (https://maven.aksw.org/archiva/repository/snapshots): authentication failed for https://maven.aksw.org/archiva/repository/snapshots/net/sansa-stack/sansa-parent_2.12/0.8.0-RC2-SNAPSHOT/sansa-parent_2.12-0.8.0-RC2-20220221.184405-71.pom, status: 401 Unauthorized
    at org.apache.maven.artifact.deployer.DefaultArtifactDeployer.deploy (DefaultArtifactDeployer.java:146)
    at org.apache.maven.plugin.deploy.AbstractDeployMojo.deploy (AbstractDeployMojo.java:167)
    at org.apache.maven.plugin.deploy.DeployMojo.execute (DeployMojo.java:149)
    at org.apache.maven.plugin.DefaultBuildPluginManager.executeMojo (DefaultBuildPluginManager.java:137)
    at org.apache.maven.lifecycle.internal.MojoExecutor.execute (MojoExecutor.java:210)
    at org.apache.maven.lifecycle.internal.MojoExecutor.execute (MojoExecutor.java:156)
    at org.apache.maven.lifecycle.internal.MojoExecutor.execute (MojoExecutor.java:148)
    at org.apache.maven.lifecycle.internal.LifecycleModuleBuilder.buildProject (LifecycleModuleBuilder.java:117)
    at org.apache.maven.lifecycle.internal.LifecycleModuleBuilder.buildProject (LifecycleModuleBuilder.java:81)
    at org.apache.maven.lifecycle.internal.builder.singlethreaded.SingleThreadedBuilder.build (SingleThreadedBuilder.java:56)
    at org.apache.maven.lifecycle.internal.LifecycleStarter.execute (LifecycleStarter.java:128)
    at org.apache.maven.DefaultMaven.doExecute (DefaultMaven.java:305)
    at org.apache.maven.DefaultMaven.doExecute (DefaultMaven.java:192)
    at org.apache.maven.DefaultMaven.execute (DefaultMaven.java:105)
    at org.apache.maven.cli.MavenCli.execute (MavenCli.java:957)
    at org.apache.maven.cli.MavenCli.doMain (MavenCli.java:289)
    at org.apache.maven.cli.MavenCli.main (MavenCli.java:193)
    at jdk.internal.reflect.NativeMethodAccessorImpl.invoke0 (Native Method)
    at jdk.internal.reflect.NativeMethodAccessorImpl.invoke (NativeMethodAccessorImpl.java:62)
    at jdk.internal.reflect.DelegatingMethodAccessorImpl.invoke (DelegatingMethodAccessorImpl.java:43)
    at java.lang.reflect.Method.invoke (Method.java:566)
    at org.codehaus.plexus.classworlds.launcher.Launcher.launchEnhanced (Launcher.java:282)
    at org.codehaus.plexus.classworlds.launcher.Launcher.launch (Launcher.java:225)
    at org.codehaus.plexus.classworlds.launcher.Launcher.mainWithExitCode (Launcher.java:406)
    at org.codehaus.plexus.classworlds.launcher.Launcher.main (Launcher.java:347)
Caused by: org.eclipse.aether.deployment.DeploymentException: Failed to deploy artifacts: Could not transfer artifact net.sansa-stack:sansa-parent_2.12:pom:0.8.0-RC2-20220221.184405-71 from/to maven.aksw.snapshots (https://maven.aksw.org/archiva/repository/snapshots): authentication failed for https://maven.aksw.org/archiva/repository/snapshots/net/sansa-stack/sansa-parent_2.12/0.8.0-RC2-SNAPSHOT/sansa-parent_2.12-0.8.0-RC2-20220221.184405-71.pom, status: 401 Unauthorized
    at org.eclipse.aether.internal.impl.DefaultDeployer.deploy (DefaultDeployer.java:302)
    at org.eclipse.aether.internal.impl.DefaultDeployer.deploy (DefaultDeployer.java:213)
    at org.eclipse.aether.internal.impl.DefaultRepositorySystem.deploy (DefaultRepositorySystem.java:386)
    at org.apache.maven.artifact.deployer.DefaultArtifactDeployer.deploy (DefaultArtifactDeployer.java:142)
    at org.apache.maven.plugin.deploy.AbstractDeployMojo.deploy (AbstractDeployMojo.java:167)
    at org.apache.maven.plugin.deploy.DeployMojo.execute (DeployMojo.java:149)
    at org.apache.maven.plugin.DefaultBuildPluginManager.executeMojo (DefaultBuildPluginManager.java:137)
    at org.apache.maven.lifecycle.internal.MojoExecutor.execute (MojoExecutor.java:210)
    at org.apache.maven.lifecycle.internal.MojoExecutor.execute (MojoExecutor.java:156)
    at org.apache.maven.lifecycle.internal.MojoExecutor.execute (MojoExecutor.java:148)
    at org.apache.maven.lifecycle.internal.LifecycleModuleBuilder.buildProject (LifecycleModuleBuilder.java:117)
    at org.apache.maven.lifecycle.internal.LifecycleModuleBuilder.buildProject (LifecycleModuleBuilder.java:81)
    at org.apache.maven.lifecycle.internal.builder.singlethreaded.SingleThreadedBuilder.build (SingleThreadedBuilder.java:56)
    at org.apache.maven.lifecycle.internal.LifecycleStarter.execute (LifecycleStarter.java:128)
    at org.apache.maven.DefaultMaven.doExecute (DefaultMaven.java:305)
    at org.apache.maven.DefaultMaven.doExecute (DefaultMaven.java:192)
    at org.apache.maven.DefaultMaven.execute (DefaultMaven.java:105)
    at org.apache.maven.cli.MavenCli.execute (MavenCli.java:957)
    at org.apache.maven.cli.MavenCli.doMain (MavenCli.java:289)
    at org.apache.maven.cli.MavenCli.main (MavenCli.java:193)
    at jdk.internal.reflect.NativeMethodAccessorImpl.invoke0 (Native Method)
    at jdk.internal.reflect.NativeMethodAccessorImpl.invoke (NativeMethodAccessorImpl.java:62)
    at jdk.internal.reflect.DelegatingMethodAccessorImpl.invoke (DelegatingMethodAccessorImpl.java:43)
    at java.lang.reflect.Method.invoke (Method.java:566)
    at org.codehaus.plexus.classworlds.launcher.Launcher.launchEnhanced (Launcher.java:282)
    at org.codehaus.plexus.classworlds.launcher.Launcher.launch (Launcher.java:225)
    at org.codehaus.plexus.classworlds.launcher.Launcher.mainWithExitCode (Launcher.java:406)
    at org.codehaus.plexus.classworlds.launcher.Launcher.main (Launcher.java:347)
Caused by: org.eclipse.aether.transfer.ArtifactTransferException: Could not transfer artifact net.sansa-stack:sansa-parent_2.12:pom:0.8.0-RC2-20220221.184405-71 from/to maven.aksw.snapshots (https://maven.aksw.org/archiva/repository/snapshots): authentication failed for https://maven.aksw.org/archiva/repository/snapshots/net/sansa-stack/sansa-parent_2.12/0.8.0-RC2-SNAPSHOT/sansa-parent_2.12-0.8.0-RC2-20220221.184405-71.pom, status: 401 Unauthorized
    at org.eclipse.aether.connector.basic.ArtifactTransportListener.transferFailed (ArtifactTransportListener.java:52)
    at org.eclipse.aether.connector.basic.BasicRepositoryConnector$TaskRunner.run (BasicRepositoryConnector.java:369)
    at org.eclipse.aether.connector.basic.BasicRepositoryConnector.put (BasicRepositoryConnector.java:288)
    at org.eclipse.aether.internal.impl.DefaultDeployer.deploy (DefaultDeployer.java:295)
    at org.eclipse.aether.internal.impl.DefaultDeployer.deploy (DefaultDeployer.java:213)
    at org.eclipse.aether.internal.impl.DefaultRepositorySystem.deploy (DefaultRepositorySystem.java:386)
    at org.apache.maven.artifact.deployer.DefaultArtifactDeployer.deploy (DefaultArtifactDeployer.java:142)
    at org.apache.maven.plugin.deploy.AbstractDeployMojo.deploy (AbstractDeployMojo.java:167)
    at org.apache.maven.plugin.deploy.DeployMojo.execute (DeployMojo.java:149)
    at org.apache.maven.plugin.DefaultBuildPluginManager.executeMojo (DefaultBuildPluginManager.java:137)
    at org.apache.maven.lifecycle.internal.MojoExecutor.execute (MojoExecutor.java:210)
    at org.apache.maven.lifecycle.internal.MojoExecutor.execute (MojoExecutor.java:156)
    at org.apache.maven.lifecycle.internal.MojoExecutor.execute (MojoExecutor.java:148)
    at org.apache.maven.lifecycle.internal.LifecycleModuleBuilder.buildProject (LifecycleModuleBuilder.java:117)
    at org.apache.maven.lifecycle.internal.LifecycleModuleBuilder.buildProject (LifecycleModuleBuilder.java:81)
    at org.apache.maven.lifecycle.internal.builder.singlethreaded.SingleThreadedBuilder.build (SingleThreadedBuilder.java:56)
    at org.apache.maven.lifecycle.internal.LifecycleStarter.execute (LifecycleStarter.java:128)
    at org.apache.maven.DefaultMaven.doExecute (DefaultMaven.java:305)
    at org.apache.maven.DefaultMaven.doExecute (DefaultMaven.java:192)
    at org.apache.maven.DefaultMaven.execute (DefaultMaven.java:105)
    at org.apache.maven.cli.MavenCli.execute (MavenCli.java:957)
    at org.apache.maven.cli.MavenCli.doMain (MavenCli.java:289)
    at org.apache.maven.cli.MavenCli.main (MavenCli.java:193)
    at jdk.internal.reflect.NativeMethodAccessorImpl.invoke0 (Native Method)
    at jdk.internal.reflect.NativeMethodAccessorImpl.invoke (NativeMethodAccessorImpl.java:62)
    at jdk.internal.reflect.DelegatingMethodAccessorImpl.invoke (DelegatingMethodAccessorImpl.java:43)
    at java.lang.reflect.Method.invoke (Method.java:566)
    at org.codehaus.plexus.classworlds.launcher.Launcher.launchEnhanced (Launcher.java:282)
    at org.codehaus.plexus.classworlds.launcher.Launcher.launch (Launcher.java:225)
    at org.codehaus.plexus.classworlds.launcher.Launcher.mainWithExitCode (Launcher.java:406)
    at org.codehaus.plexus.classworlds.launcher.Launcher.main (Launcher.java:347)
Caused by: org.apache.maven.wagon.authorization.AuthorizationException: authentication failed for https://maven.aksw.org/archiva/repository/snapshots/net/sansa-stack/sansa-parent_2.12/0.8.0-RC2-SNAPSHOT/sansa-parent_2.12-0.8.0-RC2-20220221.184405-71.pom, status: 401 Unauthorized
    at org.apache.maven.wagon.providers.http.wagon.shared.AbstractHttpClientWagon.put (AbstractHttpClientWagon.java:817)
    at org.apache.maven.wagon.providers.http.wagon.shared.AbstractHttpClientWagon.put (AbstractHttpClientWagon.java:750)
    at org.apache.maven.wagon.providers.http.wagon.shared.AbstractHttpClientWagon.put (AbstractHttpClientWagon.java:722)
    at org.apache.maven.wagon.providers.http.wagon.shared.AbstractHttpClientWagon.put (AbstractHttpClientWagon.java:716)
    at org.apache.maven.wagon.providers.http.wagon.shared.AbstractHttpClientWagon.put (AbstractHttpClientWagon.java:696)
    at org.eclipse.aether.transport.wagon.WagonTransporter$PutTaskRunner.run (WagonTransporter.java:613)
    at org.eclipse.aether.transport.wagon.WagonTransporter.execute (WagonTransporter.java:430)
    at org.eclipse.aether.transport.wagon.WagonTransporter.put (WagonTransporter.java:413)
    at org.eclipse.aether.connector.basic.BasicRepositoryConnector$PutTaskRunner.runTask (BasicRepositoryConnector.java:556)
    at org.eclipse.aether.connector.basic.BasicRepositoryConnector$TaskRunner.run (BasicRepositoryConnector.java:364)
    at org.eclipse.aether.connector.basic.BasicRepositoryConnector.put (BasicRepositoryConnector.java:288)
    at org.eclipse.aether.internal.impl.DefaultDeployer.deploy (DefaultDeployer.java:295)
    at org.eclipse.aether.internal.impl.DefaultDeployer.deploy (DefaultDeployer.java:213)
    at org.eclipse.aether.internal.impl.DefaultRepositorySystem.deploy (DefaultRepositorySystem.java:386)
    at org.apache.maven.artifact.deployer.DefaultArtifactDeployer.deploy (DefaultArtifactDeployer.java:142)
    at org.apache.maven.plugin.deploy.AbstractDeployMojo.deploy (AbstractDeployMojo.java:167)
    at org.apache.maven.plugin.deploy.DeployMojo.execute (DeployMojo.java:149)
    at org.apache.maven.plugin.DefaultBuildPluginManager.executeMojo (DefaultBuildPluginManager.java:137)
    at org.apache.maven.lifecycle.internal.MojoExecutor.execute (MojoExecutor.java:210)
    at org.apache.maven.lifecycle.internal.MojoExecutor.execute (MojoExecutor.java:156)
    at org.apache.maven.lifecycle.internal.MojoExecutor.execute (MojoExecutor.java:148)
    at org.apache.maven.lifecycle.internal.LifecycleModuleBuilder.buildProject (LifecycleModuleBuilder.java:117)
    at org.apache.maven.lifecycle.internal.LifecycleModuleBuilder.buildProject (LifecycleModuleBuilder.java:81)
    at org.apache.maven.lifecycle.internal.builder.singlethreaded.SingleThreadedBuilder.build (SingleThreadedBuilder.java:56)
    at org.apache.maven.lifecycle.internal.LifecycleStarter.execute (LifecycleStarter.java:128)
    at org.apache.maven.DefaultMaven.doExecute (DefaultMaven.java:305)
    at org.apache.maven.DefaultMaven.doExecute (DefaultMaven.java:192)
    at org.apache.maven.DefaultMaven.execute (DefaultMaven.java:105)
    at org.apache.maven.cli.MavenCli.execute (MavenCli.java:957)
    at org.apache.maven.cli.MavenCli.doMain (MavenCli.java:289)
    at org.apache.maven.cli.MavenCli.main (MavenCli.java:193)
    at jdk.internal.reflect.NativeMethodAccessorImpl.invoke0 (Native Method)
    at jdk.internal.reflect.NativeMethodAccessorImpl.invoke (NativeMethodAccessorImpl.java:62)
    at jdk.internal.reflect.DelegatingMethodAccessorImpl.invoke (DelegatingMethodAccessorImpl.java:43)
    at java.lang.reflect.Method.invoke (Method.java:566)
    at org.codehaus.plexus.classworlds.launcher.Launcher.launchEnhanced (Launcher.java:282)
    at org.codehaus.plexus.classworlds.launcher.Launcher.launch (Launcher.java:225)
    at org.codehaus.plexus.classworlds.launcher.Launcher.mainWithExitCode (Launcher.java:406)
    at org.codehaus.plexus.classworlds.launcher.Launcher.main (Launcher.java:347)
[ERROR] 
[ERROR] Re-run Maven using the -X switch to enable full debug logging.
[ERROR] 
[ERROR] For more information about the errors and possible solutions, please read the following articles:
[ERROR] [Help 1] http://cwiki.apache.org/confluence/display/MAVEN/MojoExecutionException