FailedConsole Output

+ mvn --batch-mode -V -U -e -DskipTests clean deploy -pl :sansa-query-spark_2.12 -am
Apache Maven 3.8.1 (05c21c65bdfed0f71a2f2ada8b84da59348c4c5d)
Maven home: /opt/maven
Java version: 1.8.0_292, vendor: Private Build, runtime: /usr/lib/jvm/java-8-openjdk-amd64/jre
Default locale: en_US, platform encoding: UTF-8
OS name: "linux", version: "5.4.0-1046-azure", arch: "amd64", family: "unix"
[INFO] Error stacktraces are turned on.
[INFO] Scanning for projects...
[WARNING] 
[WARNING] Some problems were encountered while building the effective model for net.sansa-stack:sansa-hadoop-jena:jar:0.8.0-RC2-SNAPSHOT
[WARNING] 'profiles.profile[root-dir].activation.file.exists' Failed to interpolate file location ${project.basedir}/scalastyle-config.xml for profile root-dir: ${project.basedir} expression not supported during profile activation, use ${basedir} instead @ net.sansa-stack:sansa-parent_2.12:0.8.0-RC2-SNAPSHOT, /usr/share/tomcat8/.jenkins/jobs/SANSA-Stack/branches/feature-SVA-.kolosm.lt-timestamp/workspace/pom.xml
[WARNING] 'profiles.profile[child-dir].activation.file.exists' Failed to interpolate file location ${project.basedir}/../lib for profile child-dir: ${project.basedir} expression not supported during profile activation, use ${basedir} instead @ net.sansa-stack:sansa-parent_2.12:0.8.0-RC2-SNAPSHOT, /usr/share/tomcat8/.jenkins/jobs/SANSA-Stack/branches/feature-SVA-.kolosm.lt-timestamp/workspace/pom.xml
[WARNING] 
[WARNING] Some problems were encountered while building the effective model for net.sansa-stack:sansa-query-tests_2.12:jar:0.8.0-RC2-SNAPSHOT
[WARNING] 'build.plugins.plugin.version' for org.scala-tools:maven-scala-plugin is missing. @ line 51, column 21
[WARNING] 
[WARNING] Some problems were encountered while building the effective model for net.sansa-stack:sansa-debian-spark-cli:jar:0.8.0-RC2-SNAPSHOT
[WARNING] 'build.plugins.plugin.version' for org.sonatype.plugins:nexus-staging-maven-plugin is missing. @ line 40, column 21
[WARNING] 'build.plugins.plugin.version' for org.apache.maven.plugins:maven-deploy-plugin is missing. @ line 32, column 21
[WARNING] 
[WARNING] Some problems were encountered while building the effective model for net.sansa-stack:sansa-parent_2.12:pom:0.8.0-RC2-SNAPSHOT
[WARNING] 'profiles.profile[root-dir].activation.file.exists' Failed to interpolate file location ${project.basedir}/scalastyle-config.xml for profile root-dir: ${project.basedir} expression not supported during profile activation, use ${basedir} instead
[WARNING] 'profiles.profile[child-dir].activation.file.exists' Failed to interpolate file location ${project.basedir}/../lib for profile child-dir: ${project.basedir} expression not supported during profile activation, use ${basedir} instead
[WARNING] 
[WARNING] It is highly recommended to fix these problems because they threaten the stability of your build.
[WARNING] 
[WARNING] For this reason, future Maven versions might no longer support building such malformed projects.
[WARNING] 
[WARNING] The project net.sansa-stack:sansa-parent_2.12:pom:0.8.0-RC2-SNAPSHOT uses prerequisites which is only intended for maven-plugin projects but not for non maven-plugin projects. For such purposes you should use the maven-enforcer-plugin. See https://maven.apache.org/enforcer/enforcer-rules/requireMavenVersion.html
[INFO] ------------------------------------------------------------------------
[INFO] Reactor Build Order:
[INFO] 
[INFO] SANSA - Parent                                                     [pom]
[INFO] sansa-test-resources_2.12                                          [jar]
[INFO] sansa-hadoop-jena                                                  [jar]
[INFO] sansa-kryo-jena                                                    [jar]
[INFO] sansa-resource-metadata                                            [jar]
[INFO] sansa-resource-testdata                                            [jar]
[INFO] SANSA Stack - RDF Layer - Parent                                   [pom]
[INFO] sansa-rdf-common_2.12                                              [jar]
[INFO] sansa-rdf-spark_2.12                                               [jar]
[INFO] SANSA Stack - DataLake Layer - Parent                              [pom]
[INFO] sansa-datalake-spark_2.12                                          [jar]
[INFO] SANSA Stack - Query Layer - Parent                                 [pom]
[INFO] sansa-query-tests_2.12                                             [jar]
[INFO] sansa-query-spark_2.12                                             [jar]
[INFO] 
[INFO] -----------------< net.sansa-stack:sansa-parent_2.12 >------------------
[INFO] Building SANSA - Parent 0.8.0-RC2-SNAPSHOT                        [1/14]
[INFO] --------------------------------[ pom ]---------------------------------
[INFO] 
[INFO] --- maven-clean-plugin:2.5:clean (default-clean) @ sansa-parent_2.12 ---
[INFO] 
[INFO] --- jacoco-maven-plugin:0.8.4:prepare-agent (prepare-agent) @ sansa-parent_2.12 ---
[INFO] argLine set to -javaagent:/usr/share/tomcat8/.m2/repository/org/jacoco/org.jacoco.agent/0.8.4/org.jacoco.agent-0.8.4-runtime.jar=destfile=/usr/share/tomcat8/.jenkins/jobs/SANSA-Stack/branches/feature-SVA-.kolosm.lt-timestamp/workspace/target/jacoco.exec
[INFO] 
[INFO] --- scala-maven-plugin:4.4.0:add-source (scala-compile-first) @ sansa-parent_2.12 ---
[INFO] Add Source directory: /usr/share/tomcat8/.jenkins/jobs/SANSA-Stack/branches/feature-SVA-.kolosm.lt-timestamp/workspace/src/main/scala
[INFO] Add Test Source directory: /usr/share/tomcat8/.jenkins/jobs/SANSA-Stack/branches/feature-SVA-.kolosm.lt-timestamp/workspace/src/test/scala
[INFO] 
[INFO] --- scala-maven-plugin:4.4.0:compile (scala-compile-first) @ sansa-parent_2.12 ---
[INFO] compile in 0.0 s
[INFO] No sources to compile
[INFO] 
[INFO] --- scala-maven-plugin:4.4.0:testCompile (scala-test-compile) @ sansa-parent_2.12 ---
[INFO] compile in 0.0 s
[INFO] No sources to compile
[INFO] 
[INFO] --- scalatest-maven-plugin:2.0.2:test (test) @ sansa-parent_2.12 ---
[INFO] Tests are skipped.
[INFO] 
[INFO] >>> scala-maven-plugin:4.4.0:doc-jar (attach-javadocs) > generate-sources @ sansa-parent_2.12 >>>
[INFO] 
[INFO] --- jacoco-maven-plugin:0.8.4:prepare-agent (prepare-agent) @ sansa-parent_2.12 ---
[INFO] argLine set to -javaagent:/usr/share/tomcat8/.m2/repository/org/jacoco/org.jacoco.agent/0.8.4/org.jacoco.agent-0.8.4-runtime.jar=destfile=/usr/share/tomcat8/.jenkins/jobs/SANSA-Stack/branches/feature-SVA-.kolosm.lt-timestamp/workspace/target/jacoco.exec
[INFO] 
[INFO] <<< scala-maven-plugin:4.4.0:doc-jar (attach-javadocs) < generate-sources @ sansa-parent_2.12 <<<
[INFO] 
[INFO] 
[INFO] --- scala-maven-plugin:4.4.0:doc-jar (attach-javadocs) @ sansa-parent_2.12 ---
[INFO] No source files found
[INFO] 
[INFO] --- maven-javadoc-plugin:3.1.1:jar (attach-javadocs) @ sansa-parent_2.12 ---
[INFO] Not executing Javadoc as the project is not a Java classpath-capable package
[INFO] 
[INFO] --- maven-install-plugin:2.4:install (default-install) @ sansa-parent_2.12 ---
[INFO] Installing /usr/share/tomcat8/.jenkins/jobs/SANSA-Stack/branches/feature-SVA-.kolosm.lt-timestamp/workspace/pom.xml to /usr/share/tomcat8/.m2/repository/net/sansa-stack/sansa-parent_2.12/0.8.0-RC2-SNAPSHOT/sansa-parent_2.12-0.8.0-RC2-SNAPSHOT.pom
[INFO] 
[INFO] --- maven-deploy-plugin:2.7:deploy (default-deploy) @ sansa-parent_2.12 ---
[INFO] Downloading from maven.aksw.snapshots: https://maven.aksw.org/archiva/repository/snapshots/net/sansa-stack/sansa-parent_2.12/0.8.0-RC2-SNAPSHOT/maven-metadata.xml
[INFO] Downloaded from maven.aksw.snapshots: https://maven.aksw.org/archiva/repository/snapshots/net/sansa-stack/sansa-parent_2.12/0.8.0-RC2-SNAPSHOT/maven-metadata.xml (374 B at 330 B/s)
[INFO] Uploading to maven.aksw.snapshots: https://maven.aksw.org/archiva/repository/snapshots/net/sansa-stack/sansa-parent_2.12/0.8.0-RC2-SNAPSHOT/sansa-parent_2.12-0.8.0-RC2-20210531.131239-23.pom
[INFO] Uploaded to maven.aksw.snapshots: https://maven.aksw.org/archiva/repository/snapshots/net/sansa-stack/sansa-parent_2.12/0.8.0-RC2-SNAPSHOT/sansa-parent_2.12-0.8.0-RC2-20210531.131239-23.pom (96 kB at 37 kB/s)
[INFO] Downloading from maven.aksw.snapshots: https://maven.aksw.org/archiva/repository/snapshots/net/sansa-stack/sansa-parent_2.12/maven-metadata.xml
[INFO] Downloaded from maven.aksw.snapshots: https://maven.aksw.org/archiva/repository/snapshots/net/sansa-stack/sansa-parent_2.12/maven-metadata.xml (427 B at 36 kB/s)
[INFO] Uploading to maven.aksw.snapshots: https://maven.aksw.org/archiva/repository/snapshots/net/sansa-stack/sansa-parent_2.12/0.8.0-RC2-SNAPSHOT/maven-metadata.xml
[INFO] Uploaded to maven.aksw.snapshots: https://maven.aksw.org/archiva/repository/snapshots/net/sansa-stack/sansa-parent_2.12/0.8.0-RC2-SNAPSHOT/maven-metadata.xml (619 B at 28 kB/s)
[INFO] Uploading to maven.aksw.snapshots: https://maven.aksw.org/archiva/repository/snapshots/net/sansa-stack/sansa-parent_2.12/maven-metadata.xml
[INFO] Uploaded to maven.aksw.snapshots: https://maven.aksw.org/archiva/repository/snapshots/net/sansa-stack/sansa-parent_2.12/maven-metadata.xml (426 B at 22 kB/s)
[INFO] 
[INFO] -------------< net.sansa-stack:sansa-test-resources_2.12 >--------------
[INFO] Building sansa-test-resources_2.12 0.8.0-RC2-SNAPSHOT             [2/14]
[INFO] --------------------------------[ jar ]---------------------------------
[INFO] 
[INFO] --- maven-clean-plugin:2.5:clean (default-clean) @ sansa-test-resources_2.12 ---
[INFO] 
[INFO] --- jacoco-maven-plugin:0.8.4:prepare-agent (prepare-agent) @ sansa-test-resources_2.12 ---
[INFO] argLine set to -javaagent:/usr/share/tomcat8/.m2/repository/org/jacoco/org.jacoco.agent/0.8.4/org.jacoco.agent-0.8.4-runtime.jar=destfile=/usr/share/tomcat8/.jenkins/jobs/SANSA-Stack/branches/feature-SVA-.kolosm.lt-timestamp/workspace/sansa-test-resources/target/jacoco.exec
[INFO] 
[INFO] --- maven-resources-plugin:3.0.2:resources (default-resources) @ sansa-test-resources_2.12 ---
[INFO] Using 'UTF-8' encoding to copy filtered resources.
[INFO] Copying 1 resource
[INFO] 
[INFO] --- scala-maven-plugin:4.4.0:add-source (scala-compile-first) @ sansa-test-resources_2.12 ---
[INFO] Add Source directory: /usr/share/tomcat8/.jenkins/jobs/SANSA-Stack/branches/feature-SVA-.kolosm.lt-timestamp/workspace/sansa-test-resources/src/main/scala
[INFO] Add Test Source directory: /usr/share/tomcat8/.jenkins/jobs/SANSA-Stack/branches/feature-SVA-.kolosm.lt-timestamp/workspace/sansa-test-resources/src/test/scala
[INFO] 
[INFO] --- scala-maven-plugin:4.4.0:compile (scala-compile-first) @ sansa-test-resources_2.12 ---
[INFO] compile in 0.0 s
[INFO] No sources to compile
[INFO] 
[INFO] --- maven-compiler-plugin:3.8.1:compile (default-compile) @ sansa-test-resources_2.12 ---
[INFO] No sources to compile
[INFO] 
[INFO] --- maven-resources-plugin:3.0.2:testResources (default-testResources) @ sansa-test-resources_2.12 ---
[INFO] Using 'UTF-8' encoding to copy filtered resources.
[INFO] skip non existing resourceDirectory /usr/share/tomcat8/.jenkins/jobs/SANSA-Stack/branches/feature-SVA-.kolosm.lt-timestamp/workspace/sansa-test-resources/src/test/resources
[INFO] 
[INFO] --- scala-maven-plugin:4.4.0:testCompile (scala-test-compile) @ sansa-test-resources_2.12 ---
[INFO] compile in 0.0 s
[INFO] No sources to compile
[INFO] 
[INFO] --- maven-compiler-plugin:3.8.1:testCompile (default-testCompile) @ sansa-test-resources_2.12 ---
[INFO] No sources to compile
[INFO] 
[INFO] --- maven-surefire-plugin:2.20.1:test (default-test) @ sansa-test-resources_2.12 ---
[INFO] Tests are skipped.
[INFO] 
[INFO] --- scalatest-maven-plugin:2.0.2:test (test) @ sansa-test-resources_2.12 ---
[INFO] Tests are skipped.
[INFO] 
[INFO] --- maven-jar-plugin:3.2.0:jar (default-jar) @ sansa-test-resources_2.12 ---
[INFO] Building jar: /usr/share/tomcat8/.jenkins/jobs/SANSA-Stack/branches/feature-SVA-.kolosm.lt-timestamp/workspace/sansa-test-resources/target/sansa-test-resources_2.12-0.8.0-RC2-SNAPSHOT.jar
[INFO] 
[INFO] >>> scala-maven-plugin:4.4.0:doc-jar (attach-javadocs) > generate-sources @ sansa-test-resources_2.12 >>>
[INFO] 
[INFO] --- jacoco-maven-plugin:0.8.4:prepare-agent (prepare-agent) @ sansa-test-resources_2.12 ---
[INFO] argLine set to -javaagent:/usr/share/tomcat8/.m2/repository/org/jacoco/org.jacoco.agent/0.8.4/org.jacoco.agent-0.8.4-runtime.jar=destfile=/usr/share/tomcat8/.jenkins/jobs/SANSA-Stack/branches/feature-SVA-.kolosm.lt-timestamp/workspace/sansa-test-resources/target/jacoco.exec
[INFO] 
[INFO] <<< scala-maven-plugin:4.4.0:doc-jar (attach-javadocs) < generate-sources @ sansa-test-resources_2.12 <<<
[INFO] 
[INFO] 
[INFO] --- scala-maven-plugin:4.4.0:doc-jar (attach-javadocs) @ sansa-test-resources_2.12 ---
[INFO] No source files found
[INFO] 
[INFO] --- maven-javadoc-plugin:3.1.1:jar (attach-javadocs) @ sansa-test-resources_2.12 ---
[INFO] 
[INFO] --- maven-install-plugin:2.4:install (default-install) @ sansa-test-resources_2.12 ---
[INFO] Installing /usr/share/tomcat8/.jenkins/jobs/SANSA-Stack/branches/feature-SVA-.kolosm.lt-timestamp/workspace/sansa-test-resources/target/sansa-test-resources_2.12-0.8.0-RC2-SNAPSHOT.jar to /usr/share/tomcat8/.m2/repository/net/sansa-stack/sansa-test-resources_2.12/0.8.0-RC2-SNAPSHOT/sansa-test-resources_2.12-0.8.0-RC2-SNAPSHOT.jar
[INFO] Installing /usr/share/tomcat8/.jenkins/jobs/SANSA-Stack/branches/feature-SVA-.kolosm.lt-timestamp/workspace/sansa-test-resources/pom.xml to /usr/share/tomcat8/.m2/repository/net/sansa-stack/sansa-test-resources_2.12/0.8.0-RC2-SNAPSHOT/sansa-test-resources_2.12-0.8.0-RC2-SNAPSHOT.pom
[INFO] 
[INFO] --- maven-deploy-plugin:2.7:deploy (default-deploy) @ sansa-test-resources_2.12 ---
[INFO] Downloading from maven.aksw.snapshots: https://maven.aksw.org/archiva/repository/snapshots/net/sansa-stack/sansa-test-resources_2.12/0.8.0-RC2-SNAPSHOT/maven-metadata.xml
[INFO] Downloaded from maven.aksw.snapshots: https://maven.aksw.org/archiva/repository/snapshots/net/sansa-stack/sansa-test-resources_2.12/0.8.0-RC2-SNAPSHOT/maven-metadata.xml (382 B at 2.9 kB/s)
[INFO] Uploading to maven.aksw.snapshots: https://maven.aksw.org/archiva/repository/snapshots/net/sansa-stack/sansa-test-resources_2.12/0.8.0-RC2-SNAPSHOT/sansa-test-resources_2.12-0.8.0-RC2-20210531.131245-23.jar
[INFO] Uploaded to maven.aksw.snapshots: https://maven.aksw.org/archiva/repository/snapshots/net/sansa-stack/sansa-test-resources_2.12/0.8.0-RC2-SNAPSHOT/sansa-test-resources_2.12-0.8.0-RC2-20210531.131245-23.jar (1.9 kB at 8.4 kB/s)
[INFO] Uploading to maven.aksw.snapshots: https://maven.aksw.org/archiva/repository/snapshots/net/sansa-stack/sansa-test-resources_2.12/0.8.0-RC2-SNAPSHOT/sansa-test-resources_2.12-0.8.0-RC2-20210531.131245-23.pom
[INFO] Uploaded to maven.aksw.snapshots: https://maven.aksw.org/archiva/repository/snapshots/net/sansa-stack/sansa-test-resources_2.12/0.8.0-RC2-SNAPSHOT/sansa-test-resources_2.12-0.8.0-RC2-20210531.131245-23.pom (718 B at 24 kB/s)
[INFO] Downloading from maven.aksw.snapshots: https://maven.aksw.org/archiva/repository/snapshots/net/sansa-stack/sansa-test-resources_2.12/maven-metadata.xml
[INFO] Downloaded from maven.aksw.snapshots: https://maven.aksw.org/archiva/repository/snapshots/net/sansa-stack/sansa-test-resources_2.12/maven-metadata.xml (385 B at 32 kB/s)
[INFO] Uploading to maven.aksw.snapshots: https://maven.aksw.org/archiva/repository/snapshots/net/sansa-stack/sansa-test-resources_2.12/0.8.0-RC2-SNAPSHOT/maven-metadata.xml
[INFO] Uploaded to maven.aksw.snapshots: https://maven.aksw.org/archiva/repository/snapshots/net/sansa-stack/sansa-test-resources_2.12/0.8.0-RC2-SNAPSHOT/maven-metadata.xml (805 B at 42 kB/s)
[INFO] Uploading to maven.aksw.snapshots: https://maven.aksw.org/archiva/repository/snapshots/net/sansa-stack/sansa-test-resources_2.12/maven-metadata.xml
[INFO] Uploaded to maven.aksw.snapshots: https://maven.aksw.org/archiva/repository/snapshots/net/sansa-stack/sansa-test-resources_2.12/maven-metadata.xml (384 B at 24 kB/s)
[INFO] 
[INFO] -----------------< net.sansa-stack:sansa-hadoop-jena >------------------
[INFO] Building sansa-hadoop-jena 0.8.0-RC2-SNAPSHOT                     [3/14]
[INFO] --------------------------------[ jar ]---------------------------------
[INFO] Downloading from oss-sonatype-releases: https://oss.sonatype.org/content/repositories/releases/net/minidev/json-smart/maven-metadata.xml
[INFO] Downloading from maven.aksw.internal: https://maven.aksw.org/archiva/repository/internal/net/minidev/json-smart/maven-metadata.xml
[INFO] Downloading from maven.aksw.snapshots: https://maven.aksw.org/archiva/repository/snapshots/net/minidev/json-smart/maven-metadata.xml
[INFO] Downloading from central: https://repo.maven.apache.org/maven2/net/minidev/json-smart/maven-metadata.xml
[INFO] Downloaded from central: https://repo.maven.apache.org/maven2/net/minidev/json-smart/maven-metadata.xml (1.1 kB at 4.4 kB/s)
[INFO] Downloading from apache.snapshots.https: https://repository.apache.org/content/repositories/snapshots/net/minidev/json-smart/maven-metadata.xml
[INFO] Downloading from maven-default-http-blocker: http://0.0.0.0/net/minidev/json-smart/maven-metadata.xml
[INFO] Downloaded from oss-sonatype-releases: https://oss.sonatype.org/content/repositories/releases/net/minidev/json-smart/maven-metadata.xml (0 B at 0 B/s)
[INFO] Downloaded from maven.aksw.internal: https://maven.aksw.org/archiva/repository/internal/net/minidev/json-smart/maven-metadata.xml (0 B at 0 B/s)
[WARNING] Could not transfer metadata net.minidev:json-smart/maven-metadata.xml from/to maven-default-http-blocker (http://0.0.0.0/): transfer failed for http://0.0.0.0/net/minidev/json-smart/maven-metadata.xml
[INFO] Downloading from maven.aksw.snapshots: https://maven.aksw.org/archiva/repository/snapshots/org/aksw/jena-sparql-api/jena-sparql-api-rx/3.17.0-2-SNAPSHOT/maven-metadata.xml
[INFO] Downloaded from maven.aksw.snapshots: https://maven.aksw.org/archiva/repository/snapshots/org/aksw/jena-sparql-api/jena-sparql-api-rx/3.17.0-2-SNAPSHOT/maven-metadata.xml (382 B at 3.2 kB/s)
[INFO] Downloading from maven.aksw.snapshots: https://maven.aksw.org/archiva/repository/snapshots/org/aksw/jena-sparql-api/jena-sparql-api-parent/3.17.0-2-SNAPSHOT/maven-metadata.xml
[INFO] Downloaded from maven.aksw.snapshots: https://maven.aksw.org/archiva/repository/snapshots/org/aksw/jena-sparql-api/jena-sparql-api-parent/3.17.0-2-SNAPSHOT/maven-metadata.xml (386 B at 11 kB/s)
[INFO] Downloading from maven-default-http-blocker: http://0.0.0.0/org/aksw/jena-sparql-api/jena-sparql-api-concepts/3.17.0-2-SNAPSHOT/maven-metadata.xml
[INFO] Downloading from maven.aksw.snapshots: https://maven.aksw.org/archiva/repository/snapshots/org/aksw/jena-sparql-api/jena-sparql-api-concepts/3.17.0-2-SNAPSHOT/maven-metadata.xml
[INFO] Downloaded from maven.aksw.snapshots: https://maven.aksw.org/archiva/repository/snapshots/org/aksw/jena-sparql-api/jena-sparql-api-concepts/3.17.0-2-SNAPSHOT/maven-metadata.xml (388 B at 2.6 kB/s)
[WARNING] Could not transfer metadata org.aksw.jena-sparql-api:jena-sparql-api-concepts:3.17.0-2-SNAPSHOT/maven-metadata.xml from/to maven-default-http-blocker (http://0.0.0.0/): transfer failed for http://0.0.0.0/org/aksw/jena-sparql-api/jena-sparql-api-concepts/3.17.0-2-SNAPSHOT/maven-metadata.xml
[WARNING] org.aksw.jena-sparql-api:jena-sparql-api-concepts:3.17.0-2-SNAPSHOT/maven-metadata.xmlfailed to transfer from http://0.0.0.0/ during a previous attempt. This failure was cached in the local repository and resolution will not be reattempted until the update interval of maven-default-http-blocker has elapsed or updates are forced. Original error: Could not transfer metadata org.aksw.jena-sparql-api:jena-sparql-api-concepts:3.17.0-2-SNAPSHOT/maven-metadata.xml from/to maven-default-http-blocker (http://0.0.0.0/): transfer failed for http://0.0.0.0/org/aksw/jena-sparql-api/jena-sparql-api-concepts/3.17.0-2-SNAPSHOT/maven-metadata.xml
[INFO] Downloading from maven.aksw.snapshots: https://maven.aksw.org/archiva/repository/snapshots/org/aksw/jena-sparql-api/jena-sparql-api-stmt/3.17.0-2-SNAPSHOT/maven-metadata.xml
[INFO] Downloading from maven-default-http-blocker: http://0.0.0.0/org/aksw/jena-sparql-api/jena-sparql-api-stmt/3.17.0-2-SNAPSHOT/maven-metadata.xml
[INFO] Downloaded from maven.aksw.snapshots: https://maven.aksw.org/archiva/repository/snapshots/org/aksw/jena-sparql-api/jena-sparql-api-stmt/3.17.0-2-SNAPSHOT/maven-metadata.xml (384 B at 3.3 kB/s)
[WARNING] Could not transfer metadata org.aksw.jena-sparql-api:jena-sparql-api-stmt:3.17.0-2-SNAPSHOT/maven-metadata.xml from/to maven-default-http-blocker (http://0.0.0.0/): transfer failed for http://0.0.0.0/org/aksw/jena-sparql-api/jena-sparql-api-stmt/3.17.0-2-SNAPSHOT/maven-metadata.xml
[WARNING] org.aksw.jena-sparql-api:jena-sparql-api-stmt:3.17.0-2-SNAPSHOT/maven-metadata.xmlfailed to transfer from http://0.0.0.0/ during a previous attempt. This failure was cached in the local repository and resolution will not be reattempted until the update interval of maven-default-http-blocker has elapsed or updates are forced. Original error: Could not transfer metadata org.aksw.jena-sparql-api:jena-sparql-api-stmt:3.17.0-2-SNAPSHOT/maven-metadata.xml from/to maven-default-http-blocker (http://0.0.0.0/): transfer failed for http://0.0.0.0/org/aksw/jena-sparql-api/jena-sparql-api-stmt/3.17.0-2-SNAPSHOT/maven-metadata.xml
[INFO] Downloading from maven.aksw.snapshots: https://maven.aksw.org/archiva/repository/snapshots/org/aksw/jena-sparql-api/jena-sparql-api-resources/3.17.0-2-SNAPSHOT/maven-metadata.xml
[INFO] Downloading from maven-default-http-blocker: http://0.0.0.0/org/aksw/jena-sparql-api/jena-sparql-api-resources/3.17.0-2-SNAPSHOT/maven-metadata.xml
[INFO] Downloaded from maven.aksw.snapshots: https://maven.aksw.org/archiva/repository/snapshots/org/aksw/jena-sparql-api/jena-sparql-api-resources/3.17.0-2-SNAPSHOT/maven-metadata.xml (1.0 kB at 85 kB/s)
[WARNING] Could not transfer metadata org.aksw.jena-sparql-api:jena-sparql-api-resources:3.17.0-2-SNAPSHOT/maven-metadata.xml from/to maven-default-http-blocker (http://0.0.0.0/): transfer failed for http://0.0.0.0/org/aksw/jena-sparql-api/jena-sparql-api-resources/3.17.0-2-SNAPSHOT/maven-metadata.xml
[WARNING] org.aksw.jena-sparql-api:jena-sparql-api-resources:3.17.0-2-SNAPSHOT/maven-metadata.xmlfailed to transfer from http://0.0.0.0/ during a previous attempt. This failure was cached in the local repository and resolution will not be reattempted until the update interval of maven-default-http-blocker has elapsed or updates are forced. Original error: Could not transfer metadata org.aksw.jena-sparql-api:jena-sparql-api-resources:3.17.0-2-SNAPSHOT/maven-metadata.xml from/to maven-default-http-blocker (http://0.0.0.0/): transfer failed for http://0.0.0.0/org/aksw/jena-sparql-api/jena-sparql-api-resources/3.17.0-2-SNAPSHOT/maven-metadata.xml
[INFO] Downloading from maven.aksw.snapshots: https://maven.aksw.org/archiva/repository/snapshots/org/aksw/jena-sparql-api/jena-sparql-api-utils/3.17.0-2-SNAPSHOT/maven-metadata.xml
[INFO] Downloading from maven-default-http-blocker: http://0.0.0.0/org/aksw/jena-sparql-api/jena-sparql-api-utils/3.17.0-2-SNAPSHOT/maven-metadata.xml
[INFO] Downloaded from maven.aksw.snapshots: https://maven.aksw.org/archiva/repository/snapshots/org/aksw/jena-sparql-api/jena-sparql-api-utils/3.17.0-2-SNAPSHOT/maven-metadata.xml (1.0 kB at 93 kB/s)
[WARNING] Could not transfer metadata org.aksw.jena-sparql-api:jena-sparql-api-utils:3.17.0-2-SNAPSHOT/maven-metadata.xml from/to maven-default-http-blocker (http://0.0.0.0/): transfer failed for http://0.0.0.0/org/aksw/jena-sparql-api/jena-sparql-api-utils/3.17.0-2-SNAPSHOT/maven-metadata.xml
[WARNING] org.aksw.jena-sparql-api:jena-sparql-api-utils:3.17.0-2-SNAPSHOT/maven-metadata.xmlfailed to transfer from http://0.0.0.0/ during a previous attempt. This failure was cached in the local repository and resolution will not be reattempted until the update interval of maven-default-http-blocker has elapsed or updates are forced. Original error: Could not transfer metadata org.aksw.jena-sparql-api:jena-sparql-api-utils:3.17.0-2-SNAPSHOT/maven-metadata.xml from/to maven-default-http-blocker (http://0.0.0.0/): transfer failed for http://0.0.0.0/org/aksw/jena-sparql-api/jena-sparql-api-utils/3.17.0-2-SNAPSHOT/maven-metadata.xml
[INFO] Downloading from maven.aksw.snapshots: https://maven.aksw.org/archiva/repository/snapshots/org/aksw/jena-sparql-api/jena-sparql-api-collections/3.17.0-2-SNAPSHOT/maven-metadata.xml
[INFO] Downloading from maven-default-http-blocker: http://0.0.0.0/org/aksw/jena-sparql-api/jena-sparql-api-collections/3.17.0-2-SNAPSHOT/maven-metadata.xml
[INFO] Downloaded from maven.aksw.snapshots: https://maven.aksw.org/archiva/repository/snapshots/org/aksw/jena-sparql-api/jena-sparql-api-collections/3.17.0-2-SNAPSHOT/maven-metadata.xml (391 B at 3.4 kB/s)
[WARNING] Could not transfer metadata org.aksw.jena-sparql-api:jena-sparql-api-collections:3.17.0-2-SNAPSHOT/maven-metadata.xml from/to maven-default-http-blocker (http://0.0.0.0/): transfer failed for http://0.0.0.0/org/aksw/jena-sparql-api/jena-sparql-api-collections/3.17.0-2-SNAPSHOT/maven-metadata.xml
[WARNING] org.aksw.jena-sparql-api:jena-sparql-api-collections:3.17.0-2-SNAPSHOT/maven-metadata.xmlfailed to transfer from http://0.0.0.0/ during a previous attempt. This failure was cached in the local repository and resolution will not be reattempted until the update interval of maven-default-http-blocker has elapsed or updates are forced. Original error: Could not transfer metadata org.aksw.jena-sparql-api:jena-sparql-api-collections:3.17.0-2-SNAPSHOT/maven-metadata.xml from/to maven-default-http-blocker (http://0.0.0.0/): transfer failed for http://0.0.0.0/org/aksw/jena-sparql-api/jena-sparql-api-collections/3.17.0-2-SNAPSHOT/maven-metadata.xml
[INFO] Downloading from maven.aksw.snapshots: https://maven.aksw.org/archiva/repository/snapshots/org/aksw/jena-sparql-api/jena-sparql-api-mapper-annotations/3.17.0-2-SNAPSHOT/maven-metadata.xml
[INFO] Downloading from maven-default-http-blocker: http://0.0.0.0/org/aksw/jena-sparql-api/jena-sparql-api-mapper-annotations/3.17.0-2-SNAPSHOT/maven-metadata.xml
[INFO] Downloaded from maven.aksw.snapshots: https://maven.aksw.org/archiva/repository/snapshots/org/aksw/jena-sparql-api/jena-sparql-api-mapper-annotations/3.17.0-2-SNAPSHOT/maven-metadata.xml (398 B at 36 kB/s)
[WARNING] Could not transfer metadata org.aksw.jena-sparql-api:jena-sparql-api-mapper-annotations:3.17.0-2-SNAPSHOT/maven-metadata.xml from/to maven-default-http-blocker (http://0.0.0.0/): transfer failed for http://0.0.0.0/org/aksw/jena-sparql-api/jena-sparql-api-mapper-annotations/3.17.0-2-SNAPSHOT/maven-metadata.xml
[WARNING] org.aksw.jena-sparql-api:jena-sparql-api-mapper-annotations:3.17.0-2-SNAPSHOT/maven-metadata.xmlfailed to transfer from http://0.0.0.0/ during a previous attempt. This failure was cached in the local repository and resolution will not be reattempted until the update interval of maven-default-http-blocker has elapsed or updates are forced. Original error: Could not transfer metadata org.aksw.jena-sparql-api:jena-sparql-api-mapper-annotations:3.17.0-2-SNAPSHOT/maven-metadata.xml from/to maven-default-http-blocker (http://0.0.0.0/): transfer failed for http://0.0.0.0/org/aksw/jena-sparql-api/jena-sparql-api-mapper-annotations/3.17.0-2-SNAPSHOT/maven-metadata.xml
[INFO] Downloading from maven.aksw.snapshots: https://maven.aksw.org/archiva/repository/snapshots/org/aksw/jena-sparql-api/jena-sparql-api-io-core/3.17.0-2-SNAPSHOT/maven-metadata.xml
[INFO] Downloaded from maven.aksw.snapshots: https://maven.aksw.org/archiva/repository/snapshots/org/aksw/jena-sparql-api/jena-sparql-api-io-core/3.17.0-2-SNAPSHOT/maven-metadata.xml (387 B at 3.4 kB/s)
[INFO] 
[INFO] --- maven-clean-plugin:2.5:clean (default-clean) @ sansa-hadoop-jena ---
[INFO] 
[INFO] --- jacoco-maven-plugin:0.8.4:prepare-agent (prepare-agent) @ sansa-hadoop-jena ---
[INFO] argLine set to -javaagent:/usr/share/tomcat8/.m2/repository/org/jacoco/org.jacoco.agent/0.8.4/org.jacoco.agent-0.8.4-runtime.jar=destfile=/usr/share/tomcat8/.jenkins/jobs/SANSA-Stack/branches/feature-SVA-.kolosm.lt-timestamp/workspace/sansa-hadoop-jena/target/jacoco.exec
[INFO] 
[INFO] --- maven-resources-plugin:3.0.2:resources (default-resources) @ sansa-hadoop-jena ---
[INFO] Using 'UTF-8' encoding to copy filtered resources.
[INFO] skip non existing resourceDirectory /usr/share/tomcat8/.jenkins/jobs/SANSA-Stack/branches/feature-SVA-.kolosm.lt-timestamp/workspace/sansa-hadoop-jena/src/main/resources
[INFO] 
[INFO] --- scala-maven-plugin:4.4.0:add-source (scala-compile-first) @ sansa-hadoop-jena ---
[INFO] Add Source directory: /usr/share/tomcat8/.jenkins/jobs/SANSA-Stack/branches/feature-SVA-.kolosm.lt-timestamp/workspace/sansa-hadoop-jena/src/main/scala
[INFO] Add Test Source directory: /usr/share/tomcat8/.jenkins/jobs/SANSA-Stack/branches/feature-SVA-.kolosm.lt-timestamp/workspace/sansa-hadoop-jena/src/test/scala
[INFO] 
[INFO] --- scala-maven-plugin:4.4.0:compile (scala-compile-first) @ sansa-hadoop-jena ---
[WARNING] net.minidev:json-smart/maven-metadata.xmlfailed to transfer from http://0.0.0.0/ during a previous attempt. This failure was cached in the local repository and resolution will not be reattempted until the update interval of maven-default-http-blocker has elapsed or updates are forced. Original error: Could not transfer metadata net.minidev:json-smart/maven-metadata.xml from/to maven-default-http-blocker (http://0.0.0.0/): transfer failed for http://0.0.0.0/net/minidev/json-smart/maven-metadata.xml
[INFO] Using incremental compilation using Mixed compile order
[INFO] Compiler bridge file: /usr/share/tomcat8/.sbt/1.0/zinc/org.scala-sbt/org.scala-sbt-compiler-bridge_2.12-1.3.5-bin_2.12.11__52.0-1.3.5_20200330T000931.jar
[INFO] Compiling 24 Java sources to /usr/share/tomcat8/.jenkins/jobs/SANSA-Stack/branches/feature-SVA-.kolosm.lt-timestamp/workspace/sansa-hadoop-jena/target/classes ...
[WARNING] Unexpected javac output: Note: CAL10NAnnotationProcessor 0.8.1 initialized
warning: Supported source version 'RELEASE_5' from annotation processor 'ch.qos.cal10n.verifier.processor.CAL10NAnnotationProcessor' less than -source '1.8'
Note: Some input files use unchecked or unsafe operations.
Note: Recompile with -Xlint:unchecked for details.
1 warning.
[INFO] NoPosition: Note: CAL10NAnnotationProcessor 0.8.1 initialized
[INFO] Done compiling.
[INFO] compile in 18.9 s
[INFO] 
[INFO] --- maven-compiler-plugin:3.8.1:compile (default-compile) @ sansa-hadoop-jena ---
[INFO] Changes detected - recompiling the module!
[INFO] Compiling 24 source files to /usr/share/tomcat8/.jenkins/jobs/SANSA-Stack/branches/feature-SVA-.kolosm.lt-timestamp/workspace/sansa-hadoop-jena/target/classes
[INFO] /usr/share/tomcat8/.jenkins/jobs/SANSA-Stack/branches/feature-SVA-.kolosm.lt-timestamp/workspace/sansa-hadoop-jena/src/main/java/net/sansa_stack/hadoop/generic/RecordReaderGenericBase.java: Some input files use unchecked or unsafe operations.
[INFO] /usr/share/tomcat8/.jenkins/jobs/SANSA-Stack/branches/feature-SVA-.kolosm.lt-timestamp/workspace/sansa-hadoop-jena/src/main/java/net/sansa_stack/hadoop/generic/RecordReaderGenericBase.java: Recompile with -Xlint:unchecked for details.
[INFO] 
[INFO] --- maven-resources-plugin:3.0.2:testResources (default-testResources) @ sansa-hadoop-jena ---
[INFO] Using 'UTF-8' encoding to copy filtered resources.
[INFO] skip non existing resourceDirectory /usr/share/tomcat8/.jenkins/jobs/SANSA-Stack/branches/feature-SVA-.kolosm.lt-timestamp/workspace/sansa-hadoop-jena/src/test/resources
[INFO] 
[INFO] --- scala-maven-plugin:4.4.0:testCompile (scala-test-compile) @ sansa-hadoop-jena ---
[WARNING] net.minidev:json-smart/maven-metadata.xmlfailed to transfer from http://0.0.0.0/ during a previous attempt. This failure was cached in the local repository and resolution will not be reattempted until the update interval of maven-default-http-blocker has elapsed or updates are forced. Original error: Could not transfer metadata net.minidev:json-smart/maven-metadata.xml from/to maven-default-http-blocker (http://0.0.0.0/): transfer failed for http://0.0.0.0/net/minidev/json-smart/maven-metadata.xml
[INFO] Using incremental compilation using Mixed compile order
[INFO] Compiler bridge file: /usr/share/tomcat8/.sbt/1.0/zinc/org.scala-sbt/org.scala-sbt-compiler-bridge_2.12-1.3.5-bin_2.12.11__52.0-1.3.5_20200330T000931.jar
[INFO] Compiling 5 Java sources to /usr/share/tomcat8/.jenkins/jobs/SANSA-Stack/branches/feature-SVA-.kolosm.lt-timestamp/workspace/sansa-hadoop-jena/target/test-classes ...
[WARNING] Unexpected javac output: Note: CAL10NAnnotationProcessor 0.8.1 initialized
warning: Supported source version 'RELEASE_5' from annotation processor 'ch.qos.cal10n.verifier.processor.CAL10NAnnotationProcessor' less than -source '1.8'
1 warning.
[INFO] NoPosition: Note: CAL10NAnnotationProcessor 0.8.1 initialized
[INFO] Done compiling.
[INFO] compile in 4.0 s
[INFO] 
[INFO] --- maven-compiler-plugin:3.8.1:testCompile (default-testCompile) @ sansa-hadoop-jena ---
[INFO] Changes detected - recompiling the module!
[INFO] Compiling 5 source files to /usr/share/tomcat8/.jenkins/jobs/SANSA-Stack/branches/feature-SVA-.kolosm.lt-timestamp/workspace/sansa-hadoop-jena/target/test-classes
[INFO] 
[INFO] --- maven-surefire-plugin:2.20.1:test (default-test) @ sansa-hadoop-jena ---
[INFO] Tests are skipped.
[INFO] 
[INFO] --- scalatest-maven-plugin:2.0.2:test (test) @ sansa-hadoop-jena ---
[INFO] Tests are skipped.
[INFO] 
[INFO] --- maven-jar-plugin:3.2.0:jar (default-jar) @ sansa-hadoop-jena ---
[INFO] Building jar: /usr/share/tomcat8/.jenkins/jobs/SANSA-Stack/branches/feature-SVA-.kolosm.lt-timestamp/workspace/sansa-hadoop-jena/target/sansa-hadoop-jena-0.8.0-RC2-SNAPSHOT.jar
[INFO] 
[INFO] >>> scala-maven-plugin:4.4.0:doc-jar (attach-javadocs) > generate-sources @ sansa-hadoop-jena >>>
[WARNING] net.minidev:json-smart/maven-metadata.xmlfailed to transfer from http://0.0.0.0/ during a previous attempt. This failure was cached in the local repository and resolution will not be reattempted until the update interval of maven-default-http-blocker has elapsed or updates are forced. Original error: Could not transfer metadata net.minidev:json-smart/maven-metadata.xml from/to maven-default-http-blocker (http://0.0.0.0/): transfer failed for http://0.0.0.0/net/minidev/json-smart/maven-metadata.xml
[INFO] 
[INFO] --- jacoco-maven-plugin:0.8.4:prepare-agent (prepare-agent) @ sansa-hadoop-jena ---
[INFO] argLine set to -javaagent:/usr/share/tomcat8/.m2/repository/org/jacoco/org.jacoco.agent/0.8.4/org.jacoco.agent-0.8.4-runtime.jar=destfile=/usr/share/tomcat8/.jenkins/jobs/SANSA-Stack/branches/feature-SVA-.kolosm.lt-timestamp/workspace/sansa-hadoop-jena/target/jacoco.exec
[INFO] 
[INFO] <<< scala-maven-plugin:4.4.0:doc-jar (attach-javadocs) < generate-sources @ sansa-hadoop-jena <<<
[INFO] 
[INFO] 
[INFO] --- scala-maven-plugin:4.4.0:doc-jar (attach-javadocs) @ sansa-hadoop-jena ---
[WARNING] net.minidev:json-smart/maven-metadata.xmlfailed to transfer from http://0.0.0.0/ during a previous attempt. This failure was cached in the local repository and resolution will not be reattempted until the update interval of maven-default-http-blocker has elapsed or updates are forced. Original error: Could not transfer metadata net.minidev:json-smart/maven-metadata.xml from/to maven-default-http-blocker (http://0.0.0.0/): transfer failed for http://0.0.0.0/net/minidev/json-smart/maven-metadata.xml
[WARNING] net.minidev:json-smart/maven-metadata.xmlfailed to transfer from http://0.0.0.0/ during a previous attempt. This failure was cached in the local repository and resolution will not be reattempted until the update interval of maven-default-http-blocker has elapsed or updates are forced. Original error: Could not transfer metadata net.minidev:json-smart/maven-metadata.xml from/to maven-default-http-blocker (http://0.0.0.0/): transfer failed for http://0.0.0.0/net/minidev/json-smart/maven-metadata.xml
model contains 37 documentable templates
/usr/share/tomcat8/.jenkins/jobs/SANSA-Stack/branches/feature-SVA-.kolosm.lt-timestamp/workspace/sansa-hadoop-jena/src/main/java/net/sansa_stack/hadoop/jena/rdf/base/FileInputFormatRdfBase.java:32: warning: Could not find any member to link for "#createRecordReaderActual(InputSplit,".
/**
^
/usr/share/tomcat8/.jenkins/jobs/SANSA-Stack/branches/feature-SVA-.kolosm.lt-timestamp/workspace/sansa-hadoop-jena/src/main/java/net/sansa_stack/hadoop/generic/RecordReaderGenericBase.java:46: warning: Could not find any member to link for "#parse(Callable)".
/**
^
/usr/share/tomcat8/.jenkins/jobs/SANSA-Stack/branches/feature-SVA-.kolosm.lt-timestamp/workspace/sansa-hadoop-jena/src/main/java/net/sansa_stack/hadoop/generic/RecordReaderGenericBase.java:46: warning: Could not find any member to link for "Flowable".
/**
^
three warnings found
[INFO] start aggregation into /usr/share/tomcat8/.jenkins/jobs/SANSA-Stack/branches/feature-SVA-.kolosm.lt-timestamp/workspace/sansa-hadoop-jena/target/site/scaladocs
[WARNING] no vscaladoc to aggregate
[INFO] Building jar: /usr/share/tomcat8/.jenkins/jobs/SANSA-Stack/branches/feature-SVA-.kolosm.lt-timestamp/workspace/sansa-hadoop-jena/target/sansa-hadoop-jena-0.8.0-RC2-SNAPSHOT-javadoc.jar
[INFO] 
[INFO] --- maven-javadoc-plugin:3.1.1:jar (attach-javadocs) @ sansa-hadoop-jena ---
[INFO] The goal 'org.apache.maven.plugins:maven-javadoc-plugin:3.1.1:javadoc' has not been previously called for the module: 'net.sansa-stack:sansa-test-resources_2.12:jar:0.8.0-RC2-SNAPSHOT'. Trying to invoke it...
[WARNING] Creating fake javadoc directory to prevent repeated invocations: /usr/share/tomcat8/.jenkins/jobs/SANSA-Stack/branches/feature-SVA-.kolosm.lt-timestamp/workspace/sansa-test-resources/target/apidocs
[ERROR] Error fetching link: /usr/share/tomcat8/.jenkins/jobs/SANSA-Stack/branches/feature-SVA-.kolosm.lt-timestamp/workspace/sansa-test-resources/target/apidocs. Ignored it.
[INFO] 
Loading source files for package net.sansa_stack.hadoop.util...
Loading source files for package net.sansa_stack.hadoop.jena.rdf.turtle...
Loading source files for package net.sansa_stack.hadoop.jena.rdf.base...
Loading source files for package net.sansa_stack.hadoop.jena.rdf.trig...
Loading source files for package net.sansa_stack.hadoop.jena.locator...
Loading source files for package net.sansa_stack.hadoop.output...
Loading source files for package net.sansa_stack.hadoop.generic...
Constructing Javadoc information...
Standard Doclet version 1.8.0_292
Building tree for all the packages and classes...
Generating /usr/share/tomcat8/.jenkins/jobs/SANSA-Stack/branches/feature-SVA-.kolosm.lt-timestamp/workspace/sansa-hadoop-jena/target/apidocs/net/sansa_stack/hadoop/util/FileSplitUtils.html...
Generating /usr/share/tomcat8/.jenkins/jobs/SANSA-Stack/branches/feature-SVA-.kolosm.lt-timestamp/workspace/sansa-hadoop-jena/target/apidocs/net/sansa_stack/hadoop/util/InputStreamWithCloseIgnore.html...
Generating /usr/share/tomcat8/.jenkins/jobs/SANSA-Stack/branches/feature-SVA-.kolosm.lt-timestamp/workspace/sansa-hadoop-jena/target/apidocs/net/sansa_stack/hadoop/util/InputStreamWithCloseLogging.html...
Generating /usr/share/tomcat8/.jenkins/jobs/SANSA-Stack/branches/feature-SVA-.kolosm.lt-timestamp/workspace/sansa-hadoop-jena/target/apidocs/net/sansa_stack/hadoop/util/InputStreamWithZeroOffsetRead.html...
Generating /usr/share/tomcat8/.jenkins/jobs/SANSA-Stack/branches/feature-SVA-.kolosm.lt-timestamp/workspace/sansa-hadoop-jena/target/apidocs/net/sansa_stack/hadoop/util/InterruptingReadableByteChannel.html...
Generating /usr/share/tomcat8/.jenkins/jobs/SANSA-Stack/branches/feature-SVA-.kolosm.lt-timestamp/workspace/sansa-hadoop-jena/target/apidocs/net/sansa_stack/hadoop/util/ReadableByteChannelDecorator.html...
Generating /usr/share/tomcat8/.jenkins/jobs/SANSA-Stack/branches/feature-SVA-.kolosm.lt-timestamp/workspace/sansa-hadoop-jena/target/apidocs/net/sansa_stack/hadoop/util/ReadableByteChannelDecoratorBase.html...
Generating /usr/share/tomcat8/.jenkins/jobs/SANSA-Stack/branches/feature-SVA-.kolosm.lt-timestamp/workspace/sansa-hadoop-jena/target/apidocs/net/sansa_stack/hadoop/util/ReadableByteChannelWithConditionalBound.html...
Generating /usr/share/tomcat8/.jenkins/jobs/SANSA-Stack/branches/feature-SVA-.kolosm.lt-timestamp/workspace/sansa-hadoop-jena/target/apidocs/net/sansa_stack/hadoop/util/ReadableByteChannelWithoutCloseOnInterrupt.html...
Generating /usr/share/tomcat8/.jenkins/jobs/SANSA-Stack/branches/feature-SVA-.kolosm.lt-timestamp/workspace/sansa-hadoop-jena/target/apidocs/net/sansa_stack/hadoop/util/SeekableDecorator.html...
Generating /usr/share/tomcat8/.jenkins/jobs/SANSA-Stack/branches/feature-SVA-.kolosm.lt-timestamp/workspace/sansa-hadoop-jena/target/apidocs/net/sansa_stack/hadoop/util/SeekableInputStream.html...
Generating /usr/share/tomcat8/.jenkins/jobs/SANSA-Stack/branches/feature-SVA-.kolosm.lt-timestamp/workspace/sansa-hadoop-jena/target/apidocs/net/sansa_stack/hadoop/jena/rdf/turtle/FileInputFormatTurtleTriple.html...
Generating /usr/share/tomcat8/.jenkins/jobs/SANSA-Stack/branches/feature-SVA-.kolosm.lt-timestamp/workspace/sansa-hadoop-jena/target/apidocs/net/sansa_stack/hadoop/jena/rdf/turtle/RecordReaderTurtleTriple.html...
Generating /usr/share/tomcat8/.jenkins/jobs/SANSA-Stack/branches/feature-SVA-.kolosm.lt-timestamp/workspace/sansa-hadoop-jena/target/apidocs/net/sansa_stack/hadoop/jena/rdf/base/FileInputFormatRdfBase.html...
Generating /usr/share/tomcat8/.jenkins/jobs/SANSA-Stack/branches/feature-SVA-.kolosm.lt-timestamp/workspace/sansa-hadoop-jena/target/apidocs/net/sansa_stack/hadoop/jena/rdf/base/RecordReaderGenericRdfBase.html...
Generating /usr/share/tomcat8/.jenkins/jobs/SANSA-Stack/branches/feature-SVA-.kolosm.lt-timestamp/workspace/sansa-hadoop-jena/target/apidocs/net/sansa_stack/hadoop/jena/rdf/base/RecordReaderGenericRdfNonAccumulatingBase.html...
Generating /usr/share/tomcat8/.jenkins/jobs/SANSA-Stack/branches/feature-SVA-.kolosm.lt-timestamp/workspace/sansa-hadoop-jena/target/apidocs/net/sansa_stack/hadoop/jena/rdf/trig/FileInputFormatTrigDataset.html...
Generating /usr/share/tomcat8/.jenkins/jobs/SANSA-Stack/branches/feature-SVA-.kolosm.lt-timestamp/workspace/sansa-hadoop-jena/target/apidocs/net/sansa_stack/hadoop/jena/rdf/trig/FileInputFormatTrigQuad.html...
Generating /usr/share/tomcat8/.jenkins/jobs/SANSA-Stack/branches/feature-SVA-.kolosm.lt-timestamp/workspace/sansa-hadoop-jena/target/apidocs/net/sansa_stack/hadoop/jena/rdf/trig/RecordReaderTrigDataset.html...
Generating /usr/share/tomcat8/.jenkins/jobs/SANSA-Stack/branches/feature-SVA-.kolosm.lt-timestamp/workspace/sansa-hadoop-jena/target/apidocs/net/sansa_stack/hadoop/jena/rdf/trig/RecordReaderTrigDataset.AccumulatingDataset.html...
Generating /usr/share/tomcat8/.jenkins/jobs/SANSA-Stack/branches/feature-SVA-.kolosm.lt-timestamp/workspace/sansa-hadoop-jena/target/apidocs/net/sansa_stack/hadoop/jena/rdf/trig/RecordReaderTrigQuad.html...
Generating /usr/share/tomcat8/.jenkins/jobs/SANSA-Stack/branches/feature-SVA-.kolosm.lt-timestamp/workspace/sansa-hadoop-jena/target/apidocs/net/sansa_stack/hadoop/jena/locator/LocatorHdfs.html...
Generating /usr/share/tomcat8/.jenkins/jobs/SANSA-Stack/branches/feature-SVA-.kolosm.lt-timestamp/workspace/sansa-hadoop-jena/target/apidocs/net/sansa_stack/hadoop/output/FileOutputFormatTrig2.html...
Generating /usr/share/tomcat8/.jenkins/jobs/SANSA-Stack/branches/feature-SVA-.kolosm.lt-timestamp/workspace/sansa-hadoop-jena/target/apidocs/net/sansa_stack/hadoop/generic/Accumulating.html...
Generating /usr/share/tomcat8/.jenkins/jobs/SANSA-Stack/branches/feature-SVA-.kolosm.lt-timestamp/workspace/sansa-hadoop-jena/target/apidocs/net/sansa_stack/hadoop/generic/RecordReaderGenericBase.html...
Generating /usr/share/tomcat8/.jenkins/jobs/SANSA-Stack/branches/feature-SVA-.kolosm.lt-timestamp/workspace/sansa-hadoop-jena/target/apidocs/overview-frame.html...
Generating /usr/share/tomcat8/.jenkins/jobs/SANSA-Stack/branches/feature-SVA-.kolosm.lt-timestamp/workspace/sansa-hadoop-jena/target/apidocs/net/sansa_stack/hadoop/generic/package-frame.html...
Generating /usr/share/tomcat8/.jenkins/jobs/SANSA-Stack/branches/feature-SVA-.kolosm.lt-timestamp/workspace/sansa-hadoop-jena/target/apidocs/net/sansa_stack/hadoop/generic/package-summary.html...
Generating /usr/share/tomcat8/.jenkins/jobs/SANSA-Stack/branches/feature-SVA-.kolosm.lt-timestamp/workspace/sansa-hadoop-jena/target/apidocs/net/sansa_stack/hadoop/generic/package-tree.html...
Generating /usr/share/tomcat8/.jenkins/jobs/SANSA-Stack/branches/feature-SVA-.kolosm.lt-timestamp/workspace/sansa-hadoop-jena/target/apidocs/net/sansa_stack/hadoop/jena/locator/package-frame.html...
Generating /usr/share/tomcat8/.jenkins/jobs/SANSA-Stack/branches/feature-SVA-.kolosm.lt-timestamp/workspace/sansa-hadoop-jena/target/apidocs/net/sansa_stack/hadoop/jena/locator/package-summary.html...
Generating /usr/share/tomcat8/.jenkins/jobs/SANSA-Stack/branches/feature-SVA-.kolosm.lt-timestamp/workspace/sansa-hadoop-jena/target/apidocs/net/sansa_stack/hadoop/jena/locator/package-tree.html...
Generating /usr/share/tomcat8/.jenkins/jobs/SANSA-Stack/branches/feature-SVA-.kolosm.lt-timestamp/workspace/sansa-hadoop-jena/target/apidocs/net/sansa_stack/hadoop/jena/rdf/base/package-frame.html...
Generating /usr/share/tomcat8/.jenkins/jobs/SANSA-Stack/branches/feature-SVA-.kolosm.lt-timestamp/workspace/sansa-hadoop-jena/target/apidocs/net/sansa_stack/hadoop/jena/rdf/base/package-summary.html...
Generating /usr/share/tomcat8/.jenkins/jobs/SANSA-Stack/branches/feature-SVA-.kolosm.lt-timestamp/workspace/sansa-hadoop-jena/target/apidocs/net/sansa_stack/hadoop/jena/rdf/base/package-tree.html...
Generating /usr/share/tomcat8/.jenkins/jobs/SANSA-Stack/branches/feature-SVA-.kolosm.lt-timestamp/workspace/sansa-hadoop-jena/target/apidocs/net/sansa_stack/hadoop/jena/rdf/trig/package-frame.html...
Generating /usr/share/tomcat8/.jenkins/jobs/SANSA-Stack/branches/feature-SVA-.kolosm.lt-timestamp/workspace/sansa-hadoop-jena/target/apidocs/net/sansa_stack/hadoop/jena/rdf/trig/package-summary.html...
Generating /usr/share/tomcat8/.jenkins/jobs/SANSA-Stack/branches/feature-SVA-.kolosm.lt-timestamp/workspace/sansa-hadoop-jena/target/apidocs/net/sansa_stack/hadoop/jena/rdf/trig/package-tree.html...
Generating /usr/share/tomcat8/.jenkins/jobs/SANSA-Stack/branches/feature-SVA-.kolosm.lt-timestamp/workspace/sansa-hadoop-jena/target/apidocs/net/sansa_stack/hadoop/jena/rdf/turtle/package-frame.html...
Generating /usr/share/tomcat8/.jenkins/jobs/SANSA-Stack/branches/feature-SVA-.kolosm.lt-timestamp/workspace/sansa-hadoop-jena/target/apidocs/net/sansa_stack/hadoop/jena/rdf/turtle/package-summary.html...
Generating /usr/share/tomcat8/.jenkins/jobs/SANSA-Stack/branches/feature-SVA-.kolosm.lt-timestamp/workspace/sansa-hadoop-jena/target/apidocs/net/sansa_stack/hadoop/jena/rdf/turtle/package-tree.html...
Generating /usr/share/tomcat8/.jenkins/jobs/SANSA-Stack/branches/feature-SVA-.kolosm.lt-timestamp/workspace/sansa-hadoop-jena/target/apidocs/net/sansa_stack/hadoop/output/package-frame.html...
Generating /usr/share/tomcat8/.jenkins/jobs/SANSA-Stack/branches/feature-SVA-.kolosm.lt-timestamp/workspace/sansa-hadoop-jena/target/apidocs/net/sansa_stack/hadoop/output/package-summary.html...
Generating /usr/share/tomcat8/.jenkins/jobs/SANSA-Stack/branches/feature-SVA-.kolosm.lt-timestamp/workspace/sansa-hadoop-jena/target/apidocs/net/sansa_stack/hadoop/output/package-tree.html...
Generating /usr/share/tomcat8/.jenkins/jobs/SANSA-Stack/branches/feature-SVA-.kolosm.lt-timestamp/workspace/sansa-hadoop-jena/target/apidocs/net/sansa_stack/hadoop/util/package-frame.html...
Generating /usr/share/tomcat8/.jenkins/jobs/SANSA-Stack/branches/feature-SVA-.kolosm.lt-timestamp/workspace/sansa-hadoop-jena/target/apidocs/net/sansa_stack/hadoop/util/package-summary.html...
Generating /usr/share/tomcat8/.jenkins/jobs/SANSA-Stack/branches/feature-SVA-.kolosm.lt-timestamp/workspace/sansa-hadoop-jena/target/apidocs/net/sansa_stack/hadoop/util/package-tree.html...
Generating /usr/share/tomcat8/.jenkins/jobs/SANSA-Stack/branches/feature-SVA-.kolosm.lt-timestamp/workspace/sansa-hadoop-jena/target/apidocs/constant-values.html...
Generating /usr/share/tomcat8/.jenkins/jobs/SANSA-Stack/branches/feature-SVA-.kolosm.lt-timestamp/workspace/sansa-hadoop-jena/target/apidocs/net/sansa_stack/hadoop/util/class-use/InputStreamWithCloseIgnore.html...
Generating /usr/share/tomcat8/.jenkins/jobs/SANSA-Stack/branches/feature-SVA-.kolosm.lt-timestamp/workspace/sansa-hadoop-jena/target/apidocs/net/sansa_stack/hadoop/util/class-use/InputStreamWithCloseLogging.html...
Generating /usr/share/tomcat8/.jenkins/jobs/SANSA-Stack/branches/feature-SVA-.kolosm.lt-timestamp/workspace/sansa-hadoop-jena/target/apidocs/net/sansa_stack/hadoop/util/class-use/ReadableByteChannelWithoutCloseOnInterrupt.html...
Generating /usr/share/tomcat8/.jenkins/jobs/SANSA-Stack/branches/feature-SVA-.kolosm.lt-timestamp/workspace/sansa-hadoop-jena/target/apidocs/net/sansa_stack/hadoop/util/class-use/InputStreamWithZeroOffsetRead.html...
Generating /usr/share/tomcat8/.jenkins/jobs/SANSA-Stack/branches/feature-SVA-.kolosm.lt-timestamp/workspace/sansa-hadoop-jena/target/apidocs/net/sansa_stack/hadoop/util/class-use/InterruptingReadableByteChannel.html...
Generating /usr/share/tomcat8/.jenkins/jobs/SANSA-Stack/branches/feature-SVA-.kolosm.lt-timestamp/workspace/sansa-hadoop-jena/target/apidocs/net/sansa_stack/hadoop/util/class-use/SeekableInputStream.html...
Generating /usr/share/tomcat8/.jenkins/jobs/SANSA-Stack/branches/feature-SVA-.kolosm.lt-timestamp/workspace/sansa-hadoop-jena/target/apidocs/net/sansa_stack/hadoop/util/class-use/ReadableByteChannelWithConditionalBound.html...
Generating /usr/share/tomcat8/.jenkins/jobs/SANSA-Stack/branches/feature-SVA-.kolosm.lt-timestamp/workspace/sansa-hadoop-jena/target/apidocs/net/sansa_stack/hadoop/util/class-use/SeekableDecorator.html...
Generating /usr/share/tomcat8/.jenkins/jobs/SANSA-Stack/branches/feature-SVA-.kolosm.lt-timestamp/workspace/sansa-hadoop-jena/target/apidocs/net/sansa_stack/hadoop/util/class-use/ReadableByteChannelDecorator.html...
Generating /usr/share/tomcat8/.jenkins/jobs/SANSA-Stack/branches/feature-SVA-.kolosm.lt-timestamp/workspace/sansa-hadoop-jena/target/apidocs/net/sansa_stack/hadoop/util/class-use/FileSplitUtils.html...
Generating /usr/share/tomcat8/.jenkins/jobs/SANSA-Stack/branches/feature-SVA-.kolosm.lt-timestamp/workspace/sansa-hadoop-jena/target/apidocs/net/sansa_stack/hadoop/util/class-use/ReadableByteChannelDecoratorBase.html...
Generating /usr/share/tomcat8/.jenkins/jobs/SANSA-Stack/branches/feature-SVA-.kolosm.lt-timestamp/workspace/sansa-hadoop-jena/target/apidocs/net/sansa_stack/hadoop/jena/rdf/turtle/class-use/RecordReaderTurtleTriple.html...
Generating /usr/share/tomcat8/.jenkins/jobs/SANSA-Stack/branches/feature-SVA-.kolosm.lt-timestamp/workspace/sansa-hadoop-jena/target/apidocs/net/sansa_stack/hadoop/jena/rdf/turtle/class-use/FileInputFormatTurtleTriple.html...
Generating /usr/share/tomcat8/.jenkins/jobs/SANSA-Stack/branches/feature-SVA-.kolosm.lt-timestamp/workspace/sansa-hadoop-jena/target/apidocs/net/sansa_stack/hadoop/jena/rdf/base/class-use/RecordReaderGenericRdfBase.html...
Generating /usr/share/tomcat8/.jenkins/jobs/SANSA-Stack/branches/feature-SVA-.kolosm.lt-timestamp/workspace/sansa-hadoop-jena/target/apidocs/net/sansa_stack/hadoop/jena/rdf/base/class-use/FileInputFormatRdfBase.html...
Generating /usr/share/tomcat8/.jenkins/jobs/SANSA-Stack/branches/feature-SVA-.kolosm.lt-timestamp/workspace/sansa-hadoop-jena/target/apidocs/net/sansa_stack/hadoop/jena/rdf/base/class-use/RecordReaderGenericRdfNonAccumulatingBase.html...
Generating /usr/share/tomcat8/.jenkins/jobs/SANSA-Stack/branches/feature-SVA-.kolosm.lt-timestamp/workspace/sansa-hadoop-jena/target/apidocs/net/sansa_stack/hadoop/jena/rdf/trig/class-use/FileInputFormatTrigQuad.html...
Generating /usr/share/tomcat8/.jenkins/jobs/SANSA-Stack/branches/feature-SVA-.kolosm.lt-timestamp/workspace/sansa-hadoop-jena/target/apidocs/net/sansa_stack/hadoop/jena/rdf/trig/class-use/RecordReaderTrigDataset.html...
Generating /usr/share/tomcat8/.jenkins/jobs/SANSA-Stack/branches/feature-SVA-.kolosm.lt-timestamp/workspace/sansa-hadoop-jena/target/apidocs/net/sansa_stack/hadoop/jena/rdf/trig/class-use/RecordReaderTrigDataset.AccumulatingDataset.html...
Generating /usr/share/tomcat8/.jenkins/jobs/SANSA-Stack/branches/feature-SVA-.kolosm.lt-timestamp/workspace/sansa-hadoop-jena/target/apidocs/net/sansa_stack/hadoop/jena/rdf/trig/class-use/FileInputFormatTrigDataset.html...
Generating /usr/share/tomcat8/.jenkins/jobs/SANSA-Stack/branches/feature-SVA-.kolosm.lt-timestamp/workspace/sansa-hadoop-jena/target/apidocs/net/sansa_stack/hadoop/jena/rdf/trig/class-use/RecordReaderTrigQuad.html...
Generating /usr/share/tomcat8/.jenkins/jobs/SANSA-Stack/branches/feature-SVA-.kolosm.lt-timestamp/workspace/sansa-hadoop-jena/target/apidocs/net/sansa_stack/hadoop/jena/locator/class-use/LocatorHdfs.html...
Generating /usr/share/tomcat8/.jenkins/jobs/SANSA-Stack/branches/feature-SVA-.kolosm.lt-timestamp/workspace/sansa-hadoop-jena/target/apidocs/net/sansa_stack/hadoop/output/class-use/FileOutputFormatTrig2.html...
Generating /usr/share/tomcat8/.jenkins/jobs/SANSA-Stack/branches/feature-SVA-.kolosm.lt-timestamp/workspace/sansa-hadoop-jena/target/apidocs/net/sansa_stack/hadoop/generic/class-use/Accumulating.html...
Generating /usr/share/tomcat8/.jenkins/jobs/SANSA-Stack/branches/feature-SVA-.kolosm.lt-timestamp/workspace/sansa-hadoop-jena/target/apidocs/net/sansa_stack/hadoop/generic/class-use/RecordReaderGenericBase.html...
Generating /usr/share/tomcat8/.jenkins/jobs/SANSA-Stack/branches/feature-SVA-.kolosm.lt-timestamp/workspace/sansa-hadoop-jena/target/apidocs/net/sansa_stack/hadoop/generic/package-use.html...
Generating /usr/share/tomcat8/.jenkins/jobs/SANSA-Stack/branches/feature-SVA-.kolosm.lt-timestamp/workspace/sansa-hadoop-jena/target/apidocs/net/sansa_stack/hadoop/jena/locator/package-use.html...
Generating /usr/share/tomcat8/.jenkins/jobs/SANSA-Stack/branches/feature-SVA-.kolosm.lt-timestamp/workspace/sansa-hadoop-jena/target/apidocs/net/sansa_stack/hadoop/jena/rdf/base/package-use.html...
Generating /usr/share/tomcat8/.jenkins/jobs/SANSA-Stack/branches/feature-SVA-.kolosm.lt-timestamp/workspace/sansa-hadoop-jena/target/apidocs/net/sansa_stack/hadoop/jena/rdf/trig/package-use.html...
Generating /usr/share/tomcat8/.jenkins/jobs/SANSA-Stack/branches/feature-SVA-.kolosm.lt-timestamp/workspace/sansa-hadoop-jena/target/apidocs/net/sansa_stack/hadoop/jena/rdf/turtle/package-use.html...
Generating /usr/share/tomcat8/.jenkins/jobs/SANSA-Stack/branches/feature-SVA-.kolosm.lt-timestamp/workspace/sansa-hadoop-jena/target/apidocs/net/sansa_stack/hadoop/output/package-use.html...
Generating /usr/share/tomcat8/.jenkins/jobs/SANSA-Stack/branches/feature-SVA-.kolosm.lt-timestamp/workspace/sansa-hadoop-jena/target/apidocs/net/sansa_stack/hadoop/util/package-use.html...
Building index for all the packages and classes...
Generating /usr/share/tomcat8/.jenkins/jobs/SANSA-Stack/branches/feature-SVA-.kolosm.lt-timestamp/workspace/sansa-hadoop-jena/target/apidocs/overview-tree.html...
Generating /usr/share/tomcat8/.jenkins/jobs/SANSA-Stack/branches/feature-SVA-.kolosm.lt-timestamp/workspace/sansa-hadoop-jena/target/apidocs/index-all.html...
Generating /usr/share/tomcat8/.jenkins/jobs/SANSA-Stack/branches/feature-SVA-.kolosm.lt-timestamp/workspace/sansa-hadoop-jena/target/apidocs/deprecated-list.html...
Building index for all classes...
Generating /usr/share/tomcat8/.jenkins/jobs/SANSA-Stack/branches/feature-SVA-.kolosm.lt-timestamp/workspace/sansa-hadoop-jena/target/apidocs/allclasses-frame.html...
Generating /usr/share/tomcat8/.jenkins/jobs/SANSA-Stack/branches/feature-SVA-.kolosm.lt-timestamp/workspace/sansa-hadoop-jena/target/apidocs/allclasses-noframe.html...
Generating /usr/share/tomcat8/.jenkins/jobs/SANSA-Stack/branches/feature-SVA-.kolosm.lt-timestamp/workspace/sansa-hadoop-jena/target/apidocs/index.html...
Generating /usr/share/tomcat8/.jenkins/jobs/SANSA-Stack/branches/feature-SVA-.kolosm.lt-timestamp/workspace/sansa-hadoop-jena/target/apidocs/overview-summary.html...
Generating /usr/share/tomcat8/.jenkins/jobs/SANSA-Stack/branches/feature-SVA-.kolosm.lt-timestamp/workspace/sansa-hadoop-jena/target/apidocs/help-doc.html...
8 warnings
[WARNING] Javadoc Warnings
[WARNING] /usr/share/tomcat8/.jenkins/jobs/SANSA-Stack/branches/feature-SVA-.kolosm.lt-timestamp/workspace/sansa-hadoop-jena/src/main/java/net/sansa_stack/hadoop/util/FileSplitUtils.java:28: warning - @return tag has no arguments.
[WARNING] /usr/share/tomcat8/.jenkins/jobs/SANSA-Stack/branches/feature-SVA-.kolosm.lt-timestamp/workspace/sansa-hadoop-jena/src/main/java/net/sansa_stack/hadoop/util/FileSplitUtils.java:79: warning - @return tag has no arguments.
[WARNING] /usr/share/tomcat8/.jenkins/jobs/SANSA-Stack/branches/feature-SVA-.kolosm.lt-timestamp/workspace/sansa-hadoop-jena/src/main/java/net/sansa_stack/hadoop/generic/RecordReaderGenericBase.java:249: warning - @return tag has no arguments.
[WARNING] /usr/share/tomcat8/.jenkins/jobs/SANSA-Stack/branches/feature-SVA-.kolosm.lt-timestamp/workspace/sansa-hadoop-jena/src/main/java/net/sansa_stack/hadoop/generic/RecordReaderGenericBase.java:262: warning - @return tag has no arguments.
[WARNING] /usr/share/tomcat8/.jenkins/jobs/SANSA-Stack/branches/feature-SVA-.kolosm.lt-timestamp/workspace/sansa-hadoop-jena/src/main/java/net/sansa_stack/hadoop/generic/RecordReaderGenericBase.java:431: warning - @return tag has no arguments.
[WARNING] /usr/share/tomcat8/.jenkins/jobs/SANSA-Stack/branches/feature-SVA-.kolosm.lt-timestamp/workspace/sansa-hadoop-jena/src/main/java/net/sansa_stack/hadoop/generic/RecordReaderGenericBase.java:830: warning - @return tag has no arguments.
[WARNING] /usr/share/tomcat8/.jenkins/jobs/SANSA-Stack/branches/feature-SVA-.kolosm.lt-timestamp/workspace/sansa-hadoop-jena/src/main/java/net/sansa_stack/hadoop/generic/RecordReaderGenericBase.java:947: warning - @return tag has no arguments.
[WARNING] /usr/share/tomcat8/.jenkins/jobs/SANSA-Stack/branches/feature-SVA-.kolosm.lt-timestamp/workspace/sansa-hadoop-jena/src/main/java/net/sansa_stack/hadoop/generic/Accumulating.java:18: warning - @return tag has no arguments.
[INFO] Building jar: /usr/share/tomcat8/.jenkins/jobs/SANSA-Stack/branches/feature-SVA-.kolosm.lt-timestamp/workspace/sansa-hadoop-jena/target/sansa-hadoop-jena-0.8.0-RC2-SNAPSHOT-javadoc.jar
[INFO] 
[INFO] --- maven-install-plugin:2.4:install (default-install) @ sansa-hadoop-jena ---
[INFO] Installing /usr/share/tomcat8/.jenkins/jobs/SANSA-Stack/branches/feature-SVA-.kolosm.lt-timestamp/workspace/sansa-hadoop-jena/target/sansa-hadoop-jena-0.8.0-RC2-SNAPSHOT.jar to /usr/share/tomcat8/.m2/repository/net/sansa-stack/sansa-hadoop-jena/0.8.0-RC2-SNAPSHOT/sansa-hadoop-jena-0.8.0-RC2-SNAPSHOT.jar
[INFO] Installing /usr/share/tomcat8/.jenkins/jobs/SANSA-Stack/branches/feature-SVA-.kolosm.lt-timestamp/workspace/sansa-hadoop-jena/pom.xml to /usr/share/tomcat8/.m2/repository/net/sansa-stack/sansa-hadoop-jena/0.8.0-RC2-SNAPSHOT/sansa-hadoop-jena-0.8.0-RC2-SNAPSHOT.pom
[INFO] Installing /usr/share/tomcat8/.jenkins/jobs/SANSA-Stack/branches/feature-SVA-.kolosm.lt-timestamp/workspace/sansa-hadoop-jena/target/sansa-hadoop-jena-0.8.0-RC2-SNAPSHOT-javadoc.jar to /usr/share/tomcat8/.m2/repository/net/sansa-stack/sansa-hadoop-jena/0.8.0-RC2-SNAPSHOT/sansa-hadoop-jena-0.8.0-RC2-SNAPSHOT-javadoc.jar
[INFO] Installing /usr/share/tomcat8/.jenkins/jobs/SANSA-Stack/branches/feature-SVA-.kolosm.lt-timestamp/workspace/sansa-hadoop-jena/target/sansa-hadoop-jena-0.8.0-RC2-SNAPSHOT-javadoc.jar to /usr/share/tomcat8/.m2/repository/net/sansa-stack/sansa-hadoop-jena/0.8.0-RC2-SNAPSHOT/sansa-hadoop-jena-0.8.0-RC2-SNAPSHOT-javadoc.jar
[INFO] ------------------------------------------------------------------------
[INFO] Reactor Summary for SANSA - Parent 0.8.0-RC2-SNAPSHOT:
[INFO] 
[INFO] SANSA - Parent ..................................... SUCCESS [ 26.837 s]
[INFO] sansa-test-resources_2.12 .......................... SUCCESS [  4.070 s]
[INFO] sansa-hadoop-jena .................................. FAILURE [ 57.975 s]
[INFO] sansa-kryo-jena .................................... SKIPPED
[INFO] sansa-resource-metadata ............................ SKIPPED
[INFO] sansa-resource-testdata ............................ SKIPPED
[INFO] SANSA Stack - RDF Layer - Parent ................... SKIPPED
[INFO] sansa-rdf-common_2.12 .............................. SKIPPED
[INFO] sansa-rdf-spark_2.12 ............................... SKIPPED
[INFO] SANSA Stack - DataLake Layer - Parent .............. SKIPPED
[INFO] sansa-datalake-spark_2.12 .......................... SKIPPED
[INFO] SANSA Stack - Query Layer - Parent ................. SKIPPED
[INFO] sansa-query-tests_2.12 ............................. SKIPPED
[INFO] sansa-query-spark_2.12 ............................. SKIPPED
[INFO] ------------------------------------------------------------------------
[INFO] BUILD FAILURE
[INFO] ------------------------------------------------------------------------
[INFO] Total time:  01:29 min
[INFO] Finished at: 2021-05-31T15:13:43+02:00
[INFO] ------------------------------------------------------------------------
[ERROR] Failed to execute goal org.apache.maven.plugins:maven-install-plugin:2.4:install (default-install) on project sansa-hadoop-jena: Failed to install metadata net.sansa-stack:sansa-hadoop-jena:0.8.0-RC2-SNAPSHOT/maven-metadata.xml: Could not parse metadata /usr/share/tomcat8/.m2/repository/net/sansa-stack/sansa-hadoop-jena/0.8.0-RC2-SNAPSHOT/maven-metadata-local.xml: in epilog non whitespace content is not allowed but got n (position: END_TAG seen ...</metadata>\nn... @21:2) -> [Help 1]
org.apache.maven.lifecycle.LifecycleExecutionException: Failed to execute goal org.apache.maven.plugins:maven-install-plugin:2.4:install (default-install) on project sansa-hadoop-jena: Failed to install metadata net.sansa-stack:sansa-hadoop-jena:0.8.0-RC2-SNAPSHOT/maven-metadata.xml: Could not parse metadata /usr/share/tomcat8/.m2/repository/net/sansa-stack/sansa-hadoop-jena/0.8.0-RC2-SNAPSHOT/maven-metadata-local.xml: in epilog non whitespace content is not allowed but got n (position: END_TAG seen ...</metadata>\nn... @21:2) 
    at org.apache.maven.lifecycle.internal.MojoExecutor.execute (MojoExecutor.java:215)
    at org.apache.maven.lifecycle.internal.MojoExecutor.execute (MojoExecutor.java:156)
    at org.apache.maven.lifecycle.internal.MojoExecutor.execute (MojoExecutor.java:148)
    at org.apache.maven.lifecycle.internal.LifecycleModuleBuilder.buildProject (LifecycleModuleBuilder.java:117)
    at org.apache.maven.lifecycle.internal.LifecycleModuleBuilder.buildProject (LifecycleModuleBuilder.java:81)
    at org.apache.maven.lifecycle.internal.builder.singlethreaded.SingleThreadedBuilder.build (SingleThreadedBuilder.java:56)
    at org.apache.maven.lifecycle.internal.LifecycleStarter.execute (LifecycleStarter.java:128)
    at org.apache.maven.DefaultMaven.doExecute (DefaultMaven.java:305)
    at org.apache.maven.DefaultMaven.doExecute (DefaultMaven.java:192)
    at org.apache.maven.DefaultMaven.execute (DefaultMaven.java:105)
    at org.apache.maven.cli.MavenCli.execute (MavenCli.java:957)
    at org.apache.maven.cli.MavenCli.doMain (MavenCli.java:289)
    at org.apache.maven.cli.MavenCli.main (MavenCli.java:193)
    at sun.reflect.NativeMethodAccessorImpl.invoke0 (Native Method)
    at sun.reflect.NativeMethodAccessorImpl.invoke (NativeMethodAccessorImpl.java:62)
    at sun.reflect.DelegatingMethodAccessorImpl.invoke (DelegatingMethodAccessorImpl.java:43)
    at java.lang.reflect.Method.invoke (Method.java:498)
    at org.codehaus.plexus.classworlds.launcher.Launcher.launchEnhanced (Launcher.java:282)
    at org.codehaus.plexus.classworlds.launcher.Launcher.launch (Launcher.java:225)
    at org.codehaus.plexus.classworlds.launcher.Launcher.mainWithExitCode (Launcher.java:406)
    at org.codehaus.plexus.classworlds.launcher.Launcher.main (Launcher.java:347)
Caused by: org.apache.maven.plugin.MojoExecutionException: Failed to install metadata net.sansa-stack:sansa-hadoop-jena:0.8.0-RC2-SNAPSHOT/maven-metadata.xml: Could not parse metadata /usr/share/tomcat8/.m2/repository/net/sansa-stack/sansa-hadoop-jena/0.8.0-RC2-SNAPSHOT/maven-metadata-local.xml: in epilog non whitespace content is not allowed but got n (position: END_TAG seen ...</metadata>\nn... @21:2) 
    at org.apache.maven.plugin.install.InstallMojo.execute (InstallMojo.java:153)
    at org.apache.maven.plugin.DefaultBuildPluginManager.executeMojo (DefaultBuildPluginManager.java:137)
    at org.apache.maven.lifecycle.internal.MojoExecutor.execute (MojoExecutor.java:210)
    at org.apache.maven.lifecycle.internal.MojoExecutor.execute (MojoExecutor.java:156)
    at org.apache.maven.lifecycle.internal.MojoExecutor.execute (MojoExecutor.java:148)
    at org.apache.maven.lifecycle.internal.LifecycleModuleBuilder.buildProject (LifecycleModuleBuilder.java:117)
    at org.apache.maven.lifecycle.internal.LifecycleModuleBuilder.buildProject (LifecycleModuleBuilder.java:81)
    at org.apache.maven.lifecycle.internal.builder.singlethreaded.SingleThreadedBuilder.build (SingleThreadedBuilder.java:56)
    at org.apache.maven.lifecycle.internal.LifecycleStarter.execute (LifecycleStarter.java:128)
    at org.apache.maven.DefaultMaven.doExecute (DefaultMaven.java:305)
    at org.apache.maven.DefaultMaven.doExecute (DefaultMaven.java:192)
    at org.apache.maven.DefaultMaven.execute (DefaultMaven.java:105)
    at org.apache.maven.cli.MavenCli.execute (MavenCli.java:957)
    at org.apache.maven.cli.MavenCli.doMain (MavenCli.java:289)
    at org.apache.maven.cli.MavenCli.main (MavenCli.java:193)
    at sun.reflect.NativeMethodAccessorImpl.invoke0 (Native Method)
    at sun.reflect.NativeMethodAccessorImpl.invoke (NativeMethodAccessorImpl.java:62)
    at sun.reflect.DelegatingMethodAccessorImpl.invoke (DelegatingMethodAccessorImpl.java:43)
    at java.lang.reflect.Method.invoke (Method.java:498)
    at org.codehaus.plexus.classworlds.launcher.Launcher.launchEnhanced (Launcher.java:282)
    at org.codehaus.plexus.classworlds.launcher.Launcher.launch (Launcher.java:225)
    at org.codehaus.plexus.classworlds.launcher.Launcher.mainWithExitCode (Launcher.java:406)
    at org.codehaus.plexus.classworlds.launcher.Launcher.main (Launcher.java:347)
Caused by: org.apache.maven.artifact.installer.ArtifactInstallationException: Failed to install metadata net.sansa-stack:sansa-hadoop-jena:0.8.0-RC2-SNAPSHOT/maven-metadata.xml: Could not parse metadata /usr/share/tomcat8/.m2/repository/net/sansa-stack/sansa-hadoop-jena/0.8.0-RC2-SNAPSHOT/maven-metadata-local.xml: in epilog non whitespace content is not allowed but got n (position: END_TAG seen ...</metadata>\nn... @21:2) 
    at org.apache.maven.artifact.installer.DefaultArtifactInstaller.install (DefaultArtifactInstaller.java:111)
    at org.apache.maven.plugin.install.InstallMojo.execute (InstallMojo.java:145)
    at org.apache.maven.plugin.DefaultBuildPluginManager.executeMojo (DefaultBuildPluginManager.java:137)
    at org.apache.maven.lifecycle.internal.MojoExecutor.execute (MojoExecutor.java:210)
    at org.apache.maven.lifecycle.internal.MojoExecutor.execute (MojoExecutor.java:156)
    at org.apache.maven.lifecycle.internal.MojoExecutor.execute (MojoExecutor.java:148)
    at org.apache.maven.lifecycle.internal.LifecycleModuleBuilder.buildProject (LifecycleModuleBuilder.java:117)
    at org.apache.maven.lifecycle.internal.LifecycleModuleBuilder.buildProject (LifecycleModuleBuilder.java:81)
    at org.apache.maven.lifecycle.internal.builder.singlethreaded.SingleThreadedBuilder.build (SingleThreadedBuilder.java:56)
    at org.apache.maven.lifecycle.internal.LifecycleStarter.execute (LifecycleStarter.java:128)
    at org.apache.maven.DefaultMaven.doExecute (DefaultMaven.java:305)
    at org.apache.maven.DefaultMaven.doExecute (DefaultMaven.java:192)
    at org.apache.maven.DefaultMaven.execute (DefaultMaven.java:105)
    at org.apache.maven.cli.MavenCli.execute (MavenCli.java:957)
    at org.apache.maven.cli.MavenCli.doMain (MavenCli.java:289)
    at org.apache.maven.cli.MavenCli.main (MavenCli.java:193)
    at sun.reflect.NativeMethodAccessorImpl.invoke0 (Native Method)
    at sun.reflect.NativeMethodAccessorImpl.invoke (NativeMethodAccessorImpl.java:62)
    at sun.reflect.DelegatingMethodAccessorImpl.invoke (DelegatingMethodAccessorImpl.java:43)
    at java.lang.reflect.Method.invoke (Method.java:498)
    at org.codehaus.plexus.classworlds.launcher.Launcher.launchEnhanced (Launcher.java:282)
    at org.codehaus.plexus.classworlds.launcher.Launcher.launch (Launcher.java:225)
    at org.codehaus.plexus.classworlds.launcher.Launcher.mainWithExitCode (Launcher.java:406)
    at org.codehaus.plexus.classworlds.launcher.Launcher.main (Launcher.java:347)
Caused by: org.eclipse.aether.installation.InstallationException: Failed to install metadata net.sansa-stack:sansa-hadoop-jena:0.8.0-RC2-SNAPSHOT/maven-metadata.xml: Could not parse metadata /usr/share/tomcat8/.m2/repository/net/sansa-stack/sansa-hadoop-jena/0.8.0-RC2-SNAPSHOT/maven-metadata-local.xml: in epilog non whitespace content is not allowed but got n (position: END_TAG seen ...</metadata>\nn... @21:2) 
    at org.eclipse.aether.internal.impl.DefaultInstaller.install (DefaultInstaller.java:345)
    at org.eclipse.aether.internal.impl.DefaultInstaller.install (DefaultInstaller.java:194)
    at org.eclipse.aether.internal.impl.DefaultInstaller.install (DefaultInstaller.java:145)
    at org.eclipse.aether.internal.impl.DefaultRepositorySystem.install (DefaultRepositorySystem.java:379)
    at org.apache.maven.artifact.installer.DefaultArtifactInstaller.install (DefaultArtifactInstaller.java:107)
    at org.apache.maven.plugin.install.InstallMojo.execute (InstallMojo.java:145)
    at org.apache.maven.plugin.DefaultBuildPluginManager.executeMojo (DefaultBuildPluginManager.java:137)
    at org.apache.maven.lifecycle.internal.MojoExecutor.execute (MojoExecutor.java:210)
    at org.apache.maven.lifecycle.internal.MojoExecutor.execute (MojoExecutor.java:156)
    at org.apache.maven.lifecycle.internal.MojoExecutor.execute (MojoExecutor.java:148)
    at org.apache.maven.lifecycle.internal.LifecycleModuleBuilder.buildProject (LifecycleModuleBuilder.java:117)
    at org.apache.maven.lifecycle.internal.LifecycleModuleBuilder.buildProject (LifecycleModuleBuilder.java:81)
    at org.apache.maven.lifecycle.internal.builder.singlethreaded.SingleThreadedBuilder.build (SingleThreadedBuilder.java:56)
    at org.apache.maven.lifecycle.internal.LifecycleStarter.execute (LifecycleStarter.java:128)
    at org.apache.maven.DefaultMaven.doExecute (DefaultMaven.java:305)
    at org.apache.maven.DefaultMaven.doExecute (DefaultMaven.java:192)
    at org.apache.maven.DefaultMaven.execute (DefaultMaven.java:105)
    at org.apache.maven.cli.MavenCli.execute (MavenCli.java:957)
    at org.apache.maven.cli.MavenCli.doMain (MavenCli.java:289)
    at org.apache.maven.cli.MavenCli.main (MavenCli.java:193)
    at sun.reflect.NativeMethodAccessorImpl.invoke0 (Native Method)
    at sun.reflect.NativeMethodAccessorImpl.invoke (NativeMethodAccessorImpl.java:62)
    at sun.reflect.DelegatingMethodAccessorImpl.invoke (DelegatingMethodAccessorImpl.java:43)
    at java.lang.reflect.Method.invoke (Method.java:498)
    at org.codehaus.plexus.classworlds.launcher.Launcher.launchEnhanced (Launcher.java:282)
    at org.codehaus.plexus.classworlds.launcher.Launcher.launch (Launcher.java:225)
    at org.codehaus.plexus.classworlds.launcher.Launcher.mainWithExitCode (Launcher.java:406)
    at org.codehaus.plexus.classworlds.launcher.Launcher.main (Launcher.java:347)
Caused by: org.eclipse.aether.RepositoryException: Could not parse metadata /usr/share/tomcat8/.m2/repository/net/sansa-stack/sansa-hadoop-jena/0.8.0-RC2-SNAPSHOT/maven-metadata-local.xml: in epilog non whitespace content is not allowed but got n (position: END_TAG seen ...</metadata>\nn... @21:2) 
    at org.apache.maven.repository.internal.MavenMetadata.read (MavenMetadata.java:108)
    at org.apache.maven.repository.internal.MavenMetadata.merge (MavenMetadata.java:74)
    at org.eclipse.aether.internal.impl.DefaultInstaller.install (DefaultInstaller.java:329)
    at org.eclipse.aether.internal.impl.DefaultInstaller.install (DefaultInstaller.java:194)
    at org.eclipse.aether.internal.impl.DefaultInstaller.install (DefaultInstaller.java:145)
    at org.eclipse.aether.internal.impl.DefaultRepositorySystem.install (DefaultRepositorySystem.java:379)
    at org.apache.maven.artifact.installer.DefaultArtifactInstaller.install (DefaultArtifactInstaller.java:107)
    at org.apache.maven.plugin.install.InstallMojo.execute (InstallMojo.java:145)
    at org.apache.maven.plugin.DefaultBuildPluginManager.executeMojo (DefaultBuildPluginManager.java:137)
    at org.apache.maven.lifecycle.internal.MojoExecutor.execute (MojoExecutor.java:210)
    at org.apache.maven.lifecycle.internal.MojoExecutor.execute (MojoExecutor.java:156)
    at org.apache.maven.lifecycle.internal.MojoExecutor.execute (MojoExecutor.java:148)
    at org.apache.maven.lifecycle.internal.LifecycleModuleBuilder.buildProject (LifecycleModuleBuilder.java:117)
    at org.apache.maven.lifecycle.internal.LifecycleModuleBuilder.buildProject (LifecycleModuleBuilder.java:81)
    at org.apache.maven.lifecycle.internal.builder.singlethreaded.SingleThreadedBuilder.build (SingleThreadedBuilder.java:56)
    at org.apache.maven.lifecycle.internal.LifecycleStarter.execute (LifecycleStarter.java:128)
    at org.apache.maven.DefaultMaven.doExecute (DefaultMaven.java:305)
    at org.apache.maven.DefaultMaven.doExecute (DefaultMaven.java:192)
    at org.apache.maven.DefaultMaven.execute (DefaultMaven.java:105)
    at org.apache.maven.cli.MavenCli.execute (MavenCli.java:957)
    at org.apache.maven.cli.MavenCli.doMain (MavenCli.java:289)
    at org.apache.maven.cli.MavenCli.main (MavenCli.java:193)
    at sun.reflect.NativeMethodAccessorImpl.invoke0 (Native Method)
    at sun.reflect.NativeMethodAccessorImpl.invoke (NativeMethodAccessorImpl.java:62)
    at sun.reflect.DelegatingMethodAccessorImpl.invoke (DelegatingMethodAccessorImpl.java:43)
    at java.lang.reflect.Method.invoke (Method.java:498)
    at org.codehaus.plexus.classworlds.launcher.Launcher.launchEnhanced (Launcher.java:282)
    at org.codehaus.plexus.classworlds.launcher.Launcher.launch (Launcher.java:225)
    at org.codehaus.plexus.classworlds.launcher.Launcher.mainWithExitCode (Launcher.java:406)
    at org.codehaus.plexus.classworlds.launcher.Launcher.main (Launcher.java:347)
Caused by: org.codehaus.plexus.util.xml.pull.XmlPullParserException: in epilog non whitespace content is not allowed but got n (position: END_TAG seen ...</metadata>\nn... @21:2) 
    at org.codehaus.plexus.util.xml.pull.MXParser.parseEpilog (MXParser.java:2022)
    at org.codehaus.plexus.util.xml.pull.MXParser.nextImpl (MXParser.java:1696)
    at org.codehaus.plexus.util.xml.pull.MXParser.next (MXParser.java:1319)
    at org.apache.maven.artifact.repository.metadata.io.xpp3.MetadataXpp3Reader.read (MetadataXpp3Reader.java:958)
    at org.apache.maven.artifact.repository.metadata.io.xpp3.MetadataXpp3Reader.read (MetadataXpp3Reader.java:557)
    at org.apache.maven.repository.internal.MavenMetadata.read (MavenMetadata.java:100)
    at org.apache.maven.repository.internal.MavenMetadata.merge (MavenMetadata.java:74)
    at org.eclipse.aether.internal.impl.DefaultInstaller.install (DefaultInstaller.java:329)
    at org.eclipse.aether.internal.impl.DefaultInstaller.install (DefaultInstaller.java:194)
    at org.eclipse.aether.internal.impl.DefaultInstaller.install (DefaultInstaller.java:145)
    at org.eclipse.aether.internal.impl.DefaultRepositorySystem.install (DefaultRepositorySystem.java:379)
    at org.apache.maven.artifact.installer.DefaultArtifactInstaller.install (DefaultArtifactInstaller.java:107)
    at org.apache.maven.plugin.install.InstallMojo.execute (InstallMojo.java:145)
    at org.apache.maven.plugin.DefaultBuildPluginManager.executeMojo (DefaultBuildPluginManager.java:137)
    at org.apache.maven.lifecycle.internal.MojoExecutor.execute (MojoExecutor.java:210)
    at org.apache.maven.lifecycle.internal.MojoExecutor.execute (MojoExecutor.java:156)
    at org.apache.maven.lifecycle.internal.MojoExecutor.execute (MojoExecutor.java:148)
    at org.apache.maven.lifecycle.internal.LifecycleModuleBuilder.buildProject (LifecycleModuleBuilder.java:117)
    at org.apache.maven.lifecycle.internal.LifecycleModuleBuilder.buildProject (LifecycleModuleBuilder.java:81)
    at org.apache.maven.lifecycle.internal.builder.singlethreaded.SingleThreadedBuilder.build (SingleThreadedBuilder.java:56)
    at org.apache.maven.lifecycle.internal.LifecycleStarter.execute (LifecycleStarter.java:128)
    at org.apache.maven.DefaultMaven.doExecute (DefaultMaven.java:305)
    at org.apache.maven.DefaultMaven.doExecute (DefaultMaven.java:192)
    at org.apache.maven.DefaultMaven.execute (DefaultMaven.java:105)
    at org.apache.maven.cli.MavenCli.execute (MavenCli.java:957)
    at org.apache.maven.cli.MavenCli.doMain (MavenCli.java:289)
    at org.apache.maven.cli.MavenCli.main (MavenCli.java:193)
    at sun.reflect.NativeMethodAccessorImpl.invoke0 (Native Method)
    at sun.reflect.NativeMethodAccessorImpl.invoke (NativeMethodAccessorImpl.java:62)
    at sun.reflect.DelegatingMethodAccessorImpl.invoke (DelegatingMethodAccessorImpl.java:43)
    at java.lang.reflect.Method.invoke (Method.java:498)
    at org.codehaus.plexus.classworlds.launcher.Launcher.launchEnhanced (Launcher.java:282)
    at org.codehaus.plexus.classworlds.launcher.Launcher.launch (Launcher.java:225)
    at org.codehaus.plexus.classworlds.launcher.Launcher.mainWithExitCode (Launcher.java:406)
    at org.codehaus.plexus.classworlds.launcher.Launcher.main (Launcher.java:347)
[ERROR] 
[ERROR] Re-run Maven using the -X switch to enable full debug logging.
[ERROR] 
[ERROR] For more information about the errors and possible solutions, please read the following articles:
[ERROR] [Help 1] http://cwiki.apache.org/confluence/display/MAVEN/MojoExecutionException
[ERROR] 
[ERROR] After correcting the problems, you can resume the build with the command
[ERROR]   mvn <args> -rf :sansa-hadoop-jena