FailedConsole Output

Push event to branch feature/dasim
10:11:24 Connecting to https://api.github.com using aksw-ci/******
Obtained Jenkinsfile from 847dfe81e080807f4bab4ff7463dbd28f119e81c
Running in Durability level: MAX_SURVIVABILITY
[Pipeline] Start of Pipeline
[Pipeline] node
Running on Jenkins in /usr/share/tomcat8/.jenkins/jobs/SANSA-Stack/branches/feature-dasim.25ti5o/workspace
[Pipeline] {
[Pipeline] stage
[Pipeline] { (Declarative: Checkout SCM)
[Pipeline] checkout
using credential github-api
 > git rev-parse --is-inside-work-tree # timeout=10
Fetching changes from the remote Git repository
 > git config remote.origin.url https://github.com/SANSA-Stack/SANSA-Stack.git # timeout=10
Fetching without tags
Fetching upstream changes from https://github.com/SANSA-Stack/SANSA-Stack.git
 > git --version # timeout=10
using GIT_ASKPASS to set credentials 
 > git fetch --no-tags --progress -- https://github.com/SANSA-Stack/SANSA-Stack.git +refs/heads/feature/dasim:refs/remotes/origin/feature/dasim # timeout=10
Checking out Revision 847dfe81e080807f4bab4ff7463dbd28f119e81c (feature/dasim)
 > git config core.sparsecheckout # timeout=10
 > git checkout -f 847dfe81e080807f4bab4ff7463dbd28f119e81c # timeout=10
Commit message: "clean up"
 > git rev-list --no-walk e1fddd9403a4a7e97028a481b2be214cca8978d4 # timeout=10
[Pipeline] }
[Pipeline] // stage
[Pipeline] withEnv
[Pipeline] {
[Pipeline] withEnv
[Pipeline] {
[Pipeline] stage
[Pipeline] { (Declarative: Tool Install)
[Pipeline] tool
[Pipeline] envVarsForTool
[Pipeline] tool
[Pipeline] envVarsForTool
[Pipeline] }
[Pipeline] // stage
[Pipeline] withEnv
[Pipeline] {
[Pipeline] stage
[Pipeline] { (Initialize)
[Pipeline] tool
[Pipeline] envVarsForTool
[Pipeline] tool
[Pipeline] envVarsForTool
[Pipeline] withEnv
[Pipeline] {
[Pipeline] sh
+ echo PATH = /usr/lib/jvm/java-11-openjdk-amd64/bin:/opt/maven/bin:/usr/lib/jvm/java-11-openjdk-amd64/bin:/opt/maven/bin:/bin:/usr/bin:/sbin:/usr/sbin
PATH = /usr/lib/jvm/java-11-openjdk-amd64/bin:/opt/maven/bin:/usr/lib/jvm/java-11-openjdk-amd64/bin:/opt/maven/bin:/bin:/usr/bin:/sbin:/usr/sbin
+ echo M2_HOME = /opt/maven
M2_HOME = /opt/maven
[Pipeline] }
[Pipeline] // withEnv
[Pipeline] }
[Pipeline] // stage
[Pipeline] stage
[Pipeline] { (Build and Push to Archiva)
[Pipeline] tool
[Pipeline] envVarsForTool
[Pipeline] tool
[Pipeline] envVarsForTool
[Pipeline] withEnv
[Pipeline] {
[Pipeline] sh
+ mvn --batch-mode -V -U -e -DskipTests clean deploy -pl :sansa-query-spark_2.12 -am
Apache Maven 3.8.1 (05c21c65bdfed0f71a2f2ada8b84da59348c4c5d)
Maven home: /opt/maven
Java version: 1.8.0_292, vendor: Private Build, runtime: /usr/lib/jvm/java-8-openjdk-amd64/jre
Default locale: en_US, platform encoding: UTF-8
OS name: "linux", version: "5.4.0-1046-azure", arch: "amd64", family: "unix"
[INFO] Error stacktraces are turned on.
[INFO] Scanning for projects...
[WARNING] 
[WARNING] Some problems were encountered while building the effective model for net.sansa-stack:sansa-hadoop-jena:jar:0.8.0-RC2-SNAPSHOT
[WARNING] 'profiles.profile[root-dir].activation.file.exists' Failed to interpolate file location ${project.basedir}/scalastyle-config.xml for profile root-dir: ${project.basedir} expression not supported during profile activation, use ${basedir} instead @ net.sansa-stack:sansa-parent_2.12:0.8.0-RC2-SNAPSHOT, /usr/share/tomcat8/.jenkins/jobs/SANSA-Stack/branches/feature-dasim.25ti5o/workspace/pom.xml
[WARNING] 'profiles.profile[child-dir].activation.file.exists' Failed to interpolate file location ${project.basedir}/../lib for profile child-dir: ${project.basedir} expression not supported during profile activation, use ${basedir} instead @ net.sansa-stack:sansa-parent_2.12:0.8.0-RC2-SNAPSHOT, /usr/share/tomcat8/.jenkins/jobs/SANSA-Stack/branches/feature-dasim.25ti5o/workspace/pom.xml
[WARNING] 
[WARNING] Some problems were encountered while building the effective model for net.sansa-stack:sansa-query-tests_2.12:jar:0.8.0-RC2-SNAPSHOT
[WARNING] 'build.plugins.plugin.version' for org.scala-tools:maven-scala-plugin is missing. @ line 51, column 21
[WARNING] 
[WARNING] Some problems were encountered while building the effective model for net.sansa-stack:sansa-debian-spark-cli:jar:0.8.0-RC2-SNAPSHOT
[WARNING] 'build.plugins.plugin.version' for org.sonatype.plugins:nexus-staging-maven-plugin is missing. @ line 40, column 21
[WARNING] 'build.plugins.plugin.version' for org.apache.maven.plugins:maven-deploy-plugin is missing. @ line 32, column 21
[WARNING] 
[WARNING] Some problems were encountered while building the effective model for net.sansa-stack:sansa-parent_2.12:pom:0.8.0-RC2-SNAPSHOT
[WARNING] 'profiles.profile[root-dir].activation.file.exists' Failed to interpolate file location ${project.basedir}/scalastyle-config.xml for profile root-dir: ${project.basedir} expression not supported during profile activation, use ${basedir} instead
[WARNING] 'profiles.profile[child-dir].activation.file.exists' Failed to interpolate file location ${project.basedir}/../lib for profile child-dir: ${project.basedir} expression not supported during profile activation, use ${basedir} instead
[WARNING] 
[WARNING] It is highly recommended to fix these problems because they threaten the stability of your build.
[WARNING] 
[WARNING] For this reason, future Maven versions might no longer support building such malformed projects.
[WARNING] 
[WARNING] The project net.sansa-stack:sansa-parent_2.12:pom:0.8.0-RC2-SNAPSHOT uses prerequisites which is only intended for maven-plugin projects but not for non maven-plugin projects. For such purposes you should use the maven-enforcer-plugin. See https://maven.apache.org/enforcer/enforcer-rules/requireMavenVersion.html
[INFO] ------------------------------------------------------------------------
[INFO] Reactor Build Order:
[INFO] 
[INFO] SANSA - Parent                                                     [pom]
[INFO] sansa-test-resources_2.12                                          [jar]
[INFO] sansa-hadoop-jena                                                  [jar]
[INFO] sansa-kryo-jena                                                    [jar]
[INFO] sansa-resource-metadata                                            [jar]
[INFO] sansa-resource-testdata                                            [jar]
[INFO] SANSA Stack - RDF Layer - Parent                                   [pom]
[INFO] sansa-rdf-common_2.12                                              [jar]
[INFO] sansa-rdf-spark_2.12                                               [jar]
[INFO] SANSA Stack - DataLake Layer - Parent                              [pom]
[INFO] sansa-datalake-spark_2.12                                          [jar]
[INFO] SANSA Stack - Query Layer - Parent                                 [pom]
[INFO] sansa-query-tests_2.12                                             [jar]
[INFO] sansa-query-spark_2.12                                             [jar]
[INFO] 
[INFO] -----------------< net.sansa-stack:sansa-parent_2.12 >------------------
[INFO] Building SANSA - Parent 0.8.0-RC2-SNAPSHOT                        [1/14]
[INFO] --------------------------------[ pom ]---------------------------------
[INFO] 
[INFO] --- maven-clean-plugin:2.5:clean (default-clean) @ sansa-parent_2.12 ---
[INFO] 
[INFO] --- jacoco-maven-plugin:0.8.4:prepare-agent (prepare-agent) @ sansa-parent_2.12 ---
[INFO] argLine set to -javaagent:/usr/share/tomcat8/.m2/repository/org/jacoco/org.jacoco.agent/0.8.4/org.jacoco.agent-0.8.4-runtime.jar=destfile=/usr/share/tomcat8/.jenkins/jobs/SANSA-Stack/branches/feature-dasim.25ti5o/workspace/target/jacoco.exec
[INFO] 
[INFO] --- scala-maven-plugin:4.5.3:add-source (scala-compile-first) @ sansa-parent_2.12 ---
[INFO] Add Source directory: /usr/share/tomcat8/.jenkins/jobs/SANSA-Stack/branches/feature-dasim.25ti5o/workspace/src/main/scala
[INFO] Add Test Source directory: /usr/share/tomcat8/.jenkins/jobs/SANSA-Stack/branches/feature-dasim.25ti5o/workspace/src/test/scala
[INFO] 
[INFO] --- scala-maven-plugin:4.5.3:compile (scala-compile-first) @ sansa-parent_2.12 ---
[INFO] compile in 0.0 s
[INFO] No sources to compile
[INFO] 
[INFO] --- scala-maven-plugin:4.5.3:testCompile (scala-test-compile) @ sansa-parent_2.12 ---
[INFO] compile in 0.0 s
[INFO] No sources to compile
[INFO] 
[INFO] --- scalatest-maven-plugin:2.0.2:test (test) @ sansa-parent_2.12 ---
[INFO] Tests are skipped.
[INFO] 
[INFO] --- maven-javadoc-plugin:3.1.1:jar (attach-javadocs) @ sansa-parent_2.12 ---
[INFO] Not executing Javadoc as the project is not a Java classpath-capable package
[INFO] 
[INFO] --- maven-install-plugin:2.4:install (default-install) @ sansa-parent_2.12 ---
[INFO] Installing /usr/share/tomcat8/.jenkins/jobs/SANSA-Stack/branches/feature-dasim.25ti5o/workspace/pom.xml to /usr/share/tomcat8/.m2/repository/net/sansa-stack/sansa-parent_2.12/0.8.0-RC2-SNAPSHOT/sansa-parent_2.12-0.8.0-RC2-SNAPSHOT.pom
[INFO] 
[INFO] --- maven-deploy-plugin:2.7:deploy (default-deploy) @ sansa-parent_2.12 ---
[INFO] Downloading from maven.aksw.snapshots: https://maven.aksw.org/archiva/repository/snapshots/net/sansa-stack/sansa-parent_2.12/0.8.0-RC2-SNAPSHOT/maven-metadata.xml
[INFO] Downloaded from maven.aksw.snapshots: https://maven.aksw.org/archiva/repository/snapshots/net/sansa-stack/sansa-parent_2.12/0.8.0-RC2-SNAPSHOT/maven-metadata.xml (374 B at 308 B/s)
[INFO] Uploading to maven.aksw.snapshots: https://maven.aksw.org/archiva/repository/snapshots/net/sansa-stack/sansa-parent_2.12/0.8.0-RC2-SNAPSHOT/sansa-parent_2.12-0.8.0-RC2-20210726.081210-67.pom
[INFO] Uploaded to maven.aksw.snapshots: https://maven.aksw.org/archiva/repository/snapshots/net/sansa-stack/sansa-parent_2.12/0.8.0-RC2-SNAPSHOT/sansa-parent_2.12-0.8.0-RC2-20210726.081210-67.pom (96 kB at 80 kB/s)
[INFO] Downloading from maven.aksw.snapshots: https://maven.aksw.org/archiva/repository/snapshots/net/sansa-stack/sansa-parent_2.12/maven-metadata.xml
[INFO] Downloaded from maven.aksw.snapshots: https://maven.aksw.org/archiva/repository/snapshots/net/sansa-stack/sansa-parent_2.12/maven-metadata.xml (427 B at 457 B/s)
[INFO] Uploading to maven.aksw.snapshots: https://maven.aksw.org/archiva/repository/snapshots/net/sansa-stack/sansa-parent_2.12/0.8.0-RC2-SNAPSHOT/maven-metadata.xml
[INFO] Uploaded to maven.aksw.snapshots: https://maven.aksw.org/archiva/repository/snapshots/net/sansa-stack/sansa-parent_2.12/0.8.0-RC2-SNAPSHOT/maven-metadata.xml (619 B at 5.7 kB/s)
[INFO] Uploading to maven.aksw.snapshots: https://maven.aksw.org/archiva/repository/snapshots/net/sansa-stack/sansa-parent_2.12/maven-metadata.xml
[INFO] Uploaded to maven.aksw.snapshots: https://maven.aksw.org/archiva/repository/snapshots/net/sansa-stack/sansa-parent_2.12/maven-metadata.xml (426 B at 22 kB/s)
[INFO] 
[INFO] -------------< net.sansa-stack:sansa-test-resources_2.12 >--------------
[INFO] Building sansa-test-resources_2.12 0.8.0-RC2-SNAPSHOT             [2/14]
[INFO] --------------------------------[ jar ]---------------------------------
[INFO] 
[INFO] --- maven-clean-plugin:2.5:clean (default-clean) @ sansa-test-resources_2.12 ---
[INFO] Deleting /usr/share/tomcat8/.jenkins/jobs/SANSA-Stack/branches/feature-dasim.25ti5o/workspace/sansa-test-resources/target
[INFO] 
[INFO] --- jacoco-maven-plugin:0.8.4:prepare-agent (prepare-agent) @ sansa-test-resources_2.12 ---
[INFO] argLine set to -javaagent:/usr/share/tomcat8/.m2/repository/org/jacoco/org.jacoco.agent/0.8.4/org.jacoco.agent-0.8.4-runtime.jar=destfile=/usr/share/tomcat8/.jenkins/jobs/SANSA-Stack/branches/feature-dasim.25ti5o/workspace/sansa-test-resources/target/jacoco.exec
[INFO] 
[INFO] --- maven-resources-plugin:3.0.2:resources (default-resources) @ sansa-test-resources_2.12 ---
[INFO] Using 'UTF-8' encoding to copy filtered resources.
[INFO] Copying 1 resource
[INFO] 
[INFO] --- scala-maven-plugin:4.5.3:add-source (scala-compile-first) @ sansa-test-resources_2.12 ---
[INFO] Add Source directory: /usr/share/tomcat8/.jenkins/jobs/SANSA-Stack/branches/feature-dasim.25ti5o/workspace/sansa-test-resources/src/main/scala
[INFO] Add Test Source directory: /usr/share/tomcat8/.jenkins/jobs/SANSA-Stack/branches/feature-dasim.25ti5o/workspace/sansa-test-resources/src/test/scala
[INFO] 
[INFO] --- scala-maven-plugin:4.5.3:compile (scala-compile-first) @ sansa-test-resources_2.12 ---
[INFO] compile in 0.0 s
[INFO] No sources to compile
[INFO] 
[INFO] --- maven-compiler-plugin:3.8.1:compile (default-compile) @ sansa-test-resources_2.12 ---
[INFO] No sources to compile
[INFO] 
[INFO] --- maven-resources-plugin:3.0.2:testResources (default-testResources) @ sansa-test-resources_2.12 ---
[INFO] Using 'UTF-8' encoding to copy filtered resources.
[INFO] skip non existing resourceDirectory /usr/share/tomcat8/.jenkins/jobs/SANSA-Stack/branches/feature-dasim.25ti5o/workspace/sansa-test-resources/src/test/resources
[INFO] 
[INFO] --- scala-maven-plugin:4.5.3:testCompile (scala-test-compile) @ sansa-test-resources_2.12 ---
[INFO] compile in 0.0 s
[INFO] No sources to compile
[INFO] 
[INFO] --- maven-compiler-plugin:3.8.1:testCompile (default-testCompile) @ sansa-test-resources_2.12 ---
[INFO] No sources to compile
[INFO] 
[INFO] --- maven-surefire-plugin:2.22.2:test (default-test) @ sansa-test-resources_2.12 ---
[INFO] Tests are skipped.
[INFO] 
[INFO] --- scalatest-maven-plugin:2.0.2:test (test) @ sansa-test-resources_2.12 ---
[INFO] Tests are skipped.
[INFO] 
[INFO] --- maven-jar-plugin:3.2.0:jar (default-jar) @ sansa-test-resources_2.12 ---
[INFO] Building jar: /usr/share/tomcat8/.jenkins/jobs/SANSA-Stack/branches/feature-dasim.25ti5o/workspace/sansa-test-resources/target/sansa-test-resources_2.12-0.8.0-RC2-SNAPSHOT.jar
[INFO] 
[INFO] --- maven-javadoc-plugin:3.1.1:jar (attach-javadocs) @ sansa-test-resources_2.12 ---
[INFO] 
[INFO] --- maven-install-plugin:2.4:install (default-install) @ sansa-test-resources_2.12 ---
[INFO] Installing /usr/share/tomcat8/.jenkins/jobs/SANSA-Stack/branches/feature-dasim.25ti5o/workspace/sansa-test-resources/target/sansa-test-resources_2.12-0.8.0-RC2-SNAPSHOT.jar to /usr/share/tomcat8/.m2/repository/net/sansa-stack/sansa-test-resources_2.12/0.8.0-RC2-SNAPSHOT/sansa-test-resources_2.12-0.8.0-RC2-SNAPSHOT.jar
[INFO] Installing /usr/share/tomcat8/.jenkins/jobs/SANSA-Stack/branches/feature-dasim.25ti5o/workspace/sansa-test-resources/pom.xml to /usr/share/tomcat8/.m2/repository/net/sansa-stack/sansa-test-resources_2.12/0.8.0-RC2-SNAPSHOT/sansa-test-resources_2.12-0.8.0-RC2-SNAPSHOT.pom
[INFO] 
[INFO] --- maven-deploy-plugin:2.7:deploy (default-deploy) @ sansa-test-resources_2.12 ---
[INFO] Downloading from maven.aksw.snapshots: https://maven.aksw.org/archiva/repository/snapshots/net/sansa-stack/sansa-test-resources_2.12/0.8.0-RC2-SNAPSHOT/maven-metadata.xml
[INFO] Downloaded from maven.aksw.snapshots: https://maven.aksw.org/archiva/repository/snapshots/net/sansa-stack/sansa-test-resources_2.12/0.8.0-RC2-SNAPSHOT/maven-metadata.xml (382 B at 3.5 kB/s)
[INFO] Uploading to maven.aksw.snapshots: https://maven.aksw.org/archiva/repository/snapshots/net/sansa-stack/sansa-test-resources_2.12/0.8.0-RC2-SNAPSHOT/sansa-test-resources_2.12-0.8.0-RC2-20210726.081216-66.jar
[INFO] Uploaded to maven.aksw.snapshots: https://maven.aksw.org/archiva/repository/snapshots/net/sansa-stack/sansa-test-resources_2.12/0.8.0-RC2-SNAPSHOT/sansa-test-resources_2.12-0.8.0-RC2-20210726.081216-66.jar (1.9 kB at 7.3 kB/s)
[INFO] Uploading to maven.aksw.snapshots: https://maven.aksw.org/archiva/repository/snapshots/net/sansa-stack/sansa-test-resources_2.12/0.8.0-RC2-SNAPSHOT/sansa-test-resources_2.12-0.8.0-RC2-20210726.081216-66.pom
[INFO] Uploaded to maven.aksw.snapshots: https://maven.aksw.org/archiva/repository/snapshots/net/sansa-stack/sansa-test-resources_2.12/0.8.0-RC2-SNAPSHOT/sansa-test-resources_2.12-0.8.0-RC2-20210726.081216-66.pom (718 B at 26 kB/s)
[INFO] Downloading from maven.aksw.snapshots: https://maven.aksw.org/archiva/repository/snapshots/net/sansa-stack/sansa-test-resources_2.12/maven-metadata.xml
[INFO] Downloaded from maven.aksw.snapshots: https://maven.aksw.org/archiva/repository/snapshots/net/sansa-stack/sansa-test-resources_2.12/maven-metadata.xml (385 B at 35 kB/s)
[INFO] Uploading to maven.aksw.snapshots: https://maven.aksw.org/archiva/repository/snapshots/net/sansa-stack/sansa-test-resources_2.12/0.8.0-RC2-SNAPSHOT/maven-metadata.xml
[INFO] Uploaded to maven.aksw.snapshots: https://maven.aksw.org/archiva/repository/snapshots/net/sansa-stack/sansa-test-resources_2.12/0.8.0-RC2-SNAPSHOT/maven-metadata.xml (805 B at 42 kB/s)
[INFO] Uploading to maven.aksw.snapshots: https://maven.aksw.org/archiva/repository/snapshots/net/sansa-stack/sansa-test-resources_2.12/maven-metadata.xml
[INFO] Uploaded to maven.aksw.snapshots: https://maven.aksw.org/archiva/repository/snapshots/net/sansa-stack/sansa-test-resources_2.12/maven-metadata.xml (384 B at 23 kB/s)
[INFO] 
[INFO] -----------------< net.sansa-stack:sansa-hadoop-jena >------------------
[INFO] Building sansa-hadoop-jena 0.8.0-RC2-SNAPSHOT                     [3/14]
[INFO] --------------------------------[ jar ]---------------------------------
[INFO] Downloading from oss-sonatype-releases: https://oss.sonatype.org/content/repositories/releases/net/minidev/json-smart/maven-metadata.xml
[INFO] Downloading from central: https://repo.maven.apache.org/maven2/net/minidev/json-smart/maven-metadata.xml
[INFO] Downloading from maven.aksw.snapshots: https://maven.aksw.org/archiva/repository/snapshots/net/minidev/json-smart/maven-metadata.xml
[INFO] Downloading from maven.aksw.internal: https://maven.aksw.org/archiva/repository/internal/net/minidev/json-smart/maven-metadata.xml
[INFO] Downloading from apache.snapshots.https: https://repository.apache.org/content/repositories/snapshots/net/minidev/json-smart/maven-metadata.xml
[INFO] Downloaded from maven.aksw.internal: https://maven.aksw.org/archiva/repository/internal/net/minidev/json-smart/maven-metadata.xml (383 B at 9.8 kB/s)
[INFO] Downloading from maven-default-http-blocker: http://0.0.0.0/net/minidev/json-smart/maven-metadata.xml
[INFO] Downloaded from central: https://repo.maven.apache.org/maven2/net/minidev/json-smart/maven-metadata.xml (1.1 kB at 6.7 kB/s)
[INFO] Downloaded from oss-sonatype-releases: https://oss.sonatype.org/content/repositories/releases/net/minidev/json-smart/maven-metadata.xml (1.1 kB at 1.3 kB/s)
[WARNING] Could not transfer metadata net.minidev:json-smart/maven-metadata.xml from/to maven-default-http-blocker (http://0.0.0.0/): transfer failed for http://0.0.0.0/net/minidev/json-smart/maven-metadata.xml
[INFO] Downloading from maven.aksw.snapshots: https://maven.aksw.org/archiva/repository/snapshots/org/aksw/commons/aksw-commons-collectors/0.9.1-SNAPSHOT/maven-metadata.xml
[INFO] Downloaded from maven.aksw.snapshots: https://maven.aksw.org/archiva/repository/snapshots/org/aksw/commons/aksw-commons-collectors/0.9.1-SNAPSHOT/maven-metadata.xml (377 B at 12 kB/s)
[INFO] Downloading from maven.aksw.snapshots: https://maven.aksw.org/archiva/repository/snapshots/org/aksw/commons/aksw-commons-collectors/0.9.1-SNAPSHOT/aksw-commons-collectors-0.9.1-20210724.142832-27.pom
[INFO] Downloaded from maven.aksw.snapshots: https://maven.aksw.org/archiva/repository/snapshots/org/aksw/commons/aksw-commons-collectors/0.9.1-SNAPSHOT/aksw-commons-collectors-0.9.1-20210724.142832-27.pom (902 B at 75 kB/s)
[INFO] Downloading from maven.aksw.snapshots: https://maven.aksw.org/archiva/repository/snapshots/org/aksw/commons/aksw-commons-parent/0.9.1-SNAPSHOT/maven-metadata.xml
[INFO] Downloaded from maven.aksw.snapshots: https://maven.aksw.org/archiva/repository/snapshots/org/aksw/commons/aksw-commons-parent/0.9.1-SNAPSHOT/maven-metadata.xml (373 B at 27 kB/s)
[INFO] Downloading from maven.aksw.snapshots: https://maven.aksw.org/archiva/repository/snapshots/org/aksw/commons/aksw-commons-parent/0.9.1-SNAPSHOT/aksw-commons-parent-0.9.1-20210724.142451-27.pom
[INFO] Downloaded from maven.aksw.snapshots: https://maven.aksw.org/archiva/repository/snapshots/org/aksw/commons/aksw-commons-parent/0.9.1-SNAPSHOT/aksw-commons-parent-0.9.1-20210724.142451-27.pom (13 kB at 840 kB/s)
[INFO] Downloading from maven.aksw.snapshots: https://maven.aksw.org/archiva/repository/snapshots/org/aksw/commons/aksw-commons-lambdas-serializable/0.9.1-SNAPSHOT/maven-metadata.xml
[INFO] Downloading from maven-default-http-blocker: http://0.0.0.0/org/aksw/commons/aksw-commons-lambdas-serializable/0.9.1-SNAPSHOT/maven-metadata.xml
[INFO] Downloaded from maven.aksw.snapshots: https://maven.aksw.org/archiva/repository/snapshots/org/aksw/commons/aksw-commons-lambdas-serializable/0.9.1-SNAPSHOT/maven-metadata.xml (387 B at 12 kB/s)
[WARNING] Could not transfer metadata org.aksw.commons:aksw-commons-lambdas-serializable:0.9.1-SNAPSHOT/maven-metadata.xml from/to maven-default-http-blocker (http://0.0.0.0/): transfer failed for http://0.0.0.0/org/aksw/commons/aksw-commons-lambdas-serializable/0.9.1-SNAPSHOT/maven-metadata.xml
[WARNING] org.aksw.commons:aksw-commons-lambdas-serializable:0.9.1-SNAPSHOT/maven-metadata.xmlfailed to transfer from http://0.0.0.0/ during a previous attempt. This failure was cached in the local repository and resolution will not be reattempted until the update interval of maven-default-http-blocker has elapsed or updates are forced. Original error: Could not transfer metadata org.aksw.commons:aksw-commons-lambdas-serializable:0.9.1-SNAPSHOT/maven-metadata.xml from/to maven-default-http-blocker (http://0.0.0.0/): transfer failed for http://0.0.0.0/org/aksw/commons/aksw-commons-lambdas-serializable/0.9.1-SNAPSHOT/maven-metadata.xml
[INFO] Downloading from maven.aksw.snapshots: https://maven.aksw.org/archiva/repository/snapshots/org/aksw/commons/aksw-commons-lambdas-serializable/0.9.1-SNAPSHOT/aksw-commons-lambdas-serializable-0.9.1-20210724.142742-27.pom
[INFO] Downloaded from maven.aksw.snapshots: https://maven.aksw.org/archiva/repository/snapshots/org/aksw/commons/aksw-commons-lambdas-serializable/0.9.1-SNAPSHOT/aksw-commons-lambdas-serializable-0.9.1-20210724.142742-27.pom (566 B at 23 kB/s)
[INFO] Downloading from maven.aksw.snapshots: https://maven.aksw.org/archiva/repository/snapshots/org/aksw/commons/aksw-commons-lambdas-parent/0.9.1-SNAPSHOT/maven-metadata.xml
[INFO] Downloading from maven-default-http-blocker: http://0.0.0.0/org/aksw/commons/aksw-commons-lambdas-parent/0.9.1-SNAPSHOT/maven-metadata.xml
[INFO] Downloaded from maven.aksw.snapshots: https://maven.aksw.org/archiva/repository/snapshots/org/aksw/commons/aksw-commons-lambdas-parent/0.9.1-SNAPSHOT/maven-metadata.xml (381 B at 20 kB/s)
[WARNING] Could not transfer metadata org.aksw.commons:aksw-commons-lambdas-parent:0.9.1-SNAPSHOT/maven-metadata.xml from/to maven-default-http-blocker (http://0.0.0.0/): transfer failed for http://0.0.0.0/org/aksw/commons/aksw-commons-lambdas-parent/0.9.1-SNAPSHOT/maven-metadata.xml
[INFO] Downloading from maven.aksw.snapshots: https://maven.aksw.org/archiva/repository/snapshots/org/aksw/commons/aksw-commons-lambdas-parent/0.9.1-SNAPSHOT/aksw-commons-lambdas-parent-0.9.1-20210724.142734-27.pom
[INFO] Downloaded from maven.aksw.snapshots: https://maven.aksw.org/archiva/repository/snapshots/org/aksw/commons/aksw-commons-lambdas-parent/0.9.1-SNAPSHOT/aksw-commons-lambdas-parent-0.9.1-20210724.142734-27.pom (1.0 kB at 91 kB/s)
[INFO] Downloading from maven.aksw.snapshots: https://maven.aksw.org/archiva/repository/snapshots/org/aksw/jena-sparql-api/jena-sparql-api-rx/4.0.0-1-SNAPSHOT/maven-metadata.xml
[INFO] Downloaded from maven.aksw.snapshots: https://maven.aksw.org/archiva/repository/snapshots/org/aksw/jena-sparql-api/jena-sparql-api-rx/4.0.0-1-SNAPSHOT/maven-metadata.xml (382 B at 12 kB/s)
[INFO] Downloading from maven.aksw.snapshots: https://maven.aksw.org/archiva/repository/snapshots/org/aksw/jena-sparql-api/jena-sparql-api-parent/4.0.0-1-SNAPSHOT/maven-metadata.xml
[INFO] Downloaded from maven.aksw.snapshots: https://maven.aksw.org/archiva/repository/snapshots/org/aksw/jena-sparql-api/jena-sparql-api-parent/4.0.0-1-SNAPSHOT/maven-metadata.xml (386 B at 19 kB/s)
[INFO] Downloading from maven.aksw.snapshots: https://maven.aksw.org/archiva/repository/snapshots/org/aksw/jena-sparql-api/jena-sparql-api-concepts/4.0.0-1-SNAPSHOT/maven-metadata.xml
[INFO] Downloading from maven-default-http-blocker: http://0.0.0.0/org/aksw/jena-sparql-api/jena-sparql-api-concepts/4.0.0-1-SNAPSHOT/maven-metadata.xml
[INFO] Downloaded from maven.aksw.snapshots: https://maven.aksw.org/archiva/repository/snapshots/org/aksw/jena-sparql-api/jena-sparql-api-concepts/4.0.0-1-SNAPSHOT/maven-metadata.xml (388 B at 23 kB/s)
[WARNING] Could not transfer metadata org.aksw.jena-sparql-api:jena-sparql-api-concepts:4.0.0-1-SNAPSHOT/maven-metadata.xml from/to maven-default-http-blocker (http://0.0.0.0/): transfer failed for http://0.0.0.0/org/aksw/jena-sparql-api/jena-sparql-api-concepts/4.0.0-1-SNAPSHOT/maven-metadata.xml
[WARNING] org.aksw.jena-sparql-api:jena-sparql-api-concepts:4.0.0-1-SNAPSHOT/maven-metadata.xmlfailed to transfer from http://0.0.0.0/ during a previous attempt. This failure was cached in the local repository and resolution will not be reattempted until the update interval of maven-default-http-blocker has elapsed or updates are forced. Original error: Could not transfer metadata org.aksw.jena-sparql-api:jena-sparql-api-concepts:4.0.0-1-SNAPSHOT/maven-metadata.xml from/to maven-default-http-blocker (http://0.0.0.0/): transfer failed for http://0.0.0.0/org/aksw/jena-sparql-api/jena-sparql-api-concepts/4.0.0-1-SNAPSHOT/maven-metadata.xml
[INFO] Downloading from maven.aksw.snapshots: https://maven.aksw.org/archiva/repository/snapshots/org/aksw/jena-sparql-api/jena-sparql-api-stmt/4.0.0-1-SNAPSHOT/maven-metadata.xml
[INFO] Downloading from maven-default-http-blocker: http://0.0.0.0/org/aksw/jena-sparql-api/jena-sparql-api-stmt/4.0.0-1-SNAPSHOT/maven-metadata.xml
[INFO] Downloaded from maven.aksw.snapshots: https://maven.aksw.org/archiva/repository/snapshots/org/aksw/jena-sparql-api/jena-sparql-api-stmt/4.0.0-1-SNAPSHOT/maven-metadata.xml (384 B at 32 kB/s)
[WARNING] Could not transfer metadata org.aksw.jena-sparql-api:jena-sparql-api-stmt:4.0.0-1-SNAPSHOT/maven-metadata.xml from/to maven-default-http-blocker (http://0.0.0.0/): transfer failed for http://0.0.0.0/org/aksw/jena-sparql-api/jena-sparql-api-stmt/4.0.0-1-SNAPSHOT/maven-metadata.xml
[WARNING] org.aksw.jena-sparql-api:jena-sparql-api-stmt:4.0.0-1-SNAPSHOT/maven-metadata.xmlfailed to transfer from http://0.0.0.0/ during a previous attempt. This failure was cached in the local repository and resolution will not be reattempted until the update interval of maven-default-http-blocker has elapsed or updates are forced. Original error: Could not transfer metadata org.aksw.jena-sparql-api:jena-sparql-api-stmt:4.0.0-1-SNAPSHOT/maven-metadata.xml from/to maven-default-http-blocker (http://0.0.0.0/): transfer failed for http://0.0.0.0/org/aksw/jena-sparql-api/jena-sparql-api-stmt/4.0.0-1-SNAPSHOT/maven-metadata.xml
[INFO] Downloading from maven-default-http-blocker: http://0.0.0.0/org/aksw/jena-sparql-api/jena-sparql-api-resources/4.0.0-1-SNAPSHOT/maven-metadata.xml
[INFO] Downloading from maven.aksw.snapshots: https://maven.aksw.org/archiva/repository/snapshots/org/aksw/jena-sparql-api/jena-sparql-api-resources/4.0.0-1-SNAPSHOT/maven-metadata.xml
[INFO] Downloaded from maven.aksw.snapshots: https://maven.aksw.org/archiva/repository/snapshots/org/aksw/jena-sparql-api/jena-sparql-api-resources/4.0.0-1-SNAPSHOT/maven-metadata.xml (389 B at 13 kB/s)
[WARNING] Could not transfer metadata org.aksw.jena-sparql-api:jena-sparql-api-resources:4.0.0-1-SNAPSHOT/maven-metadata.xml from/to maven-default-http-blocker (http://0.0.0.0/): transfer failed for http://0.0.0.0/org/aksw/jena-sparql-api/jena-sparql-api-resources/4.0.0-1-SNAPSHOT/maven-metadata.xml
[WARNING] org.aksw.jena-sparql-api:jena-sparql-api-resources:4.0.0-1-SNAPSHOT/maven-metadata.xmlfailed to transfer from http://0.0.0.0/ during a previous attempt. This failure was cached in the local repository and resolution will not be reattempted until the update interval of maven-default-http-blocker has elapsed or updates are forced. Original error: Could not transfer metadata org.aksw.jena-sparql-api:jena-sparql-api-resources:4.0.0-1-SNAPSHOT/maven-metadata.xml from/to maven-default-http-blocker (http://0.0.0.0/): transfer failed for http://0.0.0.0/org/aksw/jena-sparql-api/jena-sparql-api-resources/4.0.0-1-SNAPSHOT/maven-metadata.xml
[INFO] Downloading from maven.aksw.snapshots: https://maven.aksw.org/archiva/repository/snapshots/org/aksw/jena-sparql-api/jena-sparql-api-utils/4.0.0-1-SNAPSHOT/maven-metadata.xml
[INFO] Downloading from maven-default-http-blocker: http://0.0.0.0/org/aksw/jena-sparql-api/jena-sparql-api-utils/4.0.0-1-SNAPSHOT/maven-metadata.xml
[INFO] Downloaded from maven.aksw.snapshots: https://maven.aksw.org/archiva/repository/snapshots/org/aksw/jena-sparql-api/jena-sparql-api-utils/4.0.0-1-SNAPSHOT/maven-metadata.xml (385 B at 3.1 kB/s)
[WARNING] Could not transfer metadata org.aksw.jena-sparql-api:jena-sparql-api-utils:4.0.0-1-SNAPSHOT/maven-metadata.xml from/to maven-default-http-blocker (http://0.0.0.0/): transfer failed for http://0.0.0.0/org/aksw/jena-sparql-api/jena-sparql-api-utils/4.0.0-1-SNAPSHOT/maven-metadata.xml
[WARNING] org.aksw.jena-sparql-api:jena-sparql-api-utils:4.0.0-1-SNAPSHOT/maven-metadata.xmlfailed to transfer from http://0.0.0.0/ during a previous attempt. This failure was cached in the local repository and resolution will not be reattempted until the update interval of maven-default-http-blocker has elapsed or updates are forced. Original error: Could not transfer metadata org.aksw.jena-sparql-api:jena-sparql-api-utils:4.0.0-1-SNAPSHOT/maven-metadata.xml from/to maven-default-http-blocker (http://0.0.0.0/): transfer failed for http://0.0.0.0/org/aksw/jena-sparql-api/jena-sparql-api-utils/4.0.0-1-SNAPSHOT/maven-metadata.xml
[INFO] Downloading from maven.aksw.snapshots: https://maven.aksw.org/archiva/repository/snapshots/org/aksw/commons/aksw-commons-collections/0.9.1-SNAPSHOT/maven-metadata.xml
[INFO] Downloading from maven-default-http-blocker: http://0.0.0.0/org/aksw/commons/aksw-commons-collections/0.9.1-SNAPSHOT/maven-metadata.xml
[INFO] Downloaded from maven.aksw.snapshots: https://maven.aksw.org/archiva/repository/snapshots/org/aksw/commons/aksw-commons-collections/0.9.1-SNAPSHOT/maven-metadata.xml (378 B at 32 kB/s)
[WARNING] Could not transfer metadata org.aksw.commons:aksw-commons-collections:0.9.1-SNAPSHOT/maven-metadata.xml from/to maven-default-http-blocker (http://0.0.0.0/): transfer failed for http://0.0.0.0/org/aksw/commons/aksw-commons-collections/0.9.1-SNAPSHOT/maven-metadata.xml
[WARNING] org.aksw.commons:aksw-commons-collections:0.9.1-SNAPSHOT/maven-metadata.xmlfailed to transfer from http://0.0.0.0/ during a previous attempt. This failure was cached in the local repository and resolution will not be reattempted until the update interval of maven-default-http-blocker has elapsed or updates are forced. Original error: Could not transfer metadata org.aksw.commons:aksw-commons-collections:0.9.1-SNAPSHOT/maven-metadata.xml from/to maven-default-http-blocker (http://0.0.0.0/): transfer failed for http://0.0.0.0/org/aksw/commons/aksw-commons-collections/0.9.1-SNAPSHOT/maven-metadata.xml
[INFO] Downloading from maven.aksw.snapshots: https://maven.aksw.org/archiva/repository/snapshots/org/aksw/commons/aksw-commons-collections/0.9.1-SNAPSHOT/aksw-commons-collections-0.9.1-20210724.142531-27.pom
[INFO] Downloaded from maven.aksw.snapshots: https://maven.aksw.org/archiva/repository/snapshots/org/aksw/commons/aksw-commons-collections/0.9.1-SNAPSHOT/aksw-commons-collections-0.9.1-20210724.142531-27.pom (1.2 kB at 94 kB/s)
[INFO] Downloading from maven.aksw.snapshots: https://maven.aksw.org/archiva/repository/snapshots/org/aksw/commons/aksw-commons-util/0.9.1-SNAPSHOT/maven-metadata.xml
[INFO] Downloading from maven-default-http-blocker: http://0.0.0.0/org/aksw/commons/aksw-commons-util/0.9.1-SNAPSHOT/maven-metadata.xml
[INFO] Downloaded from maven.aksw.snapshots: https://maven.aksw.org/archiva/repository/snapshots/org/aksw/commons/aksw-commons-util/0.9.1-SNAPSHOT/maven-metadata.xml (371 B at 5.9 kB/s)
[WARNING] Could not transfer metadata org.aksw.commons:aksw-commons-util:0.9.1-SNAPSHOT/maven-metadata.xml from/to maven-default-http-blocker (http://0.0.0.0/): transfer failed for http://0.0.0.0/org/aksw/commons/aksw-commons-util/0.9.1-SNAPSHOT/maven-metadata.xml
[WARNING] org.aksw.commons:aksw-commons-util:0.9.1-SNAPSHOT/maven-metadata.xmlfailed to transfer from http://0.0.0.0/ during a previous attempt. This failure was cached in the local repository and resolution will not be reattempted until the update interval of maven-default-http-blocker has elapsed or updates are forced. Original error: Could not transfer metadata org.aksw.commons:aksw-commons-util:0.9.1-SNAPSHOT/maven-metadata.xml from/to maven-default-http-blocker (http://0.0.0.0/): transfer failed for http://0.0.0.0/org/aksw/commons/aksw-commons-util/0.9.1-SNAPSHOT/maven-metadata.xml
[INFO] Downloading from maven.aksw.snapshots: https://maven.aksw.org/archiva/repository/snapshots/org/aksw/commons/aksw-commons-util/0.9.1-SNAPSHOT/aksw-commons-util-0.9.1-20210724.142602-29.pom
[INFO] Downloaded from maven.aksw.snapshots: https://maven.aksw.org/archiva/repository/snapshots/org/aksw/commons/aksw-commons-util/0.9.1-SNAPSHOT/aksw-commons-util-0.9.1-20210724.142602-29.pom (1.2 kB at 106 kB/s)
[INFO] Downloading from maven-default-http-blocker: http://0.0.0.0/org/aksw/jena-sparql-api/jena-sparql-api-collections/4.0.0-1-SNAPSHOT/maven-metadata.xml
[INFO] Downloading from maven.aksw.snapshots: https://maven.aksw.org/archiva/repository/snapshots/org/aksw/jena-sparql-api/jena-sparql-api-collections/4.0.0-1-SNAPSHOT/maven-metadata.xml
[INFO] Downloaded from maven.aksw.snapshots: https://maven.aksw.org/archiva/repository/snapshots/org/aksw/jena-sparql-api/jena-sparql-api-collections/4.0.0-1-SNAPSHOT/maven-metadata.xml (391 B at 30 kB/s)
[WARNING] Could not transfer metadata org.aksw.jena-sparql-api:jena-sparql-api-collections:4.0.0-1-SNAPSHOT/maven-metadata.xml from/to maven-default-http-blocker (http://0.0.0.0/): transfer failed for http://0.0.0.0/org/aksw/jena-sparql-api/jena-sparql-api-collections/4.0.0-1-SNAPSHOT/maven-metadata.xml
[WARNING] org.aksw.jena-sparql-api:jena-sparql-api-collections:4.0.0-1-SNAPSHOT/maven-metadata.xmlfailed to transfer from http://0.0.0.0/ during a previous attempt. This failure was cached in the local repository and resolution will not be reattempted until the update interval of maven-default-http-blocker has elapsed or updates are forced. Original error: Could not transfer metadata org.aksw.jena-sparql-api:jena-sparql-api-collections:4.0.0-1-SNAPSHOT/maven-metadata.xml from/to maven-default-http-blocker (http://0.0.0.0/): transfer failed for http://0.0.0.0/org/aksw/jena-sparql-api/jena-sparql-api-collections/4.0.0-1-SNAPSHOT/maven-metadata.xml
[INFO] Downloading from maven.aksw.snapshots: https://maven.aksw.org/archiva/repository/snapshots/org/aksw/jena-sparql-api/jena-sparql-api-mapper-annotations/4.0.0-1-SNAPSHOT/maven-metadata.xml
[INFO] Downloading from maven-default-http-blocker: http://0.0.0.0/org/aksw/jena-sparql-api/jena-sparql-api-mapper-annotations/4.0.0-1-SNAPSHOT/maven-metadata.xml
[INFO] Downloaded from maven.aksw.snapshots: https://maven.aksw.org/archiva/repository/snapshots/org/aksw/jena-sparql-api/jena-sparql-api-mapper-annotations/4.0.0-1-SNAPSHOT/maven-metadata.xml (398 B at 33 kB/s)
[WARNING] Could not transfer metadata org.aksw.jena-sparql-api:jena-sparql-api-mapper-annotations:4.0.0-1-SNAPSHOT/maven-metadata.xml from/to maven-default-http-blocker (http://0.0.0.0/): transfer failed for http://0.0.0.0/org/aksw/jena-sparql-api/jena-sparql-api-mapper-annotations/4.0.0-1-SNAPSHOT/maven-metadata.xml
[WARNING] org.aksw.jena-sparql-api:jena-sparql-api-mapper-annotations:4.0.0-1-SNAPSHOT/maven-metadata.xmlfailed to transfer from http://0.0.0.0/ during a previous attempt. This failure was cached in the local repository and resolution will not be reattempted until the update interval of maven-default-http-blocker has elapsed or updates are forced. Original error: Could not transfer metadata org.aksw.jena-sparql-api:jena-sparql-api-mapper-annotations:4.0.0-1-SNAPSHOT/maven-metadata.xml from/to maven-default-http-blocker (http://0.0.0.0/): transfer failed for http://0.0.0.0/org/aksw/jena-sparql-api/jena-sparql-api-mapper-annotations/4.0.0-1-SNAPSHOT/maven-metadata.xml
[INFO] Downloading from maven.aksw.snapshots: https://maven.aksw.org/archiva/repository/snapshots/org/aksw/commons/aksw-commons-rx/0.9.1-SNAPSHOT/maven-metadata.xml
[INFO] Downloading from maven-default-http-blocker: http://0.0.0.0/org/aksw/commons/aksw-commons-rx/0.9.1-SNAPSHOT/maven-metadata.xml
[INFO] Downloaded from maven.aksw.snapshots: https://maven.aksw.org/archiva/repository/snapshots/org/aksw/commons/aksw-commons-rx/0.9.1-SNAPSHOT/maven-metadata.xml (369 B at 37 kB/s)
[WARNING] Could not transfer metadata org.aksw.commons:aksw-commons-rx:0.9.1-SNAPSHOT/maven-metadata.xml from/to maven-default-http-blocker (http://0.0.0.0/): transfer failed for http://0.0.0.0/org/aksw/commons/aksw-commons-rx/0.9.1-SNAPSHOT/maven-metadata.xml
[WARNING] org.aksw.commons:aksw-commons-rx:0.9.1-SNAPSHOT/maven-metadata.xmlfailed to transfer from http://0.0.0.0/ during a previous attempt. This failure was cached in the local repository and resolution will not be reattempted until the update interval of maven-default-http-blocker has elapsed or updates are forced. Original error: Could not transfer metadata org.aksw.commons:aksw-commons-rx:0.9.1-SNAPSHOT/maven-metadata.xml from/to maven-default-http-blocker (http://0.0.0.0/): transfer failed for http://0.0.0.0/org/aksw/commons/aksw-commons-rx/0.9.1-SNAPSHOT/maven-metadata.xml
[INFO] Downloading from maven.aksw.snapshots: https://maven.aksw.org/archiva/repository/snapshots/org/aksw/commons/aksw-commons-rx/0.9.1-SNAPSHOT/aksw-commons-rx-0.9.1-20210724.143404-27.pom
[INFO] Downloaded from maven.aksw.snapshots: https://maven.aksw.org/archiva/repository/snapshots/org/aksw/commons/aksw-commons-rx/0.9.1-SNAPSHOT/aksw-commons-rx-0.9.1-20210724.143404-27.pom (2.3 kB at 232 kB/s)
[INFO] Downloading from oss-sonatype-releases: https://oss.sonatype.org/content/repositories/releases/com/github/ben-manes/caffeine/caffeine/3.0.3/caffeine-3.0.3.pom
[INFO] Downloaded from oss-sonatype-releases: https://oss.sonatype.org/content/repositories/releases/com/github/ben-manes/caffeine/caffeine/3.0.3/caffeine-3.0.3.pom (2.1 kB at 4.3 kB/s)
[INFO] Downloading from oss-sonatype-releases: https://oss.sonatype.org/content/repositories/releases/org/checkerframework/checker-qual/3.15.0/checker-qual-3.15.0.pom
[INFO] Downloaded from oss-sonatype-releases: https://oss.sonatype.org/content/repositories/releases/org/checkerframework/checker-qual/3.15.0/checker-qual-3.15.0.pom (2.1 kB at 4.5 kB/s)
[INFO] Downloading from oss-sonatype-releases: https://oss.sonatype.org/content/repositories/releases/com/google/errorprone/error_prone_annotations/2.7.1/error_prone_annotations-2.7.1.pom
[INFO] Downloaded from oss-sonatype-releases: https://oss.sonatype.org/content/repositories/releases/com/google/errorprone/error_prone_annotations/2.7.1/error_prone_annotations-2.7.1.pom (2.1 kB at 4.6 kB/s)
[INFO] Downloading from oss-sonatype-releases: https://oss.sonatype.org/content/repositories/releases/com/google/errorprone/error_prone_parent/2.7.1/error_prone_parent-2.7.1.pom
[INFO] Downloaded from oss-sonatype-releases: https://oss.sonatype.org/content/repositories/releases/com/google/errorprone/error_prone_parent/2.7.1/error_prone_parent-2.7.1.pom (7.0 kB at 15 kB/s)
[INFO] Downloading from maven-default-http-blocker: http://0.0.0.0/org/aksw/commons/aksw-commons-io-utils/0.9.1-SNAPSHOT/maven-metadata.xml
[INFO] Downloading from maven.aksw.snapshots: https://maven.aksw.org/archiva/repository/snapshots/org/aksw/commons/aksw-commons-io-utils/0.9.1-SNAPSHOT/maven-metadata.xml
[INFO] Downloaded from maven.aksw.snapshots: https://maven.aksw.org/archiva/repository/snapshots/org/aksw/commons/aksw-commons-io-utils/0.9.1-SNAPSHOT/maven-metadata.xml (375 B at 105 B/s)
[WARNING] Could not transfer metadata org.aksw.commons:aksw-commons-io-utils:0.9.1-SNAPSHOT/maven-metadata.xml from/to maven-default-http-blocker (http://0.0.0.0/): transfer failed for http://0.0.0.0/org/aksw/commons/aksw-commons-io-utils/0.9.1-SNAPSHOT/maven-metadata.xml
[WARNING] org.aksw.commons:aksw-commons-io-utils:0.9.1-SNAPSHOT/maven-metadata.xmlfailed to transfer from http://0.0.0.0/ during a previous attempt. This failure was cached in the local repository and resolution will not be reattempted until the update interval of maven-default-http-blocker has elapsed or updates are forced. Original error: Could not transfer metadata org.aksw.commons:aksw-commons-io-utils:0.9.1-SNAPSHOT/maven-metadata.xml from/to maven-default-http-blocker (http://0.0.0.0/): transfer failed for http://0.0.0.0/org/aksw/commons/aksw-commons-io-utils/0.9.1-SNAPSHOT/maven-metadata.xml
[INFO] Downloading from maven.aksw.snapshots: https://maven.aksw.org/archiva/repository/snapshots/org/aksw/commons/aksw-commons-io-utils/0.9.1-SNAPSHOT/aksw-commons-io-utils-0.9.1-20210724.142904-27.pom
[INFO] Downloaded from maven.aksw.snapshots: https://maven.aksw.org/archiva/repository/snapshots/org/aksw/commons/aksw-commons-io-utils/0.9.1-SNAPSHOT/aksw-commons-io-utils-0.9.1-20210724.142904-27.pom (851 B at 71 kB/s)
[INFO] Downloading from maven.aksw.snapshots: https://maven.aksw.org/archiva/repository/snapshots/org/aksw/commons/aksw-commons-io-parent/0.9.1-SNAPSHOT/maven-metadata.xml
[INFO] Downloading from maven-default-http-blocker: http://0.0.0.0/org/aksw/commons/aksw-commons-io-parent/0.9.1-SNAPSHOT/maven-metadata.xml
[INFO] Downloaded from maven.aksw.snapshots: https://maven.aksw.org/archiva/repository/snapshots/org/aksw/commons/aksw-commons-io-parent/0.9.1-SNAPSHOT/maven-metadata.xml (376 B at 34 kB/s)
[WARNING] Could not transfer metadata org.aksw.commons:aksw-commons-io-parent:0.9.1-SNAPSHOT/maven-metadata.xml from/to maven-default-http-blocker (http://0.0.0.0/): transfer failed for http://0.0.0.0/org/aksw/commons/aksw-commons-io-parent/0.9.1-SNAPSHOT/maven-metadata.xml
[INFO] Downloading from maven.aksw.snapshots: https://maven.aksw.org/archiva/repository/snapshots/org/aksw/commons/aksw-commons-io-parent/0.9.1-SNAPSHOT/aksw-commons-io-parent-0.9.1-20210724.142850-27.pom
[INFO] Downloaded from maven.aksw.snapshots: https://maven.aksw.org/archiva/repository/snapshots/org/aksw/commons/aksw-commons-io-parent/0.9.1-SNAPSHOT/aksw-commons-io-parent-0.9.1-20210724.142850-27.pom (1.0 kB at 94 kB/s)
[INFO] Downloading from maven.aksw.snapshots: https://maven.aksw.org/archiva/repository/snapshots/org/aksw/commons/aksw-commons-rx-ex/0.9.1-SNAPSHOT/maven-metadata.xml
[INFO] Downloading from maven-default-http-blocker: http://0.0.0.0/org/aksw/commons/aksw-commons-rx-ex/0.9.1-SNAPSHOT/maven-metadata.xml
[INFO] Downloaded from maven.aksw.snapshots: https://maven.aksw.org/archiva/repository/snapshots/org/aksw/commons/aksw-commons-rx-ex/0.9.1-SNAPSHOT/maven-metadata.xml (371 B at 6.7 kB/s)
[WARNING] Could not transfer metadata org.aksw.commons:aksw-commons-rx-ex:0.9.1-SNAPSHOT/maven-metadata.xml from/to maven-default-http-blocker (http://0.0.0.0/): transfer failed for http://0.0.0.0/org/aksw/commons/aksw-commons-rx-ex/0.9.1-SNAPSHOT/maven-metadata.xml
[WARNING] org.aksw.commons:aksw-commons-rx-ex:0.9.1-SNAPSHOT/maven-metadata.xmlfailed to transfer from http://0.0.0.0/ during a previous attempt. This failure was cached in the local repository and resolution will not be reattempted until the update interval of maven-default-http-blocker has elapsed or updates are forced. Original error: Could not transfer metadata org.aksw.commons:aksw-commons-rx-ex:0.9.1-SNAPSHOT/maven-metadata.xml from/to maven-default-http-blocker (http://0.0.0.0/): transfer failed for http://0.0.0.0/org/aksw/commons/aksw-commons-rx-ex/0.9.1-SNAPSHOT/maven-metadata.xml
[INFO] Downloading from maven.aksw.snapshots: https://maven.aksw.org/archiva/repository/snapshots/org/aksw/commons/aksw-commons-rx-ex/0.9.1-SNAPSHOT/aksw-commons-rx-ex-0.9.1-20210724.143309-6.pom
[INFO] Downloaded from maven.aksw.snapshots: https://maven.aksw.org/archiva/repository/snapshots/org/aksw/commons/aksw-commons-rx-ex/0.9.1-SNAPSHOT/aksw-commons-rx-ex-0.9.1-20210724.143309-6.pom (946 B at 86 kB/s)
[INFO] Downloading from maven.aksw.snapshots: https://maven.aksw.org/archiva/repository/snapshots/org/aksw/jena-sparql-api/jena-sparql-api-io-core/4.0.0-1-SNAPSHOT/maven-metadata.xml
[INFO] Downloaded from maven.aksw.snapshots: https://maven.aksw.org/archiva/repository/snapshots/org/aksw/jena-sparql-api/jena-sparql-api-io-core/4.0.0-1-SNAPSHOT/maven-metadata.xml (387 B at 11 kB/s)
[INFO] Downloading from maven.aksw.snapshots: https://maven.aksw.org/archiva/repository/snapshots/org/aksw/commons/aksw-commons-io-process-pipes/0.9.1-SNAPSHOT/maven-metadata.xml
[INFO] Downloading from maven-default-http-blocker: http://0.0.0.0/org/aksw/commons/aksw-commons-io-process-pipes/0.9.1-SNAPSHOT/maven-metadata.xml
[INFO] Downloaded from maven.aksw.snapshots: https://maven.aksw.org/archiva/repository/snapshots/org/aksw/commons/aksw-commons-io-process-pipes/0.9.1-SNAPSHOT/maven-metadata.xml (383 B at 2.8 kB/s)
[WARNING] Could not transfer metadata org.aksw.commons:aksw-commons-io-process-pipes:0.9.1-SNAPSHOT/maven-metadata.xml from/to maven-default-http-blocker (http://0.0.0.0/): transfer failed for http://0.0.0.0/org/aksw/commons/aksw-commons-io-process-pipes/0.9.1-SNAPSHOT/maven-metadata.xml
[WARNING] org.aksw.commons:aksw-commons-io-process-pipes:0.9.1-SNAPSHOT/maven-metadata.xmlfailed to transfer from http://0.0.0.0/ during a previous attempt. This failure was cached in the local repository and resolution will not be reattempted until the update interval of maven-default-http-blocker has elapsed or updates are forced. Original error: Could not transfer metadata org.aksw.commons:aksw-commons-io-process-pipes:0.9.1-SNAPSHOT/maven-metadata.xml from/to maven-default-http-blocker (http://0.0.0.0/): transfer failed for http://0.0.0.0/org/aksw/commons/aksw-commons-io-process-pipes/0.9.1-SNAPSHOT/maven-metadata.xml
[INFO] Downloading from maven.aksw.snapshots: https://maven.aksw.org/archiva/repository/snapshots/org/aksw/commons/aksw-commons-io-process-pipes/0.9.1-SNAPSHOT/aksw-commons-io-process-pipes-0.9.1-20210724.143015-27.pom
[INFO] Downloaded from maven.aksw.snapshots: https://maven.aksw.org/archiva/repository/snapshots/org/aksw/commons/aksw-commons-io-process-pipes/0.9.1-SNAPSHOT/aksw-commons-io-process-pipes-0.9.1-20210724.143015-27.pom (1.5 kB at 29 kB/s)
[INFO] Downloading from maven.aksw.snapshots: https://maven.aksw.org/archiva/repository/snapshots/org/aksw/commons/aksw-commons-lambdas-throwing/0.9.1-SNAPSHOT/maven-metadata.xml
[INFO] Downloading from maven-default-http-blocker: http://0.0.0.0/org/aksw/commons/aksw-commons-lambdas-throwing/0.9.1-SNAPSHOT/maven-metadata.xml
[INFO] Downloaded from maven.aksw.snapshots: https://maven.aksw.org/archiva/repository/snapshots/org/aksw/commons/aksw-commons-lambdas-throwing/0.9.1-SNAPSHOT/maven-metadata.xml (383 B at 32 kB/s)
[WARNING] Could not transfer metadata org.aksw.commons:aksw-commons-lambdas-throwing:0.9.1-SNAPSHOT/maven-metadata.xml from/to maven-default-http-blocker (http://0.0.0.0/): transfer failed for http://0.0.0.0/org/aksw/commons/aksw-commons-lambdas-throwing/0.9.1-SNAPSHOT/maven-metadata.xml
[WARNING] org.aksw.commons:aksw-commons-lambdas-throwing:0.9.1-SNAPSHOT/maven-metadata.xmlfailed to transfer from http://0.0.0.0/ during a previous attempt. This failure was cached in the local repository and resolution will not be reattempted until the update interval of maven-default-http-blocker has elapsed or updates are forced. Original error: Could not transfer metadata org.aksw.commons:aksw-commons-lambdas-throwing:0.9.1-SNAPSHOT/maven-metadata.xml from/to maven-default-http-blocker (http://0.0.0.0/): transfer failed for http://0.0.0.0/org/aksw/commons/aksw-commons-lambdas-throwing/0.9.1-SNAPSHOT/maven-metadata.xml
[INFO] Downloading from maven.aksw.snapshots: https://maven.aksw.org/archiva/repository/snapshots/org/aksw/commons/aksw-commons-lambdas-throwing/0.9.1-SNAPSHOT/aksw-commons-lambdas-throwing-0.9.1-20210724.142803-27.pom
[INFO] Downloaded from maven.aksw.snapshots: https://maven.aksw.org/archiva/repository/snapshots/org/aksw/commons/aksw-commons-lambdas-throwing/0.9.1-SNAPSHOT/aksw-commons-lambdas-throwing-0.9.1-20210724.142803-27.pom (562 B at 51 kB/s)
[INFO] Downloading from maven.aksw.snapshots: https://maven.aksw.org/archiva/repository/snapshots/org/aksw/commons/aksw-commons-collectors/0.9.1-SNAPSHOT/aksw-commons-collectors-0.9.1-20210724.142832-27.jar
[INFO] Downloading from maven.aksw.snapshots: https://maven.aksw.org/archiva/repository/snapshots/org/aksw/commons/aksw-commons-lambdas-serializable/0.9.1-SNAPSHOT/aksw-commons-lambdas-serializable-0.9.1-20210724.142742-27.jar
[INFO] Downloading from maven.aksw.snapshots: https://maven.aksw.org/archiva/repository/snapshots/org/aksw/commons/aksw-commons-util/0.9.1-SNAPSHOT/aksw-commons-util-0.9.1-20210724.142602-29.jar
[INFO] Downloading from maven.aksw.snapshots: https://maven.aksw.org/archiva/repository/snapshots/org/aksw/commons/aksw-commons-rx-ex/0.9.1-SNAPSHOT/aksw-commons-rx-ex-0.9.1-20210724.143309-6.jar
[INFO] Downloading from maven.aksw.snapshots: https://maven.aksw.org/archiva/repository/snapshots/org/aksw/commons/aksw-commons-rx/0.9.1-SNAPSHOT/aksw-commons-rx-0.9.1-20210724.143404-27.jar
[INFO] Downloaded from maven.aksw.snapshots: https://maven.aksw.org/archiva/repository/snapshots/org/aksw/commons/aksw-commons-collectors/0.9.1-SNAPSHOT/aksw-commons-collectors-0.9.1-20210724.142832-27.jar (57 kB at 2.0 MB/s)
[INFO] Downloading from maven.aksw.snapshots: https://maven.aksw.org/archiva/repository/snapshots/org/aksw/commons/aksw-commons-io-utils/0.9.1-SNAPSHOT/aksw-commons-io-utils-0.9.1-20210724.142904-27.jar
[INFO] Downloaded from maven.aksw.snapshots: https://maven.aksw.org/archiva/repository/snapshots/org/aksw/commons/aksw-commons-lambdas-serializable/0.9.1-SNAPSHOT/aksw-commons-lambdas-serializable-0.9.1-20210724.142742-27.jar (6.4 kB at 199 kB/s)
[INFO] Downloading from maven.aksw.snapshots: https://maven.aksw.org/archiva/repository/snapshots/org/aksw/commons/aksw-commons-collections/0.9.1-SNAPSHOT/aksw-commons-collections-0.9.1-20210724.142531-27.jar
[INFO] Downloaded from maven.aksw.snapshots: https://maven.aksw.org/archiva/repository/snapshots/org/aksw/commons/aksw-commons-rx/0.9.1-SNAPSHOT/aksw-commons-rx-0.9.1-20210724.143404-27.jar (78 kB at 1.9 MB/s)
[INFO] Downloaded from maven.aksw.snapshots: https://maven.aksw.org/archiva/repository/snapshots/org/aksw/commons/aksw-commons-rx-ex/0.9.1-SNAPSHOT/aksw-commons-rx-ex-0.9.1-20210724.143309-6.jar (35 kB at 847 kB/s)
[INFO] Downloading from maven.aksw.snapshots: https://maven.aksw.org/archiva/repository/snapshots/org/aksw/commons/aksw-commons-io-process-pipes/0.9.1-SNAPSHOT/aksw-commons-io-process-pipes-0.9.1-20210724.143015-27.jar
[INFO] Downloaded from maven.aksw.snapshots: https://maven.aksw.org/archiva/repository/snapshots/org/aksw/commons/aksw-commons-util/0.9.1-SNAPSHOT/aksw-commons-util-0.9.1-20210724.142602-29.jar (106 kB at 2.3 MB/s)
[INFO] Downloading from maven.aksw.snapshots: https://maven.aksw.org/archiva/repository/snapshots/org/aksw/commons/aksw-commons-lambdas-throwing/0.9.1-SNAPSHOT/aksw-commons-lambdas-throwing-0.9.1-20210724.142803-27.jar
[INFO] Downloaded from maven.aksw.snapshots: https://maven.aksw.org/archiva/repository/snapshots/org/aksw/commons/aksw-commons-io-utils/0.9.1-SNAPSHOT/aksw-commons-io-utils-0.9.1-20210724.142904-27.jar (26 kB at 414 kB/s)
[INFO] Downloaded from maven.aksw.snapshots: https://maven.aksw.org/archiva/repository/snapshots/org/aksw/commons/aksw-commons-lambdas-throwing/0.9.1-SNAPSHOT/aksw-commons-lambdas-throwing-0.9.1-20210724.142803-27.jar (6.2 kB at 97 kB/s)
[INFO] Downloaded from maven.aksw.snapshots: https://maven.aksw.org/archiva/repository/snapshots/org/aksw/commons/aksw-commons-io-process-pipes/0.9.1-SNAPSHOT/aksw-commons-io-process-pipes-0.9.1-20210724.143015-27.jar (38 kB at 536 kB/s)
[INFO] Downloaded from maven.aksw.snapshots: https://maven.aksw.org/archiva/repository/snapshots/org/aksw/commons/aksw-commons-collections/0.9.1-SNAPSHOT/aksw-commons-collections-0.9.1-20210724.142531-27.jar (242 kB at 2.6 MB/s)
[INFO] Downloading from oss-sonatype-releases: https://oss.sonatype.org/content/repositories/releases/com/github/ben-manes/caffeine/caffeine/3.0.3/caffeine-3.0.3.jar
[INFO] Downloaded from oss-sonatype-releases: https://oss.sonatype.org/content/repositories/releases/com/github/ben-manes/caffeine/caffeine/3.0.3/caffeine-3.0.3.jar (887 kB at 1.6 MB/s)
[INFO] 
[INFO] --- maven-clean-plugin:2.5:clean (default-clean) @ sansa-hadoop-jena ---
[INFO] Deleting /usr/share/tomcat8/.jenkins/jobs/SANSA-Stack/branches/feature-dasim.25ti5o/workspace/sansa-hadoop-jena/target
[INFO] 
[INFO] --- jacoco-maven-plugin:0.8.4:prepare-agent (prepare-agent) @ sansa-hadoop-jena ---
[INFO] argLine set to -javaagent:/usr/share/tomcat8/.m2/repository/org/jacoco/org.jacoco.agent/0.8.4/org.jacoco.agent-0.8.4-runtime.jar=destfile=/usr/share/tomcat8/.jenkins/jobs/SANSA-Stack/branches/feature-dasim.25ti5o/workspace/sansa-hadoop-jena/target/jacoco.exec
[INFO] 
[INFO] --- maven-resources-plugin:3.0.2:resources (default-resources) @ sansa-hadoop-jena ---
[INFO] Using 'UTF-8' encoding to copy filtered resources.
[INFO] skip non existing resourceDirectory /usr/share/tomcat8/.jenkins/jobs/SANSA-Stack/branches/feature-dasim.25ti5o/workspace/sansa-hadoop-jena/src/main/resources
[INFO] 
[INFO] --- scala-maven-plugin:4.5.3:add-source (scala-compile-first) @ sansa-hadoop-jena ---
[INFO] Add Source directory: /usr/share/tomcat8/.jenkins/jobs/SANSA-Stack/branches/feature-dasim.25ti5o/workspace/sansa-hadoop-jena/src/main/scala
[INFO] Add Test Source directory: /usr/share/tomcat8/.jenkins/jobs/SANSA-Stack/branches/feature-dasim.25ti5o/workspace/sansa-hadoop-jena/src/test/scala
[INFO] 
[INFO] --- scala-maven-plugin:4.5.3:compile (scala-compile-first) @ sansa-hadoop-jena ---
[WARNING] net.minidev:json-smart/maven-metadata.xmlfailed to transfer from http://0.0.0.0/ during a previous attempt. This failure was cached in the local repository and resolution will not be reattempted until the update interval of maven-default-http-blocker has elapsed or updates are forced. Original error: Could not transfer metadata net.minidev:json-smart/maven-metadata.xml from/to maven-default-http-blocker (http://0.0.0.0/): transfer failed for http://0.0.0.0/net/minidev/json-smart/maven-metadata.xml
[INFO] Using incremental compilation using Mixed compile order
[INFO] Compiler bridge file: /usr/share/tomcat8/.sbt/1.0/zinc/org.scala-sbt/org.scala-sbt-compiler-bridge_2.12-1.5.5-bin_2.12.11__52.0-1.5.5_20210607T021730.jar
[INFO] compiling 29 Java sources to /usr/share/tomcat8/.jenkins/jobs/SANSA-Stack/branches/feature-dasim.25ti5o/workspace/sansa-hadoop-jena/target/classes ...
[ERROR] /usr/share/tomcat8/.jenkins/jobs/SANSA-Stack/branches/feature-dasim.25ti5o/workspace/sansa-hadoop-jena/src/main/java/net/sansa_stack/hadoop/generic/Accumulating.java:3:38:  error: cannot access Acc
[WARNING] javac exited with exit code 1
[INFO] ------------------------------------------------------------------------
[INFO] Reactor Summary for SANSA - Parent 0.8.0-RC2-SNAPSHOT:
[INFO] 
[INFO] SANSA - Parent ..................................... SUCCESS [ 30.078 s]
[INFO] sansa-test-resources_2.12 .......................... SUCCESS [  3.921 s]
[INFO] sansa-hadoop-jena .................................. FAILURE [ 20.665 s]
[INFO] sansa-kryo-jena .................................... SKIPPED
[INFO] sansa-resource-metadata ............................ SKIPPED
[INFO] sansa-resource-testdata ............................ SKIPPED
[INFO] SANSA Stack - RDF Layer - Parent ................... SKIPPED
[INFO] sansa-rdf-common_2.12 .............................. SKIPPED
[INFO] sansa-rdf-spark_2.12 ............................... SKIPPED
[INFO] SANSA Stack - DataLake Layer - Parent .............. SKIPPED
[INFO] sansa-datalake-spark_2.12 .......................... SKIPPED
[INFO] SANSA Stack - Query Layer - Parent ................. SKIPPED
[INFO] sansa-query-tests_2.12 ............................. SKIPPED
[INFO] sansa-query-spark_2.12 ............................. SKIPPED
[INFO] ------------------------------------------------------------------------
[INFO] BUILD FAILURE
[INFO] ------------------------------------------------------------------------
[INFO] Total time:  56.159 s
[INFO] Finished at: 2021-07-26T10:12:37+02:00
[INFO] ------------------------------------------------------------------------
[ERROR] Failed to execute goal net.alchim31.maven:scala-maven-plugin:4.5.3:compile (scala-compile-first) on project sansa-hadoop-jena: Execution scala-compile-first of goal net.alchim31.maven:scala-maven-plugin:4.5.3:compile failed. CompileFailed -> [Help 1]
org.apache.maven.lifecycle.LifecycleExecutionException: Failed to execute goal net.alchim31.maven:scala-maven-plugin:4.5.3:compile (scala-compile-first) on project sansa-hadoop-jena: Execution scala-compile-first of goal net.alchim31.maven:scala-maven-plugin:4.5.3:compile failed.
    at org.apache.maven.lifecycle.internal.MojoExecutor.execute (MojoExecutor.java:215)
    at org.apache.maven.lifecycle.internal.MojoExecutor.execute (MojoExecutor.java:156)
    at org.apache.maven.lifecycle.internal.MojoExecutor.execute (MojoExecutor.java:148)
    at org.apache.maven.lifecycle.internal.LifecycleModuleBuilder.buildProject (LifecycleModuleBuilder.java:117)
    at org.apache.maven.lifecycle.internal.LifecycleModuleBuilder.buildProject (LifecycleModuleBuilder.java:81)
    at org.apache.maven.lifecycle.internal.builder.singlethreaded.SingleThreadedBuilder.build (SingleThreadedBuilder.java:56)
    at org.apache.maven.lifecycle.internal.LifecycleStarter.execute (LifecycleStarter.java:128)
    at org.apache.maven.DefaultMaven.doExecute (DefaultMaven.java:305)
    at org.apache.maven.DefaultMaven.doExecute (DefaultMaven.java:192)
    at org.apache.maven.DefaultMaven.execute (DefaultMaven.java:105)
    at org.apache.maven.cli.MavenCli.execute (MavenCli.java:957)
    at org.apache.maven.cli.MavenCli.doMain (MavenCli.java:289)
    at org.apache.maven.cli.MavenCli.main (MavenCli.java:193)
    at sun.reflect.NativeMethodAccessorImpl.invoke0 (Native Method)
    at sun.reflect.NativeMethodAccessorImpl.invoke (NativeMethodAccessorImpl.java:62)
    at sun.reflect.DelegatingMethodAccessorImpl.invoke (DelegatingMethodAccessorImpl.java:43)
    at java.lang.reflect.Method.invoke (Method.java:498)
    at org.codehaus.plexus.classworlds.launcher.Launcher.launchEnhanced (Launcher.java:282)
    at org.codehaus.plexus.classworlds.launcher.Launcher.launch (Launcher.java:225)
    at org.codehaus.plexus.classworlds.launcher.Launcher.mainWithExitCode (Launcher.java:406)
    at org.codehaus.plexus.classworlds.launcher.Launcher.main (Launcher.java:347)
Caused by: org.apache.maven.plugin.PluginExecutionException: Execution scala-compile-first of goal net.alchim31.maven:scala-maven-plugin:4.5.3:compile failed.
    at org.apache.maven.plugin.DefaultBuildPluginManager.executeMojo (DefaultBuildPluginManager.java:148)
    at org.apache.maven.lifecycle.internal.MojoExecutor.execute (MojoExecutor.java:210)
    at org.apache.maven.lifecycle.internal.MojoExecutor.execute (MojoExecutor.java:156)
    at org.apache.maven.lifecycle.internal.MojoExecutor.execute (MojoExecutor.java:148)
    at org.apache.maven.lifecycle.internal.LifecycleModuleBuilder.buildProject (LifecycleModuleBuilder.java:117)
    at org.apache.maven.lifecycle.internal.LifecycleModuleBuilder.buildProject (LifecycleModuleBuilder.java:81)
    at org.apache.maven.lifecycle.internal.builder.singlethreaded.SingleThreadedBuilder.build (SingleThreadedBuilder.java:56)
    at org.apache.maven.lifecycle.internal.LifecycleStarter.execute (LifecycleStarter.java:128)
    at org.apache.maven.DefaultMaven.doExecute (DefaultMaven.java:305)
    at org.apache.maven.DefaultMaven.doExecute (DefaultMaven.java:192)
    at org.apache.maven.DefaultMaven.execute (DefaultMaven.java:105)
    at org.apache.maven.cli.MavenCli.execute (MavenCli.java:957)
    at org.apache.maven.cli.MavenCli.doMain (MavenCli.java:289)
    at org.apache.maven.cli.MavenCli.main (MavenCli.java:193)
    at sun.reflect.NativeMethodAccessorImpl.invoke0 (Native Method)
    at sun.reflect.NativeMethodAccessorImpl.invoke (NativeMethodAccessorImpl.java:62)
    at sun.reflect.DelegatingMethodAccessorImpl.invoke (DelegatingMethodAccessorImpl.java:43)
    at java.lang.reflect.Method.invoke (Method.java:498)
    at org.codehaus.plexus.classworlds.launcher.Launcher.launchEnhanced (Launcher.java:282)
    at org.codehaus.plexus.classworlds.launcher.Launcher.launch (Launcher.java:225)
    at org.codehaus.plexus.classworlds.launcher.Launcher.mainWithExitCode (Launcher.java:406)
    at org.codehaus.plexus.classworlds.launcher.Launcher.main (Launcher.java:347)
Caused by: sbt.internal.inc.CompileFailed
    at sbt.internal.inc.IncrementalCompilerImpl.handleCompilationError (IncrementalCompilerImpl.scala:335)
    at sbt.internal.inc.IncrementalCompilerImpl.compileIncrementally (IncrementalCompilerImpl.scala:420)
    at sbt.internal.inc.IncrementalCompilerImpl.compile (IncrementalCompilerImpl.scala:137)
    at sbt_inc.SbtIncrementalCompiler.compile (SbtIncrementalCompiler.java:179)
    at scala_maven.ScalaCompilerSupport.incrementalCompile (ScalaCompilerSupport.java:361)
    at scala_maven.ScalaCompilerSupport.compile (ScalaCompilerSupport.java:118)
    at scala_maven.ScalaCompilerSupport.doExecute (ScalaCompilerSupport.java:88)
    at scala_maven.ScalaMojoSupport.execute (ScalaMojoSupport.java:305)
    at org.apache.maven.plugin.DefaultBuildPluginManager.executeMojo (DefaultBuildPluginManager.java:137)
    at org.apache.maven.lifecycle.internal.MojoExecutor.execute (MojoExecutor.java:210)
    at org.apache.maven.lifecycle.internal.MojoExecutor.execute (MojoExecutor.java:156)
    at org.apache.maven.lifecycle.internal.MojoExecutor.execute (MojoExecutor.java:148)
    at org.apache.maven.lifecycle.internal.LifecycleModuleBuilder.buildProject (LifecycleModuleBuilder.java:117)
    at org.apache.maven.lifecycle.internal.LifecycleModuleBuilder.buildProject (LifecycleModuleBuilder.java:81)
    at org.apache.maven.lifecycle.internal.builder.singlethreaded.SingleThreadedBuilder.build (SingleThreadedBuilder.java:56)
    at org.apache.maven.lifecycle.internal.LifecycleStarter.execute (LifecycleStarter.java:128)
    at org.apache.maven.DefaultMaven.doExecute (DefaultMaven.java:305)
    at org.apache.maven.DefaultMaven.doExecute (DefaultMaven.java:192)
    at org.apache.maven.DefaultMaven.execute (DefaultMaven.java:105)
    at org.apache.maven.cli.MavenCli.execute (MavenCli.java:957)
    at org.apache.maven.cli.MavenCli.doMain (MavenCli.java:289)
    at org.apache.maven.cli.MavenCli.main (MavenCli.java:193)
    at sun.reflect.NativeMethodAccessorImpl.invoke0 (Native Method)
    at sun.reflect.NativeMethodAccessorImpl.invoke (NativeMethodAccessorImpl.java:62)
    at sun.reflect.DelegatingMethodAccessorImpl.invoke (DelegatingMethodAccessorImpl.java:43)
    at java.lang.reflect.Method.invoke (Method.java:498)
    at org.codehaus.plexus.classworlds.launcher.Launcher.launchEnhanced (Launcher.java:282)
    at org.codehaus.plexus.classworlds.launcher.Launcher.launch (Launcher.java:225)
    at org.codehaus.plexus.classworlds.launcher.Launcher.mainWithExitCode (Launcher.java:406)
    at org.codehaus.plexus.classworlds.launcher.Launcher.main (Launcher.java:347)
[ERROR] 
[ERROR] Re-run Maven using the -X switch to enable full debug logging.
[ERROR] 
[ERROR] For more information about the errors and possible solutions, please read the following articles:
[ERROR] [Help 1] http://cwiki.apache.org/confluence/display/MAVEN/PluginExecutionException
[ERROR] 
[ERROR] After correcting the problems, you can resume the build with the command
[ERROR]   mvn <args> -rf :sansa-hadoop-jena
[Pipeline] }
[Pipeline] // withEnv
[Pipeline] }
[Pipeline] // stage
[Pipeline] }
[Pipeline] // withEnv
[Pipeline] }
[Pipeline] // withEnv
[Pipeline] }
[Pipeline] // withEnv
[Pipeline] }
[Pipeline] // node
[Pipeline] End of Pipeline

GitHub has been notified of this commit’s build result

ERROR: script returned exit code 1
Finished: FAILURE