FailedConsole Output

Skipping 12 KB.. Full Log
QBC9BFLSUPOKCBB2iSmu54QUmNsaJdWdsh6TiRXyNPxCIRMUWq51t5vmCZYpw5GixNdQ5So3D4Hs7LRw4dhfPA7Z8xoYpsTcozSBZm3pGydnAnKKEhYCVocZzcmQzrEWr7qryimx1ynH6DgJKp2/wgEJM5qxi/sIYYXPtdWL6ef4KYAwhQ7nbf2r7BgSW0ii+AAAA[Pipeline] // withEnv
[Pipeline] }
[Pipeline] // stage
[Pipeline] stage
[Pipeline] { (Build and Push to Archiva)
[Pipeline] tool
[Pipeline] envVarsForTool
[Pipeline] tool
[Pipeline] envVarsForTool
[Pipeline] withEnv
[Pipeline] {
[Pipeline] sh
+ mvn --batch-mode -V -U -e -DskipTests clean deploy -pl :sansa-query-spark_2.12 -am
Apache Maven 3.5.4 (1edded0938998edf8bf061f1ceb3cfdeccf443fe; 2018-06-17T20:33:14+02:00)
Maven home: /usr/share/maven3
Java version: 1.8.0_252, vendor: Private Build, runtime: /usr/lib/jvm/java-8-openjdk-amd64/jre
Default locale: en_US, platform encoding: UTF-8
OS name: "linux", version: "4.15.0-1089-azure", arch: "amd64", family: "unix"
[INFO] Error stacktraces are turned on.
[INFO] Scanning for projects...
[WARNING] 
[WARNING] Some problems were encountered while building the effective model for net.sansa-stack:sansa-rdf-parent_2.12:pom:0.7.2-SNAPSHOT
[WARNING] 'profiles.profile[root-dir].activation.file.exists' Failed to interpolate file location ${project.basedir}/scalastyle-config.xml for profile root-dir: ${project.basedir} expression not supported during profile activation, use ${basedir} instead @ net.sansa-stack:sansa-parent_2.12:0.7.2-SNAPSHOT, /usr/share/tomcat8/.jenkins/jobs/SANSA-Stack/branches/feature-sans.sb0bt7.eline-design/workspace/pom.xml
[WARNING] 'profiles.profile[child-dir].activation.file.exists' Failed to interpolate file location ${project.basedir}/../lib for profile child-dir: ${project.basedir} expression not supported during profile activation, use ${basedir} instead @ net.sansa-stack:sansa-parent_2.12:0.7.2-SNAPSHOT, /usr/share/tomcat8/.jenkins/jobs/SANSA-Stack/branches/feature-sans.sb0bt7.eline-design/workspace/pom.xml
[WARNING] 
[WARNING] Some problems were encountered while building the effective model for net.sansa-stack:sansa-datalake-spark_2.12:jar:0.7.2-SNAPSHOT
[WARNING] 'build.plugins.plugin.version' for com.amashchenko.maven.plugin:gitflow-maven-plugin is missing. @ net.sansa-stack:sansa-datalake-parent_2.12:[unknown-version], /usr/share/tomcat8/.jenkins/jobs/SANSA-Stack/branches/feature-sans.sb0bt7.eline-design/workspace/sansa-datalake/pom.xml, line 120, column 12
[WARNING] 
[WARNING] Some problems were encountered while building the effective model for net.sansa-stack:sansa-datalake-parent_2.12:pom:0.7.2-SNAPSHOT
[WARNING] 'build.plugins.plugin.version' for com.amashchenko.maven.plugin:gitflow-maven-plugin is missing. @ net.sansa-stack:sansa-datalake-parent_2.12:[unknown-version], /usr/share/tomcat8/.jenkins/jobs/SANSA-Stack/branches/feature-sans.sb0bt7.eline-design/workspace/sansa-datalake/pom.xml, line 120, column 12
[WARNING] 
[WARNING] Some problems were encountered while building the effective model for net.sansa-stack:sansa-query-flink_2.12:jar:0.7.2-SNAPSHOT
[WARNING] 'dependencies.dependency.(groupId:artifactId:type:classifier)' must be unique: org.scalatest:scalatest_${scala.binary.version}:jar -> duplicate declaration of version (?) @ net.sansa-stack:sansa-query-flink_2.12:[unknown-version], /usr/share/tomcat8/.jenkins/jobs/SANSA-Stack/branches/feature-sans.sb0bt7.eline-design/workspace/sansa-query/sansa-query-flink/pom.xml, line 54, column 21
[WARNING] 
[WARNING] Some problems were encountered while building the effective model for net.sansa-stack:sansa-query-spark_2.12:jar:0.7.2-SNAPSHOT
[WARNING] 'dependencies.dependency.(groupId:artifactId:type:classifier)' must be unique: org.apache.jena:apache-jena-libs:pom -> duplicate declaration of version (?) @ net.sansa-stack:sansa-query-spark_2.12:[unknown-version], /usr/share/tomcat8/.jenkins/jobs/SANSA-Stack/branches/feature-sans.sb0bt7.eline-design/workspace/sansa-query/sansa-query-spark/pom.xml, line 175, column 15
[WARNING] 
[WARNING] Some problems were encountered while building the effective model for net.sansa-stack:sansa-query-tests_2.12:jar:0.7.2-SNAPSHOT
[WARNING] 'build.plugins.plugin.version' for org.scala-tools:maven-scala-plugin is missing. @ net.sansa-stack:sansa-query-tests_2.12:[unknown-version], /usr/share/tomcat8/.jenkins/jobs/SANSA-Stack/branches/feature-sans.sb0bt7.eline-design/workspace/sansa-query/sansa-query-tests/pom.xml, line 51, column 21
[WARNING] 'build.plugins.plugin.version' for org.apache.maven.plugins:maven-jar-plugin is missing. @ net.sansa-stack:sansa-query-tests_2.12:[unknown-version], /usr/share/tomcat8/.jenkins/jobs/SANSA-Stack/branches/feature-sans.sb0bt7.eline-design/workspace/sansa-query/sansa-query-tests/pom.xml, line 72, column 21
[WARNING] 
[WARNING] Some problems were encountered while building the effective model for net.sansa-stack:sansa-inference-spark_2.12:jar:0.7.2-SNAPSHOT
[WARNING] 'build.plugins.plugin.version' for org.apache.maven.plugins:maven-jar-plugin is missing. @ net.sansa-stack:sansa-inference-spark_2.12:[unknown-version], /usr/share/tomcat8/.jenkins/jobs/SANSA-Stack/branches/feature-sans.sb0bt7.eline-design/workspace/sansa-inference/sansa-inference-spark/pom.xml, line 325, column 21
[WARNING] 
[WARNING] Some problems were encountered while building the effective model for net.sansa-stack:sansa-inference-tests_2.12:jar:0.7.2-SNAPSHOT
[WARNING] 'build.plugins.plugin.version' for org.apache.maven.plugins:maven-jar-plugin is missing. @ net.sansa-stack:sansa-inference-tests_2.12:[unknown-version], /usr/share/tomcat8/.jenkins/jobs/SANSA-Stack/branches/feature-sans.sb0bt7.eline-design/workspace/sansa-inference/sansa-inference-tests/pom.xml, line 73, column 15
[WARNING] 
[WARNING] Some problems were encountered while building the effective model for net.sansa-stack:sansa-parent_2.12:pom:0.7.2-SNAPSHOT
[WARNING] 'profiles.profile[root-dir].activation.file.exists' Failed to interpolate file location ${project.basedir}/scalastyle-config.xml for profile root-dir: ${project.basedir} expression not supported during profile activation, use ${basedir} instead
[WARNING] 'profiles.profile[child-dir].activation.file.exists' Failed to interpolate file location ${project.basedir}/../lib for profile child-dir: ${project.basedir} expression not supported during profile activation, use ${basedir} instead
[WARNING] 
[WARNING] It is highly recommended to fix these problems because they threaten the stability of your build.
[WARNING] 
[WARNING] For this reason, future Maven versions might no longer support building such malformed projects.
[WARNING] 
[WARNING] The project net.sansa-stack:sansa-parent_2.12:pom:0.7.2-SNAPSHOT uses prerequisites which is only intended for maven-plugin projects but not for non maven-plugin projects. For such purposes you should use the maven-enforcer-plugin. See https://maven.apache.org/enforcer/enforcer-rules/requireMavenVersion.html
[INFO] ------------------------------------------------------------------------
[INFO] Reactor Build Order:
[INFO] 
[INFO] SANSA - Parent                                                     [pom]
[INFO] SANSA Stack - RDF Layer - Parent                                   [pom]
[INFO] sansa-rdf-common_2.12                                              [jar]
[INFO] sansa-rdf-spark_2.12                                               [jar]
[INFO] SANSA Stack - DataLake Layer - Parent                              [pom]
[INFO] sansa-datalake-spark_2.12                                          [jar]
[INFO] SANSA Stack - Query Layer - Parent                                 [pom]
[INFO] sansa-query-tests_2.12                                             [jar]
[INFO] sansa-query-spark_2.12                                             [jar]
[INFO] 
[INFO] -----------------< net.sansa-stack:sansa-parent_2.12 >------------------
[INFO] Building SANSA - Parent 0.7.2-SNAPSHOT                             [1/9]
[INFO] --------------------------------[ pom ]---------------------------------
[INFO] 
[INFO] --- maven-clean-plugin:2.5:clean (default-clean) @ sansa-parent_2.12 ---
[INFO] 
[INFO] --- scala-maven-plugin:4.4.0:add-source (default) @ sansa-parent_2.12 ---
[INFO] Add Source directory: /usr/share/tomcat8/.jenkins/jobs/SANSA-Stack/branches/feature-sans.sb0bt7.eline-design/workspace/src/main/scala
[INFO] Add Test Source directory: /usr/share/tomcat8/.jenkins/jobs/SANSA-Stack/branches/feature-sans.sb0bt7.eline-design/workspace/src/test/scala
[INFO] 
[INFO] --- jacoco-maven-plugin:0.8.4:prepare-agent (prepare-agent) @ sansa-parent_2.12 ---
[INFO] argLine set to -javaagent:/usr/share/tomcat8/.m2/repository/org/jacoco/org.jacoco.agent/0.8.4/org.jacoco.agent-0.8.4-runtime.jar=destfile=/usr/share/tomcat8/.jenkins/jobs/SANSA-Stack/branches/feature-sans.sb0bt7.eline-design/workspace/target/jacoco.exec
[INFO] 
[INFO] --- scala-maven-plugin:4.4.0:compile (default) @ sansa-parent_2.12 ---
[INFO] compile in 0.0 s
[INFO] No sources to compile
[INFO] 
[INFO] --- scala-maven-plugin:4.4.0:testCompile (default) @ sansa-parent_2.12 ---
[INFO] compile in 0.0 s
[INFO] No sources to compile
[INFO] 
[INFO] --- scalatest-maven-plugin:2.0.0:test (test) @ sansa-parent_2.12 ---
[INFO] Tests are skipped.
[INFO] 
[INFO] --- maven-javadoc-plugin:3.1.1:jar (attach-javadocs) @ sansa-parent_2.12 ---
[INFO] Not executing Javadoc as the project is not a Java classpath-capable package
[INFO] 
[INFO] >>> scala-maven-plugin:4.4.0:doc-jar (attach-javadocs) > generate-sources @ sansa-parent_2.12 >>>
[INFO] 
[INFO] --- scala-maven-plugin:4.4.0:add-source (default) @ sansa-parent_2.12 ---
[INFO] 
[INFO] --- jacoco-maven-plugin:0.8.4:prepare-agent (prepare-agent) @ sansa-parent_2.12 ---
[INFO] argLine set to -javaagent:/usr/share/tomcat8/.m2/repository/org/jacoco/org.jacoco.agent/0.8.4/org.jacoco.agent-0.8.4-runtime.jar=destfile=/usr/share/tomcat8/.jenkins/jobs/SANSA-Stack/branches/feature-sans.sb0bt7.eline-design/workspace/target/jacoco.exec
[INFO] 
[INFO] <<< scala-maven-plugin:4.4.0:doc-jar (attach-javadocs) < generate-sources @ sansa-parent_2.12 <<<
[INFO] 
[INFO] 
[INFO] --- scala-maven-plugin:4.4.0:doc-jar (attach-javadocs) @ sansa-parent_2.12 ---
[INFO] No source files found
[INFO] 
[INFO] --- maven-source-plugin:3.0.1:jar-no-fork (attach-sources) @ sansa-parent_2.12 ---
[INFO] 
[INFO] --- maven-install-plugin:2.4:install (default-install) @ sansa-parent_2.12 ---
[INFO] Installing /usr/share/tomcat8/.jenkins/jobs/SANSA-Stack/branches/feature-sans.sb0bt7.eline-design/workspace/pom.xml to /usr/share/tomcat8/.m2/repository/net/sansa-stack/sansa-parent_2.12/0.7.2-SNAPSHOT/sansa-parent_2.12-0.7.2-SNAPSHOT.pom
[INFO] 
[INFO] --- maven-deploy-plugin:2.7:deploy (default-deploy) @ sansa-parent_2.12 ---
[INFO] Downloading from maven.aksw.snapshots: https://maven.aksw.org/archiva/repository/snapshots/net/sansa-stack/sansa-parent_2.12/0.7.2-SNAPSHOT/maven-metadata.xml
[INFO] Downloaded from maven.aksw.snapshots: https://maven.aksw.org/archiva/repository/snapshots/net/sansa-stack/sansa-parent_2.12/0.7.2-SNAPSHOT/maven-metadata.xml (370 B at 1.6 kB/s)
[INFO] Uploading to maven.aksw.snapshots: https://maven.aksw.org/archiva/repository/snapshots/net/sansa-stack/sansa-parent_2.12/0.7.2-SNAPSHOT/sansa-parent_2.12-0.7.2-20201215.121512-98.pom
[INFO] Uploaded to maven.aksw.snapshots: https://maven.aksw.org/archiva/repository/snapshots/net/sansa-stack/sansa-parent_2.12/0.7.2-SNAPSHOT/sansa-parent_2.12-0.7.2-20201215.121512-98.pom (59 kB at 166 kB/s)
[INFO] Downloading from maven.aksw.snapshots: https://maven.aksw.org/archiva/repository/snapshots/net/sansa-stack/sansa-parent_2.12/maven-metadata.xml
[INFO] Downloaded from maven.aksw.snapshots: https://maven.aksw.org/archiva/repository/snapshots/net/sansa-stack/sansa-parent_2.12/maven-metadata.xml (383 B at 38 kB/s)
[INFO] Uploading to maven.aksw.snapshots: https://maven.aksw.org/archiva/repository/snapshots/net/sansa-stack/sansa-parent_2.12/0.7.2-SNAPSHOT/maven-metadata.xml
[INFO] Uploaded to maven.aksw.snapshots: https://maven.aksw.org/archiva/repository/snapshots/net/sansa-stack/sansa-parent_2.12/0.7.2-SNAPSHOT/maven-metadata.xml (611 B at 41 kB/s)
[INFO] Uploading to maven.aksw.snapshots: https://maven.aksw.org/archiva/repository/snapshots/net/sansa-stack/sansa-parent_2.12/maven-metadata.xml
[INFO] Uploaded to maven.aksw.snapshots: https://maven.aksw.org/archiva/repository/snapshots/net/sansa-stack/sansa-parent_2.12/maven-metadata.xml (382 B at 27 kB/s)
[INFO] 
[INFO] ---------------< net.sansa-stack:sansa-rdf-parent_2.12 >----------------
[INFO] Building SANSA Stack - RDF Layer - Parent 0.7.2-SNAPSHOT           [2/9]
[INFO] --------------------------------[ pom ]---------------------------------
[INFO] 
[INFO] --- maven-clean-plugin:2.5:clean (default-clean) @ sansa-rdf-parent_2.12 ---
[INFO] 
[INFO] --- scala-maven-plugin:4.4.0:add-source (default) @ sansa-rdf-parent_2.12 ---
[INFO] Add Source directory: /usr/share/tomcat8/.jenkins/jobs/SANSA-Stack/branches/feature-sans.sb0bt7.eline-design/workspace/sansa-rdf/src/main/scala
[INFO] Add Test Source directory: /usr/share/tomcat8/.jenkins/jobs/SANSA-Stack/branches/feature-sans.sb0bt7.eline-design/workspace/sansa-rdf/src/test/scala
[INFO] 
[INFO] --- jacoco-maven-plugin:0.8.4:prepare-agent (prepare-agent) @ sansa-rdf-parent_2.12 ---
[INFO] argLine set to -javaagent:/usr/share/tomcat8/.m2/repository/org/jacoco/org.jacoco.agent/0.8.4/org.jacoco.agent-0.8.4-runtime.jar=destfile=/usr/share/tomcat8/.jenkins/jobs/SANSA-Stack/branches/feature-sans.sb0bt7.eline-design/workspace/sansa-rdf/target/jacoco.exec
[INFO] 
[INFO] --- scala-maven-plugin:4.4.0:compile (default) @ sansa-rdf-parent_2.12 ---
[INFO] compile in 0.0 s
[INFO] No sources to compile
[INFO] 
[INFO] --- scala-maven-plugin:4.4.0:testCompile (default) @ sansa-rdf-parent_2.12 ---
[INFO] compile in 0.0 s
[INFO] No sources to compile
[INFO] 
[INFO] --- scalatest-maven-plugin:2.0.0:test (test) @ sansa-rdf-parent_2.12 ---
[INFO] Tests are skipped.
[INFO] 
[INFO] --- maven-javadoc-plugin:3.1.1:jar (attach-javadocs) @ sansa-rdf-parent_2.12 ---
[INFO] Not executing Javadoc as the project is not a Java classpath-capable package
[INFO] 
[INFO] >>> scala-maven-plugin:4.4.0:doc-jar (attach-javadocs) > generate-sources @ sansa-rdf-parent_2.12 >>>
[INFO] 
[INFO] --- scala-maven-plugin:4.4.0:add-source (default) @ sansa-rdf-parent_2.12 ---
[INFO] 
[INFO] --- jacoco-maven-plugin:0.8.4:prepare-agent (prepare-agent) @ sansa-rdf-parent_2.12 ---
[INFO] argLine set to -javaagent:/usr/share/tomcat8/.m2/repository/org/jacoco/org.jacoco.agent/0.8.4/org.jacoco.agent-0.8.4-runtime.jar=destfile=/usr/share/tomcat8/.jenkins/jobs/SANSA-Stack/branches/feature-sans.sb0bt7.eline-design/workspace/sansa-rdf/target/jacoco.exec
[INFO] 
[INFO] <<< scala-maven-plugin:4.4.0:doc-jar (attach-javadocs) < generate-sources @ sansa-rdf-parent_2.12 <<<
[INFO] 
[INFO] 
[INFO] --- scala-maven-plugin:4.4.0:doc-jar (attach-javadocs) @ sansa-rdf-parent_2.12 ---
[INFO] No source files found
[INFO] 
[INFO] --- maven-source-plugin:3.0.1:jar-no-fork (attach-sources) @ sansa-rdf-parent_2.12 ---
[INFO] 
[INFO] --- maven-install-plugin:2.4:install (default-install) @ sansa-rdf-parent_2.12 ---
[INFO] Installing /usr/share/tomcat8/.jenkins/jobs/SANSA-Stack/branches/feature-sans.sb0bt7.eline-design/workspace/sansa-rdf/pom.xml to /usr/share/tomcat8/.m2/repository/net/sansa-stack/sansa-rdf-parent_2.12/0.7.2-SNAPSHOT/sansa-rdf-parent_2.12-0.7.2-SNAPSHOT.pom
[INFO] 
[INFO] --- maven-deploy-plugin:2.7:deploy (default-deploy) @ sansa-rdf-parent_2.12 ---
[INFO] Downloading from maven.aksw.snapshots: https://maven.aksw.org/archiva/repository/snapshots/net/sansa-stack/sansa-rdf-parent_2.12/0.7.2-SNAPSHOT/maven-metadata.xml
[INFO] Downloaded from maven.aksw.snapshots: https://maven.aksw.org/archiva/repository/snapshots/net/sansa-stack/sansa-rdf-parent_2.12/0.7.2-SNAPSHOT/maven-metadata.xml (375 B at 42 kB/s)
[INFO] Uploading to maven.aksw.snapshots: https://maven.aksw.org/archiva/repository/snapshots/net/sansa-stack/sansa-rdf-parent_2.12/0.7.2-SNAPSHOT/sansa-rdf-parent_2.12-0.7.2-20201215.121513-108.pom
[INFO] Uploaded to maven.aksw.snapshots: https://maven.aksw.org/archiva/repository/snapshots/net/sansa-stack/sansa-rdf-parent_2.12/0.7.2-SNAPSHOT/sansa-rdf-parent_2.12-0.7.2-20201215.121513-108.pom (2.0 kB at 58 kB/s)
[INFO] Downloading from maven.aksw.snapshots: https://maven.aksw.org/archiva/repository/snapshots/net/sansa-stack/sansa-rdf-parent_2.12/maven-metadata.xml
[INFO] Downloaded from maven.aksw.snapshots: https://maven.aksw.org/archiva/repository/snapshots/net/sansa-stack/sansa-rdf-parent_2.12/maven-metadata.xml (333 B at 33 kB/s)
[INFO] Uploading to maven.aksw.snapshots: https://maven.aksw.org/archiva/repository/snapshots/net/sansa-stack/sansa-rdf-parent_2.12/0.7.2-SNAPSHOT/maven-metadata.xml
[INFO] Uploaded to maven.aksw.snapshots: https://maven.aksw.org/archiva/repository/snapshots/net/sansa-stack/sansa-rdf-parent_2.12/0.7.2-SNAPSHOT/maven-metadata.xml (617 B at 44 kB/s)
[INFO] Uploading to maven.aksw.snapshots: https://maven.aksw.org/archiva/repository/snapshots/net/sansa-stack/sansa-rdf-parent_2.12/maven-metadata.xml
[INFO] Uploaded to maven.aksw.snapshots: https://maven.aksw.org/archiva/repository/snapshots/net/sansa-stack/sansa-rdf-parent_2.12/maven-metadata.xml (332 B at 24 kB/s)
[INFO] 
[INFO] ---------------< net.sansa-stack:sansa-rdf-common_2.12 >----------------
[INFO] Building sansa-rdf-common_2.12 0.7.2-SNAPSHOT                      [3/9]
[INFO] --------------------------------[ jar ]---------------------------------
[INFO] Downloading from oss-sonatype: https://oss.sonatype.org/content/repositories/snapshots/net/minidev/json-smart/maven-metadata.xml
[INFO] Downloading from oss-sonatype-releases: https://oss.sonatype.org/content/repositories/releases/net/minidev/json-smart/maven-metadata.xml
[INFO] Downloading from apache-snapshot: https://repository.apache.org/content/repositories/snapshots/net/minidev/json-smart/maven-metadata.xml
[INFO] Downloading from maven.aksw.snapshots: https://maven.aksw.org/archiva/repository/snapshots/net/minidev/json-smart/maven-metadata.xml
[INFO] Downloading from maven.aksw.internal: https://maven.aksw.org/archiva/repository/internal/net/minidev/json-smart/maven-metadata.xml
[INFO] Downloaded from maven.aksw.internal: https://maven.aksw.org/archiva/repository/internal/net/minidev/json-smart/maven-metadata.xml (383 B at 5.2 kB/s)
[INFO] Downloading from netbeans: https://bits.netbeans.org/nexus/content/groups/netbeans/net/minidev/json-smart/maven-metadata.xml
[INFO] Downloading from central: https://repo.maven.apache.org/maven2/net/minidev/json-smart/maven-metadata.xml
[INFO] Downloaded from central: https://repo.maven.apache.org/maven2/net/minidev/json-smart/maven-metadata.xml (849 B at 6.4 kB/s)
[INFO] Downloading from apache.snapshots.https: https://repository.apache.org/content/repositories/snapshots/net/minidev/json-smart/maven-metadata.xml
[INFO] Downloading from repository.jboss.org: http://repository.jboss.org/nexus/content/groups/public/net/minidev/json-smart/maven-metadata.xml
[INFO] Downloaded from oss-sonatype-releases: https://oss.sonatype.org/content/repositories/releases/net/minidev/json-smart/maven-metadata.xml (849 B at 1.1 kB/s)
[INFO] 
[INFO] --- maven-clean-plugin:2.5:clean (default-clean) @ sansa-rdf-common_2.12 ---
[INFO] Deleting /usr/share/tomcat8/.jenkins/jobs/SANSA-Stack/branches/feature-sans.sb0bt7.eline-design/workspace/sansa-rdf/sansa-rdf-common/target
[INFO] 
[INFO] --- scala-maven-plugin:4.4.0:add-source (default) @ sansa-rdf-common_2.12 ---
[INFO] Add Source directory: /usr/share/tomcat8/.jenkins/jobs/SANSA-Stack/branches/feature-sans.sb0bt7.eline-design/workspace/sansa-rdf/sansa-rdf-common/src/main/scala
[INFO] Add Test Source directory: /usr/share/tomcat8/.jenkins/jobs/SANSA-Stack/branches/feature-sans.sb0bt7.eline-design/workspace/sansa-rdf/sansa-rdf-common/src/test/scala
[INFO] 
[INFO] --- jacoco-maven-plugin:0.8.4:prepare-agent (prepare-agent) @ sansa-rdf-common_2.12 ---
[INFO] argLine set to -javaagent:/usr/share/tomcat8/.m2/repository/org/jacoco/org.jacoco.agent/0.8.4/org.jacoco.agent-0.8.4-runtime.jar=destfile=/usr/share/tomcat8/.jenkins/jobs/SANSA-Stack/branches/feature-sans.sb0bt7.eline-design/workspace/sansa-rdf/sansa-rdf-common/target/jacoco.exec
[INFO] 
[INFO] --- maven-resources-plugin:3.0.2:resources (default-resources) @ sansa-rdf-common_2.12 ---
[INFO] Using 'UTF-8' encoding to copy filtered resources.
[INFO] Copying 2 resources
[INFO] 
[INFO] --- maven-compiler-plugin:3.8.1:compile (default-compile) @ sansa-rdf-common_2.12 ---
[INFO] Changes detected - recompiling the module!
[INFO] Compiling 9 source files to /usr/share/tomcat8/.jenkins/jobs/SANSA-Stack/branches/feature-sans.sb0bt7.eline-design/workspace/sansa-rdf/sansa-rdf-common/target/classes
[INFO] /usr/share/tomcat8/.jenkins/jobs/SANSA-Stack/branches/feature-sans.sb0bt7.eline-design/workspace/sansa-rdf/sansa-rdf-common/src/main/java/net/sansa_stack/rdf/benchmark/io/SansaBenchRdfIo.java: Some input files use or override a deprecated API.
[INFO] /usr/share/tomcat8/.jenkins/jobs/SANSA-Stack/branches/feature-sans.sb0bt7.eline-design/workspace/sansa-rdf/sansa-rdf-common/src/main/java/net/sansa_stack/rdf/benchmark/io/SansaBenchRdfIo.java: Recompile with -Xlint:deprecation for details.
[INFO] 
[INFO] --- scala-maven-plugin:4.4.0:compile (default) @ sansa-rdf-common_2.12 ---
[INFO] Using incremental compilation using Mixed compile order
[INFO] Compiler bridge file: /usr/share/tomcat8/.sbt/1.0/zinc/org.scala-sbt/org.scala-sbt-compiler-bridge_2.12-1.3.5-bin_2.12.11__52.0-1.3.5_20200330T000931.jar
[INFO] Compiling 40 Scala sources and 9 Java sources to /usr/share/tomcat8/.jenkins/jobs/SANSA-Stack/branches/feature-sans.sb0bt7.eline-design/workspace/sansa-rdf/sansa-rdf-common/target/classes ...
[WARNING] Unexpected javac output: Note: CAL10NAnnotationProcessor 0.8.1 initialized
warning: Supported source version 'RELEASE_5' from annotation processor 'ch.qos.cal10n.verifier.processor.CAL10NAnnotationProcessor' less than -source '1.8'
Note: Some input files use or override a deprecated API.
Note: Recompile with -Xlint:deprecation for details.
1 warning.
[INFO] NoPosition: Note: CAL10NAnnotationProcessor 0.8.1 initialized
[INFO] Done compiling.
[INFO] compile in 14.4 s
[INFO] 
[INFO] --- maven-resources-plugin:3.0.2:testResources (default-testResources) @ sansa-rdf-common_2.12 ---
[INFO] Using 'UTF-8' encoding to copy filtered resources.
[INFO] Copying 8 resources
[INFO] 
[INFO] --- maven-compiler-plugin:3.8.1:testCompile (default-testCompile) @ sansa-rdf-common_2.12 ---
[INFO] Changes detected - recompiling the module!
[INFO] 
[INFO] --- scala-maven-plugin:4.4.0:testCompile (default) @ sansa-rdf-common_2.12 ---
[INFO] Using incremental compilation using Mixed compile order
[INFO] Compiler bridge file: /usr/share/tomcat8/.sbt/1.0/zinc/org.scala-sbt/org.scala-sbt-compiler-bridge_2.12-1.3.5-bin_2.12.11__52.0-1.3.5_20200330T000931.jar
[INFO] Compiling 11 Scala sources to /usr/share/tomcat8/.jenkins/jobs/SANSA-Stack/branches/feature-sans.sb0bt7.eline-design/workspace/sansa-rdf/sansa-rdf-common/target/test-classes ...
[INFO] Done compiling.
[INFO] compile in 5.7 s
[INFO] 
[INFO] --- maven-surefire-plugin:2.20.1:test (default-test) @ sansa-rdf-common_2.12 ---
[INFO] Tests are skipped.
[INFO] 
[INFO] --- scalatest-maven-plugin:2.0.0:test (test) @ sansa-rdf-common_2.12 ---
[INFO] Tests are skipped.
[INFO] 
[INFO] --- maven-jar-plugin:2.4:jar (default-jar) @ sansa-rdf-common_2.12 ---
[INFO] Building jar: /usr/share/tomcat8/.jenkins/jobs/SANSA-Stack/branches/feature-sans.sb0bt7.eline-design/workspace/sansa-rdf/sansa-rdf-common/target/sansa-rdf-common_2.12-0.7.2-SNAPSHOT.jar
[INFO] 
[INFO] --- maven-javadoc-plugin:3.1.1:jar (attach-javadocs) @ sansa-rdf-common_2.12 ---
[INFO] 
Loading source files for package net.sansa_stack.rdf.benchmark.io...
Loading source files for package net.sansa_stack.rdf.common.annotation...
Loading source files for package net.sansa_stack.rdf.common.io.riot.tokens...
Loading source files for package net.sansa_stack.rdf.common.io.riot.lang...
Constructing Javadoc information...
Standard Doclet version 1.8.0_252
Building tree for all the packages and classes...
Generating /usr/share/tomcat8/.jenkins/jobs/SANSA-Stack/branches/feature-sans.sb0bt7.eline-design/workspace/sansa-rdf/sansa-rdf-common/target/apidocs/net/sansa_stack/rdf/benchmark/io/ReadableByteChannelFromIterator.html...
Generating /usr/share/tomcat8/.jenkins/jobs/SANSA-Stack/branches/feature-sans.sb0bt7.eline-design/workspace/sansa-rdf/sansa-rdf-common/target/apidocs/net/sansa_stack/rdf/benchmark/io/SansaBenchRdfIo.html...
Generating /usr/share/tomcat8/.jenkins/jobs/SANSA-Stack/branches/feature-sans.sb0bt7.eline-design/workspace/sansa-rdf/sansa-rdf-common/target/apidocs/net/sansa_stack/rdf/common/annotation/AlphaComponent.html...
Generating /usr/share/tomcat8/.jenkins/jobs/SANSA-Stack/branches/feature-sans.sb0bt7.eline-design/workspace/sansa-rdf/sansa-rdf-common/target/apidocs/net/sansa_stack/rdf/common/annotation/DeveloperApi.html...
Generating /usr/share/tomcat8/.jenkins/jobs/SANSA-Stack/branches/feature-sans.sb0bt7.eline-design/workspace/sansa-rdf/sansa-rdf-common/target/apidocs/net/sansa_stack/rdf/common/annotation/Experimental.html...
Generating /usr/share/tomcat8/.jenkins/jobs/SANSA-Stack/branches/feature-sans.sb0bt7.eline-design/workspace/sansa-rdf/sansa-rdf-common/target/apidocs/net/sansa_stack/rdf/common/io/riot/tokens/TokenizerTextForgiving.html...
Generating /usr/share/tomcat8/.jenkins/jobs/SANSA-Stack/branches/feature-sans.sb0bt7.eline-design/workspace/sansa-rdf/sansa-rdf-common/target/apidocs/net/sansa_stack/rdf/common/io/riot/tokens/TokenizerTextForgiving.ErrorHandlerTokenizer.html...
Generating /usr/share/tomcat8/.jenkins/jobs/SANSA-Stack/branches/feature-sans.sb0bt7.eline-design/workspace/sansa-rdf/sansa-rdf-common/target/apidocs/net/sansa_stack/rdf/common/io/riot/lang/LangNQuadsSkipBad.html...
Generating /usr/share/tomcat8/.jenkins/jobs/SANSA-Stack/branches/feature-sans.sb0bt7.eline-design/workspace/sansa-rdf/sansa-rdf-common/target/apidocs/net/sansa_stack/rdf/common/io/riot/lang/LangNTriplesSkipBad.html...
Generating /usr/share/tomcat8/.jenkins/jobs/SANSA-Stack/branches/feature-sans.sb0bt7.eline-design/workspace/sansa-rdf/sansa-rdf-common/target/apidocs/overview-frame.html...
Generating /usr/share/tomcat8/.jenkins/jobs/SANSA-Stack/branches/feature-sans.sb0bt7.eline-design/workspace/sansa-rdf/sansa-rdf-common/target/apidocs/net/sansa_stack/rdf/benchmark/io/package-frame.html...
Generating /usr/share/tomcat8/.jenkins/jobs/SANSA-Stack/branches/feature-sans.sb0bt7.eline-design/workspace/sansa-rdf/sansa-rdf-common/target/apidocs/net/sansa_stack/rdf/benchmark/io/package-summary.html...
Generating /usr/share/tomcat8/.jenkins/jobs/SANSA-Stack/branches/feature-sans.sb0bt7.eline-design/workspace/sansa-rdf/sansa-rdf-common/target/apidocs/net/sansa_stack/rdf/benchmark/io/package-tree.html...
Generating /usr/share/tomcat8/.jenkins/jobs/SANSA-Stack/branches/feature-sans.sb0bt7.eline-design/workspace/sansa-rdf/sansa-rdf-common/target/apidocs/net/sansa_stack/rdf/common/annotation/package-frame.html...
Generating /usr/share/tomcat8/.jenkins/jobs/SANSA-Stack/branches/feature-sans.sb0bt7.eline-design/workspace/sansa-rdf/sansa-rdf-common/target/apidocs/net/sansa_stack/rdf/common/annotation/package-summary.html...
Generating /usr/share/tomcat8/.jenkins/jobs/SANSA-Stack/branches/feature-sans.sb0bt7.eline-design/workspace/sansa-rdf/sansa-rdf-common/target/apidocs/net/sansa_stack/rdf/common/annotation/package-tree.html...
Generating /usr/share/tomcat8/.jenkins/jobs/SANSA-Stack/branches/feature-sans.sb0bt7.eline-design/workspace/sansa-rdf/sansa-rdf-common/target/apidocs/net/sansa_stack/rdf/common/io/riot/lang/package-frame.html...
Generating /usr/share/tomcat8/.jenkins/jobs/SANSA-Stack/branches/feature-sans.sb0bt7.eline-design/workspace/sansa-rdf/sansa-rdf-common/target/apidocs/net/sansa_stack/rdf/common/io/riot/lang/package-summary.html...
Generating /usr/share/tomcat8/.jenkins/jobs/SANSA-Stack/branches/feature-sans.sb0bt7.eline-design/workspace/sansa-rdf/sansa-rdf-common/target/apidocs/net/sansa_stack/rdf/common/io/riot/lang/package-tree.html...
Generating /usr/share/tomcat8/.jenkins/jobs/SANSA-Stack/branches/feature-sans.sb0bt7.eline-design/workspace/sansa-rdf/sansa-rdf-common/target/apidocs/net/sansa_stack/rdf/common/io/riot/tokens/package-frame.html...
Generating /usr/share/tomcat8/.jenkins/jobs/SANSA-Stack/branches/feature-sans.sb0bt7.eline-design/workspace/sansa-rdf/sansa-rdf-common/target/apidocs/net/sansa_stack/rdf/common/io/riot/tokens/package-summary.html...
Generating /usr/share/tomcat8/.jenkins/jobs/SANSA-Stack/branches/feature-sans.sb0bt7.eline-design/workspace/sansa-rdf/sansa-rdf-common/target/apidocs/net/sansa_stack/rdf/common/io/riot/tokens/package-tree.html...
Generating /usr/share/tomcat8/.jenkins/jobs/SANSA-Stack/branches/feature-sans.sb0bt7.eline-design/workspace/sansa-rdf/sansa-rdf-common/target/apidocs/constant-values.html...
Generating /usr/share/tomcat8/.jenkins/jobs/SANSA-Stack/branches/feature-sans.sb0bt7.eline-design/workspace/sansa-rdf/sansa-rdf-common/target/apidocs/net/sansa_stack/rdf/benchmark/io/class-use/ReadableByteChannelFromIterator.html...
Generating /usr/share/tomcat8/.jenkins/jobs/SANSA-Stack/branches/feature-sans.sb0bt7.eline-design/workspace/sansa-rdf/sansa-rdf-common/target/apidocs/net/sansa_stack/rdf/benchmark/io/class-use/SansaBenchRdfIo.html...
Generating /usr/share/tomcat8/.jenkins/jobs/SANSA-Stack/branches/feature-sans.sb0bt7.eline-design/workspace/sansa-rdf/sansa-rdf-common/target/apidocs/net/sansa_stack/rdf/common/annotation/class-use/DeveloperApi.html...
Generating /usr/share/tomcat8/.jenkins/jobs/SANSA-Stack/branches/feature-sans.sb0bt7.eline-design/workspace/sansa-rdf/sansa-rdf-common/target/apidocs/net/sansa_stack/rdf/common/annotation/class-use/Experimental.html...
Generating /usr/share/tomcat8/.jenkins/jobs/SANSA-Stack/branches/feature-sans.sb0bt7.eline-design/workspace/sansa-rdf/sansa-rdf-common/target/apidocs/net/sansa_stack/rdf/common/annotation/class-use/AlphaComponent.html...
Generating /usr/share/tomcat8/.jenkins/jobs/SANSA-Stack/branches/feature-sans.sb0bt7.eline-design/workspace/sansa-rdf/sansa-rdf-common/target/apidocs/net/sansa_stack/rdf/common/io/riot/tokens/class-use/TokenizerTextForgiving.html...
Generating /usr/share/tomcat8/.jenkins/jobs/SANSA-Stack/branches/feature-sans.sb0bt7.eline-design/workspace/sansa-rdf/sansa-rdf-common/target/apidocs/net/sansa_stack/rdf/common/io/riot/tokens/class-use/TokenizerTextForgiving.ErrorHandlerTokenizer.html...
Generating /usr/share/tomcat8/.jenkins/jobs/SANSA-Stack/branches/feature-sans.sb0bt7.eline-design/workspace/sansa-rdf/sansa-rdf-common/target/apidocs/net/sansa_stack/rdf/common/io/riot/lang/class-use/LangNTriplesSkipBad.html...
Generating /usr/share/tomcat8/.jenkins/jobs/SANSA-Stack/branches/feature-sans.sb0bt7.eline-design/workspace/sansa-rdf/sansa-rdf-common/target/apidocs/net/sansa_stack/rdf/common/io/riot/lang/class-use/LangNQuadsSkipBad.html...
Generating /usr/share/tomcat8/.jenkins/jobs/SANSA-Stack/branches/feature-sans.sb0bt7.eline-design/workspace/sansa-rdf/sansa-rdf-common/target/apidocs/net/sansa_stack/rdf/benchmark/io/package-use.html...
Generating /usr/share/tomcat8/.jenkins/jobs/SANSA-Stack/branches/feature-sans.sb0bt7.eline-design/workspace/sansa-rdf/sansa-rdf-common/target/apidocs/net/sansa_stack/rdf/common/annotation/package-use.html...
Generating /usr/share/tomcat8/.jenkins/jobs/SANSA-Stack/branches/feature-sans.sb0bt7.eline-design/workspace/sansa-rdf/sansa-rdf-common/target/apidocs/net/sansa_stack/rdf/common/io/riot/lang/package-use.html...
Generating /usr/share/tomcat8/.jenkins/jobs/SANSA-Stack/branches/feature-sans.sb0bt7.eline-design/workspace/sansa-rdf/sansa-rdf-common/target/apidocs/net/sansa_stack/rdf/common/io/riot/tokens/package-use.html...
Building index for all the packages and classes...
Generating /usr/share/tomcat8/.jenkins/jobs/SANSA-Stack/branches/feature-sans.sb0bt7.eline-design/workspace/sansa-rdf/sansa-rdf-common/target/apidocs/overview-tree.html...
Generating /usr/share/tomcat8/.jenkins/jobs/SANSA-Stack/branches/feature-sans.sb0bt7.eline-design/workspace/sansa-rdf/sansa-rdf-common/target/apidocs/index-all.html...
Generating /usr/share/tomcat8/.jenkins/jobs/SANSA-Stack/branches/feature-sans.sb0bt7.eline-design/workspace/sansa-rdf/sansa-rdf-common/target/apidocs/deprecated-list.html...
Building index for all classes...
Generating /usr/share/tomcat8/.jenkins/jobs/SANSA-Stack/branches/feature-sans.sb0bt7.eline-design/workspace/sansa-rdf/sansa-rdf-common/target/apidocs/allclasses-frame.html...
Generating /usr/share/tomcat8/.jenkins/jobs/SANSA-Stack/branches/feature-sans.sb0bt7.eline-design/workspace/sansa-rdf/sansa-rdf-common/target/apidocs/allclasses-noframe.html...
Generating /usr/share/tomcat8/.jenkins/jobs/SANSA-Stack/branches/feature-sans.sb0bt7.eline-design/workspace/sansa-rdf/sansa-rdf-common/target/apidocs/index.html...
Generating /usr/share/tomcat8/.jenkins/jobs/SANSA-Stack/branches/feature-sans.sb0bt7.eline-design/workspace/sansa-rdf/sansa-rdf-common/target/apidocs/overview-summary.html...
Generating /usr/share/tomcat8/.jenkins/jobs/SANSA-Stack/branches/feature-sans.sb0bt7.eline-design/workspace/sansa-rdf/sansa-rdf-common/target/apidocs/help-doc.html...
[INFO] Building jar: /usr/share/tomcat8/.jenkins/jobs/SANSA-Stack/branches/feature-sans.sb0bt7.eline-design/workspace/sansa-rdf/sansa-rdf-common/target/sansa-rdf-common_2.12-0.7.2-SNAPSHOT-javadoc.jar
[INFO] 
[INFO] >>> scala-maven-plugin:4.4.0:doc-jar (attach-javadocs) > generate-sources @ sansa-rdf-common_2.12 >>>
[INFO] 
[INFO] --- scala-maven-plugin:4.4.0:add-source (default) @ sansa-rdf-common_2.12 ---
[INFO] 
[INFO] --- jacoco-maven-plugin:0.8.4:prepare-agent (prepare-agent) @ sansa-rdf-common_2.12 ---
[INFO] argLine set to -javaagent:/usr/share/tomcat8/.m2/repository/org/jacoco/org.jacoco.agent/0.8.4/org.jacoco.agent-0.8.4-runtime.jar=destfile=/usr/share/tomcat8/.jenkins/jobs/SANSA-Stack/branches/feature-sans.sb0bt7.eline-design/workspace/sansa-rdf/sansa-rdf-common/target/jacoco.exec
[INFO] 
[INFO] <<< scala-maven-plugin:4.4.0:doc-jar (attach-javadocs) < generate-sources @ sansa-rdf-common_2.12 <<<
[INFO] 
[INFO] 
[INFO] --- scala-maven-plugin:4.4.0:doc-jar (attach-javadocs) @ sansa-rdf-common_2.12 ---
model contains 92 documentable templates
/usr/share/tomcat8/.jenkins/jobs/SANSA-Stack/branches/feature-sans.sb0bt7.eline-design/workspace/sansa-rdf/sansa-rdf-common/src/main/scala/net/sansa_stack/rdf/common/io/ntriples/NTriplesStringToJenaTriple.scala:8: warning: Could not find any member to link for "Triple".
/**
^
/usr/share/tomcat8/.jenkins/jobs/SANSA-Stack/branches/feature-sans.sb0bt7.eline-design/workspace/sansa-rdf/sansa-rdf-common/src/main/scala/net/sansa_stack/rdf/common/qualityassessment/utils/NodeUtils.scala:67: warning: Could not find any member to link for "resource".
  /**
  ^
/usr/share/tomcat8/.jenkins/jobs/SANSA-Stack/branches/feature-sans.sb0bt7.eline-design/workspace/sansa-rdf/sansa-rdf-common/src/main/scala/net/sansa_stack/rdf/common/qualityassessment/utils/NodeUtils.scala:54: warning: Could not find any member to link for "resource".
  /**
  ^
/usr/share/tomcat8/.jenkins/jobs/SANSA-Stack/branches/feature-sans.sb0bt7.eline-design/workspace/sansa-rdf/sansa-rdf-common/src/main/scala/net/sansa_stack/rdf/common/qualityassessment/utils/NodeUtils.scala:45: warning: Could not find any member to link for "resource".
  /**
  ^
four warnings found
[INFO] start aggregation into /usr/share/tomcat8/.jenkins/jobs/SANSA-Stack/branches/feature-sans.sb0bt7.eline-design/workspace/sansa-rdf/sansa-rdf-common/target/site/scaladocs
[WARNING] no vscaladoc to aggregate
[INFO] Building jar: /usr/share/tomcat8/.jenkins/jobs/SANSA-Stack/branches/feature-sans.sb0bt7.eline-design/workspace/sansa-rdf/sansa-rdf-common/target/sansa-rdf-common_2.12-0.7.2-SNAPSHOT-javadoc.jar
[INFO] 
[INFO] --- maven-source-plugin:3.0.1:jar-no-fork (attach-sources) @ sansa-rdf-common_2.12 ---
[INFO] Building jar: /usr/share/tomcat8/.jenkins/jobs/SANSA-Stack/branches/feature-sans.sb0bt7.eline-design/workspace/sansa-rdf/sansa-rdf-common/target/sansa-rdf-common_2.12-0.7.2-SNAPSHOT-sources.jar
[INFO] 
[INFO] --- scalastyle-maven-plugin:1.0.0:check (default) @ sansa-rdf-common_2.12 ---
warning file=/usr/share/tomcat8/.jenkins/jobs/SANSA-Stack/branches/feature-sans.sb0bt7.eline-design/workspace/sansa-rdf/sansa-rdf-common/src/main/scala/net/sansa_stack/rdf/common/partition/utils/Symbols.scala message=Header does not match expected text line=1
warning file=/usr/share/tomcat8/.jenkins/jobs/SANSA-Stack/branches/feature-sans.sb0bt7.eline-design/workspace/sansa-rdf/sansa-rdf-common/src/main/scala/net/sansa_stack/rdf/common/partition/utils/Symbols.scala message=Package name does not match the regular expression '^[a-z][A-Za-z]*$' line=1 column=12
warning file=/usr/share/tomcat8/.jenkins/jobs/SANSA-Stack/branches/feature-sans.sb0bt7.eline-design/workspace/sansa-rdf/sansa-rdf-common/src/main/scala/net/sansa_stack/rdf/common/partition/utils/Symbols.scala message=Field name does not match the regular expression '^[A-Z][A-Za-z]*$' line=8 column=6
warning file=/usr/share/tomcat8/.jenkins/jobs/SANSA-Stack/branches/feature-sans.sb0bt7.eline-design/workspace/sansa-rdf/sansa-rdf-common/src/main/scala/net/sansa_stack/rdf/common/partition/utils/RdfTerm.scala message=Header does not match expected text line=1
warning file=/usr/share/tomcat8/.jenkins/jobs/SANSA-Stack/branches/feature-sans.sb0bt7.eline-design/workspace/sansa-rdf/sansa-rdf-common/src/main/scala/net/sansa_stack/rdf/common/partition/utils/RdfTerm.scala message=Package name does not match the regular expression '^[a-z][A-Za-z]*$' line=1 column=12
warning file=/usr/share/tomcat8/.jenkins/jobs/SANSA-Stack/branches/feature-sans.sb0bt7.eline-design/workspace/sansa-rdf/sansa-rdf-common/src/main/scala/net/sansa_stack/rdf/common/partition/utils/RdfTerm.scala message=Avoid using null line=43 column=23
warning file=/usr/share/tomcat8/.jenkins/jobs/SANSA-Stack/branches/feature-sans.sb0bt7.eline-design/workspace/sansa-rdf/sansa-rdf-common/src/main/scala/net/sansa_stack/rdf/common/partition/utils/RdfTerm.scala message=Avoid using null line=44 column=21
warning file=/usr/share/tomcat8/.jenkins/jobs/SANSA-Stack/branches/feature-sans.sb0bt7.eline-design/workspace/sansa-rdf/sansa-rdf-common/src/main/scala/net/sansa_stack/rdf/common/partition/utils/RdfTerm.scala message=Regular expression matched 'println' line=60 column=22
warning file=/usr/share/tomcat8/.jenkins/jobs/SANSA-Stack/branches/feature-sans.sb0bt7.eline-design/workspace/sansa-rdf/sansa-rdf-common/src/main/scala/net/sansa_stack/rdf/common/partition/model/sparqlify/SparqlifyUtils2.scala message=Header does not match expected text line=1
warning file=/usr/share/tomcat8/.jenkins/jobs/SANSA-Stack/branches/feature-sans.sb0bt7.eline-design/workspace/sansa-rdf/sansa-rdf-common/src/main/scala/net/sansa_stack/rdf/common/partition/model/sparqlify/SparqlifyUtils2.scala message=File line length exceeds 160 characters line=96
warning file=/usr/share/tomcat8/.jenkins/jobs/SANSA-Stack/branches/feature-sans.sb0bt7.eline-design/workspace/sansa-rdf/sansa-rdf-common/src/main/scala/net/sansa_stack/rdf/common/partition/model/sparqlify/SparqlifyUtils2.scala message=Package name does not match the regular expression '^[a-z][A-Za-z]*$' line=1 column=12
warning file=/usr/share/tomcat8/.jenkins/jobs/SANSA-Stack/branches/feature-sans.sb0bt7.eline-design/workspace/sansa-rdf/sansa-rdf-common/src/main/scala/net/sansa_stack/rdf/common/partition/model/sparqlify/SparqlifyUtils2.scala message=Regular expression matched 'println' line=31 column=7
warning file=/usr/share/tomcat8/.jenkins/jobs/SANSA-Stack/branches/feature-sans.sb0bt7.eline-design/workspace/sansa-rdf/sansa-rdf-common/src/main/scala/net/sansa_stack/rdf/common/partition/model/sparqlify/SparqlifyUtils2.scala message=Regular expression matched 'println' line=33 column=26
warning file=/usr/share/tomcat8/.jenkins/jobs/SANSA-Stack/branches/feature-sans.sb0bt7.eline-design/workspace/sansa-rdf/sansa-rdf-common/src/main/scala/net/sansa_stack/rdf/common/partition/model/sparqlify/SparqlifyUtils2.scala message=Regular expression matched 'println' line=38 column=7
warning file=/usr/share/tomcat8/.jenkins/jobs/SANSA-Stack/branches/feature-sans.sb0bt7.eline-design/workspace/sansa-rdf/sansa-rdf-common/src/main/scala/net/sansa_stack/rdf/common/partition/model/sparqlify/SparqlifyUtils2.scala message=Regular expression matched 'println' line=78 column=7
warning file=/usr/share/tomcat8/.jenkins/jobs/SANSA-Stack/branches/feature-sans.sb0bt7.eline-design/workspace/sansa-rdf/sansa-rdf-common/src/main/scala/net/sansa_stack/rdf/common/partition/model/sparqlify/SparqlifyUtils2.scala message=Method is longer than 50 lines line=29 column=6
warning file=/usr/share/tomcat8/.jenkins/jobs/SANSA-Stack/branches/feature-sans.sb0bt7.eline-design/workspace/sansa-rdf/sansa-rdf-common/src/main/scala/net/sansa_stack/rdf/common/partition/model/sparqlify/SparqlifyUtils2.scala message=Argument should be named line=60 column=34
warning file=/usr/share/tomcat8/.jenkins/jobs/SANSA-Stack/branches/feature-sans.sb0bt7.eline-design/workspace/sansa-rdf/sansa-rdf-common/src/main/scala/net/sansa_stack/rdf/common/partition/model/sparqlify/SparqlifyUtils2.scala message=Argument should be named line=61 column=34
warning file=/usr/share/tomcat8/.jenkins/jobs/SANSA-Stack/branches/feature-sans.sb0bt7.eline-design/workspace/sansa-rdf/sansa-rdf-common/src/main/scala/net/sansa_stack/rdf/common/partition/core/RdfPartitioner.scala message=Header does not match expected text line=1
warning file=/usr/share/tomcat8/.jenkins/jobs/SANSA-Stack/branches/feature-sans.sb0bt7.eline-design/workspace/sansa-rdf/sansa-rdf-common/src/main/scala/net/sansa_stack/rdf/common/partition/core/RdfPartitioner.scala message=Package name does not match the regular expression '^[a-z][A-Za-z]*$' line=1 column=12
warning file=/usr/share/tomcat8/.jenkins/jobs/SANSA-Stack/branches/feature-sans.sb0bt7.eline-design/workspace/sansa-rdf/sansa-rdf-common/src/main/scala/net/sansa_stack/rdf/common/partition/core/RdfPartition.scala message=Header does not match expected text line=1
warning file=/usr/share/tomcat8/.jenkins/jobs/SANSA-Stack/branches/feature-sans.sb0bt7.eline-design/workspace/sansa-rdf/sansa-rdf-common/src/main/scala/net/sansa_stack/rdf/common/partition/core/RdfPartition.scala message=Package name does not match the regular expression '^[a-z][A-Za-z]*$' line=1 column=12
warning file=/usr/share/tomcat8/.jenkins/jobs/SANSA-Stack/branches/feature-sans.sb0bt7.eline-design/workspace/sansa-rdf/sansa-rdf-common/src/main/scala/net/sansa_stack/rdf/common/partition/core/RdfPartitionerComplex.scala message=Header does not match expected text line=1
warning file=/usr/share/tomcat8/.jenkins/jobs/SANSA-Stack/branches/feature-sans.sb0bt7.eline-design/workspace/sansa-rdf/sansa-rdf-common/src/main/scala/net/sansa_stack/rdf/common/partition/core/RdfPartitionerComplex.scala message=File line length exceeds 160 characters line=6
warning file=/usr/share/tomcat8/.jenkins/jobs/SANSA-Stack/branches/feature-sans.sb0bt7.eline-design/workspace/sansa-rdf/sansa-rdf-common/src/main/scala/net/sansa_stack/rdf/common/partition/core/RdfPartitionerComplex.scala message=Package name does not match the regular expression '^[a-z][A-Za-z]*$' line=1 column=12
warning file=/usr/share/tomcat8/.jenkins/jobs/SANSA-Stack/branches/feature-sans.sb0bt7.eline-design/workspace/sansa-rdf/sansa-rdf-common/src/main/scala/net/sansa_stack/rdf/common/partition/core/RdfPartitionerComplex.scala message=Cyclomatic complexity of 22 exceeds max of 10 line=116 column=6
warning file=/usr/share/tomcat8/.jenkins/jobs/SANSA-Stack/branches/feature-sans.sb0bt7.eline-design/workspace/sansa-rdf/sansa-rdf-common/src/main/scala/net/sansa_stack/rdf/common/partition/core/RdfPartitionerDefault.scala message=Header does not match expected text line=1
warning file=/usr/share/tomcat8/.jenkins/jobs/SANSA-Stack/branches/feature-sans.sb0bt7.eline-design/workspace/sansa-rdf/sansa-rdf-common/src/main/scala/net/sansa_stack/rdf/common/partition/core/RdfPartitionerDefault.scala message=File line length exceeds 160 characters line=3
warning file=/usr/share/tomcat8/.jenkins/jobs/SANSA-Stack/branches/feature-sans.sb0bt7.eline-design/workspace/sansa-rdf/sansa-rdf-common/src/main/scala/net/sansa_stack/rdf/common/partition/core/RdfPartitionerDefault.scala message=File line length exceeds 160 characters line=96
warning file=/usr/share/tomcat8/.jenkins/jobs/SANSA-Stack/branches/feature-sans.sb0bt7.eline-design/workspace/sansa-rdf/sansa-rdf-common/src/main/scala/net/sansa_stack/rdf/common/partition/core/RdfPartitionerDefault.scala message=Package name does not match the regular expression '^[a-z][A-Za-z]*$' line=1 column=12
warning file=/usr/share/tomcat8/.jenkins/jobs/SANSA-Stack/branches/feature-sans.sb0bt7.eline-design/workspace/sansa-rdf/sansa-rdf-common/src/main/scala/net/sansa_stack/rdf/common/partition/core/RdfPartitionerDefault.scala message=Cyclomatic complexity of 15 exceeds max of 10 line=84 column=6
warning file=/usr/share/tomcat8/.jenkins/jobs/SANSA-Stack/branches/feature-sans.sb0bt7.eline-design/workspace/sansa-rdf/sansa-rdf-common/src/main/scala/net/sansa_stack/rdf/common/partition/core/RdfPartitionerDefault.scala message=If block needs braces line=85 column=14
warning file=/usr/share/tomcat8/.jenkins/jobs/SANSA-Stack/branches/feature-sans.sb0bt7.eline-design/workspace/sansa-rdf/sansa-rdf-common/src/main/scala/net/sansa_stack/rdf/common/partition/core/RdfPartitionerDefault.scala message=Field name does not match the regular expression '^[A-Z][A-Za-z]*$' line=79 column=14
warning file=/usr/share/tomcat8/.jenkins/jobs/SANSA-Stack/branches/feature-sans.sb0bt7.eline-design/workspace/sansa-rdf/sansa-rdf-common/src/main/scala/net/sansa_stack/rdf/common/partition/core/RdfPartitionDefault.scala message=Header does not match expected text line=1
warning file=/usr/share/tomcat8/.jenkins/jobs/SANSA-Stack/branches/feature-sans.sb0bt7.eline-design/workspace/sansa-rdf/sansa-rdf-common/src/main/scala/net/sansa_stack/rdf/common/partition/core/RdfPartitionDefault.scala message=Package name does not match the regular expression '^[a-z][A-Za-z]*$' line=1 column=12
warning file=/usr/share/tomcat8/.jenkins/jobs/SANSA-Stack/branches/feature-sans.sb0bt7.eline-design/workspace/sansa-rdf/sansa-rdf-common/src/main/scala/net/sansa_stack/rdf/common/partition/core/RdfPartitionComplex.scala message=Header does not match expected text line=1
warning file=/usr/share/tomcat8/.jenkins/jobs/SANSA-Stack/branches/feature-sans.sb0bt7.eline-design/workspace/sansa-rdf/sansa-rdf-common/src/main/scala/net/sansa_stack/rdf/common/partition/core/RdfPartitionComplex.scala message=Package name does not match the regular expression '^[a-z][A-Za-z]*$' line=1 column=12
warning file=/usr/share/tomcat8/.jenkins/jobs/SANSA-Stack/branches/feature-sans.sb0bt7.eline-design/workspace/sansa-rdf/sansa-rdf-common/src/main/scala/net/sansa_stack/rdf/common/partition/schema/SchemaStringDecimal.scala message=Header does not match expected text line=1
warning file=/usr/share/tomcat8/.jenkins/jobs/SANSA-Stack/branches/feature-sans.sb0bt7.eline-design/workspace/sansa-rdf/sansa-rdf-common/src/main/scala/net/sansa_stack/rdf/common/partition/schema/SchemaStringDecimal.scala message=Package name does not match the regular expression '^[a-z][A-Za-z]*$' line=1 column=12
warning file=/usr/share/tomcat8/.jenkins/jobs/SANSA-Stack/branches/feature-sans.sb0bt7.eline-design/workspace/sansa-rdf/sansa-rdf-common/src/main/scala/net/sansa_stack/rdf/common/partition/schema/SchemaStringStringType.scala message=Header does not match expected text line=1
warning file=/usr/share/tomcat8/.jenkins/jobs/SANSA-Stack/branches/feature-sans.sb0bt7.eline-design/workspace/sansa-rdf/sansa-rdf-common/src/main/scala/net/sansa_stack/rdf/common/partition/schema/SchemaStringStringType.scala message=Package name does not match the regular expression '^[a-z][A-Za-z]*$' line=1 column=12
warning file=/usr/share/tomcat8/.jenkins/jobs/SANSA-Stack/branches/feature-sans.sb0bt7.eline-design/workspace/sansa-rdf/sansa-rdf-common/src/main/scala/net/sansa_stack/rdf/common/partition/schema/SchemaStringDouble.scala message=Header does not match expected text line=1
warning file=/usr/share/tomcat8/.jenkins/jobs/SANSA-Stack/branches/feature-sans.sb0bt7.eline-design/workspace/sansa-rdf/sansa-rdf-common/src/main/scala/net/sansa_stack/rdf/common/partition/schema/SchemaStringDouble.scala message=Package name does not match the regular expression '^[a-z][A-Za-z]*$' line=1 column=12
warning file=/usr/share/tomcat8/.jenkins/jobs/SANSA-Stack/branches/feature-sans.sb0bt7.eline-design/workspace/sansa-rdf/sansa-rdf-common/src/main/scala/net/sansa_stack/rdf/common/partition/schema/SchemaStringString.scala message=Header does not match expected text line=1
warning file=/usr/share/tomcat8/.jenkins/jobs/SANSA-Stack/branches/feature-sans.sb0bt7.eline-design/workspace/sansa-rdf/sansa-rdf-common/src/main/scala/net/sansa_stack/rdf/common/partition/schema/SchemaStringString.scala message=Package name does not match the regular expression '^[a-z][A-Za-z]*$' line=1 column=12
warning file=/usr/share/tomcat8/.jenkins/jobs/SANSA-Stack/branches/feature-sans.sb0bt7.eline-design/workspace/sansa-rdf/sansa-rdf-common/src/main/scala/net/sansa_stack/rdf/common/partition/schema/SchemaStringStringLang.scala message=Header does not match expected text line=1
warning file=/usr/share/tomcat8/.jenkins/jobs/SANSA-Stack/branches/feature-sans.sb0bt7.eline-design/workspace/sansa-rdf/sansa-rdf-common/src/main/scala/net/sansa_stack/rdf/common/partition/schema/SchemaStringStringLang.scala message=Package name does not match the regular expression '^[a-z][A-Za-z]*$' line=1 column=12
warning file=/usr/share/tomcat8/.jenkins/jobs/SANSA-Stack/branches/feature-sans.sb0bt7.eline-design/workspace/sansa-rdf/sansa-rdf-common/src/main/scala/net/sansa_stack/rdf/common/partition/schema/SchemaStringLong.scala message=Header does not match expected text line=1
warning file=/usr/share/tomcat8/.jenkins/jobs/SANSA-Stack/branches/feature-sans.sb0bt7.eline-design/workspace/sansa-rdf/sansa-rdf-common/src/main/scala/net/sansa_stack/rdf/common/partition/schema/SchemaStringLong.scala message=Package name does not match the regular expression '^[a-z][A-Za-z]*$' line=1 column=12
warning file=/usr/share/tomcat8/.jenkins/jobs/SANSA-Stack/branches/feature-sans.sb0bt7.eline-design/workspace/sansa-rdf/sansa-rdf-common/src/main/scala/net/sansa_stack/rdf/common/partition/schema/SchemaStringBoolean.scala message=Header does not match expected text line=1
warning file=/usr/share/tomcat8/.jenkins/jobs/SANSA-Stack/branches/feature-sans.sb0bt7.eline-design/workspace/sansa-rdf/sansa-rdf-common/src/main/scala/net/sansa_stack/rdf/common/partition/schema/SchemaStringBoolean.scala message=Package name does not match the regular expression '^[a-z][A-Za-z]*$' line=1 column=12
warning file=/usr/share/tomcat8/.jenkins/jobs/SANSA-Stack/branches/feature-sans.sb0bt7.eline-design/workspace/sansa-rdf/sansa-rdf-common/src/main/scala/net/sansa_stack/rdf/common/partition/schema/SchemaStringFloat.scala message=Header does not match expected text line=1
warning file=/usr/share/tomcat8/.jenkins/jobs/SANSA-Stack/branches/feature-sans.sb0bt7.eline-design/workspace/sansa-rdf/sansa-rdf-common/src/main/scala/net/sansa_stack/rdf/common/partition/schema/SchemaStringFloat.scala message=Package name does not match the regular expression '^[a-z][A-Za-z]*$' line=1 column=12
warning file=/usr/share/tomcat8/.jenkins/jobs/SANSA-Stack/branches/feature-sans.sb0bt7.eline-design/workspace/sansa-rdf/sansa-rdf-common/src/main/scala/net/sansa_stack/rdf/common/partition/schema/SchemaStringDate.scala message=Header does not match expected text line=1
warning file=/usr/share/tomcat8/.jenkins/jobs/SANSA-Stack/branches/feature-sans.sb0bt7.eline-design/workspace/sansa-rdf/sansa-rdf-common/src/main/scala/net/sansa_stack/rdf/common/partition/schema/SchemaStringDate.scala message=Package name does not match the regular expression '^[a-z][A-Za-z]*$' line=1 column=12
warning file=/usr/share/tomcat8/.jenkins/jobs/SANSA-Stack/branches/feature-sans.sb0bt7.eline-design/workspace/sansa-rdf/sansa-rdf-common/src/main/scala/net/sansa_stack/rdf/common/partition/layout/TripleLayoutBoolean.scala message=Header does not match expected text line=1
warning file=/usr/share/tomcat8/.jenkins/jobs/SANSA-Stack/branches/feature-sans.sb0bt7.eline-design/workspace/sansa-rdf/sansa-rdf-common/src/main/scala/net/sansa_stack/rdf/common/partition/layout/TripleLayoutBoolean.scala message=Package name does not match the regular expression '^[a-z][A-Za-z]*$' line=1 column=12
warning file=/usr/share/tomcat8/.jenkins/jobs/SANSA-Stack/branches/feature-sans.sb0bt7.eline-design/workspace/sansa-rdf/sansa-rdf-common/src/main/scala/net/sansa_stack/rdf/common/partition/layout/TripleLayoutBoolean.scala message=If block needs braces line=29 column=12
warning file=/usr/share/tomcat8/.jenkins/jobs/SANSA-Stack/branches/feature-sans.sb0bt7.eline-design/workspace/sansa-rdf/sansa-rdf-common/src/main/scala/net/sansa_stack/rdf/common/partition/layout/TripleLayoutStringDate.scala message=Header does not match expected text line=1
warning file=/usr/share/tomcat8/.jenkins/jobs/SANSA-Stack/branches/feature-sans.sb0bt7.eline-design/workspace/sansa-rdf/sansa-rdf-common/src/main/scala/net/sansa_stack/rdf/common/partition/layout/TripleLayoutStringDate.scala message=Package name does not match the regular expression '^[a-z][A-Za-z]*$' line=1 column=12
warning file=/usr/share/tomcat8/.jenkins/jobs/SANSA-Stack/branches/feature-sans.sb0bt7.eline-design/workspace/sansa-rdf/sansa-rdf-common/src/main/scala/net/sansa_stack/rdf/common/partition/layout/TripleLayoutStringDate.scala message=If block needs braces line=30 column=12
warning file=/usr/share/tomcat8/.jenkins/jobs/SANSA-Stack/branches/feature-sans.sb0bt7.eline-design/workspace/sansa-rdf/sansa-rdf-common/src/main/scala/net/sansa_stack/rdf/common/partition/layout/TripleLayoutStringDate.scala message=Field name does not match the regular expression '^[A-Z][A-Za-z]*$' line=25 column=14
warning file=/usr/share/tomcat8/.jenkins/jobs/SANSA-Stack/branches/feature-sans.sb0bt7.eline-design/workspace/sansa-rdf/sansa-rdf-common/src/main/scala/net/sansa_stack/rdf/common/partition/layout/TripleLayoutString.scala message=Header does not match expected text line=1
warning file=/usr/share/tomcat8/.jenkins/jobs/SANSA-Stack/branches/feature-sans.sb0bt7.eline-design/workspace/sansa-rdf/sansa-rdf-common/src/main/scala/net/sansa_stack/rdf/common/partition/layout/TripleLayoutString.scala message=Package name does not match the regular expression '^[a-z][A-Za-z]*$' line=1 column=12
warning file=/usr/share/tomcat8/.jenkins/jobs/SANSA-Stack/branches/feature-sans.sb0bt7.eline-design/workspace/sansa-rdf/sansa-rdf-common/src/main/scala/net/sansa_stack/rdf/common/partition/layout/TripleLayoutStringDatatype.scala message=Header does not match expected text line=1
warning file=/usr/share/tomcat8/.jenkins/jobs/SANSA-Stack/branches/feature-sans.sb0bt7.eline-design/workspace/sansa-rdf/sansa-rdf-common/src/main/scala/net/sansa_stack/rdf/common/partition/layout/TripleLayoutStringDatatype.scala message=Package name does not match the regular expression '^[a-z][A-Za-z]*$' line=1 column=12
warning file=/usr/share/tomcat8/.jenkins/jobs/SANSA-Stack/branches/feature-sans.sb0bt7.eline-design/workspace/sansa-rdf/sansa-rdf-common/src/main/scala/net/sansa_stack/rdf/common/partition/layout/TripleLayoutDouble.scala message=Header does not match expected text line=1
warning file=/usr/share/tomcat8/.jenkins/jobs/SANSA-Stack/branches/feature-sans.sb0bt7.eline-design/workspace/sansa-rdf/sansa-rdf-common/src/main/scala/net/sansa_stack/rdf/common/partition/layout/TripleLayoutDouble.scala message=Package name does not match the regular expression '^[a-z][A-Za-z]*$' line=1 column=12
warning file=/usr/share/tomcat8/.jenkins/jobs/SANSA-Stack/branches/feature-sans.sb0bt7.eline-design/workspace/sansa-rdf/sansa-rdf-common/src/main/scala/net/sansa_stack/rdf/common/partition/layout/TripleLayoutDouble.scala message=If block needs braces line=17 column=12
warning file=/usr/share/tomcat8/.jenkins/jobs/SANSA-Stack/branches/feature-sans.sb0bt7.eline-design/workspace/sansa-rdf/sansa-rdf-common/src/main/scala/net/sansa_stack/rdf/common/partition/layout/TripleLayoutLong.scala message=Header does not match expected text line=1
warning file=/usr/share/tomcat8/.jenkins/jobs/SANSA-Stack/branches/feature-sans.sb0bt7.eline-design/workspace/sansa-rdf/sansa-rdf-common/src/main/scala/net/sansa_stack/rdf/common/partition/layout/TripleLayoutLong.scala message=Package name does not match the regular expression '^[a-z][A-Za-z]*$' line=1 column=12
warning file=/usr/share/tomcat8/.jenkins/jobs/SANSA-Stack/branches/feature-sans.sb0bt7.eline-design/workspace/sansa-rdf/sansa-rdf-common/src/main/scala/net/sansa_stack/rdf/common/partition/layout/TripleLayoutLong.scala message=If block needs braces line=17 column=12
warning file=/usr/share/tomcat8/.jenkins/jobs/SANSA-Stack/branches/feature-sans.sb0bt7.eline-design/workspace/sansa-rdf/sansa-rdf-common/src/main/scala/net/sansa_stack/rdf/common/partition/layout/TripleLayout.scala message=Header does not match expected text line=1
warning file=/usr/share/tomcat8/.jenkins/jobs/SANSA-Stack/branches/feature-sans.sb0bt7.eline-design/workspace/sansa-rdf/sansa-rdf-common/src/main/scala/net/sansa_stack/rdf/common/partition/layout/TripleLayout.scala message=Package name does not match the regular expression '^[a-z][A-Za-z]*$' line=1 column=12
warning file=/usr/share/tomcat8/.jenkins/jobs/SANSA-Stack/branches/feature-sans.sb0bt7.eline-design/workspace/sansa-rdf/sansa-rdf-common/src/main/scala/net/sansa_stack/rdf/common/partition/layout/TripleLayoutFloat.scala message=Header does not match expected text line=1
warning file=/usr/share/tomcat8/.jenkins/jobs/SANSA-Stack/branches/feature-sans.sb0bt7.eline-design/workspace/sansa-rdf/sansa-rdf-common/src/main/scala/net/sansa_stack/rdf/common/partition/layout/TripleLayoutFloat.scala message=Package name does not match the regular expression '^[a-z][A-Za-z]*$' line=1 column=12
warning file=/usr/share/tomcat8/.jenkins/jobs/SANSA-Stack/branches/feature-sans.sb0bt7.eline-design/workspace/sansa-rdf/sansa-rdf-common/src/main/scala/net/sansa_stack/rdf/common/partition/layout/TripleLayoutFloat.scala message=If block needs braces line=17 column=12
warning file=/usr/share/tomcat8/.jenkins/jobs/SANSA-Stack/branches/feature-sans.sb0bt7.eline-design/workspace/sansa-rdf/sansa-rdf-common/src/main/scala/net/sansa_stack/rdf/common/partition/layout/TripleLayoutStringLang.scala message=Header does not match expected text line=1
warning file=/usr/share/tomcat8/.jenkins/jobs/SANSA-Stack/branches/feature-sans.sb0bt7.eline-design/workspace/sansa-rdf/sansa-rdf-common/src/main/scala/net/sansa_stack/rdf/common/partition/layout/TripleLayoutStringLang.scala message=Package name does not match the regular expression '^[a-z][A-Za-z]*$' line=1 column=12
warning file=/usr/share/tomcat8/.jenkins/jobs/SANSA-Stack/branches/feature-sans.sb0bt7.eline-design/workspace/sansa-rdf/sansa-rdf-common/src/main/scala/net/sansa_stack/rdf/common/partition/layout/TripleLayoutDecimal.scala message=Header does not match expected text line=1
warning file=/usr/share/tomcat8/.jenkins/jobs/SANSA-Stack/branches/feature-sans.sb0bt7.eline-design/workspace/sansa-rdf/sansa-rdf-common/src/main/scala/net/sansa_stack/rdf/common/partition/layout/TripleLayoutDecimal.scala message=Package name does not match the regular expression '^[a-z][A-Za-z]*$' line=1 column=12
warning file=/usr/share/tomcat8/.jenkins/jobs/SANSA-Stack/branches/feature-sans.sb0bt7.eline-design/workspace/sansa-rdf/sansa-rdf-common/src/main/scala/net/sansa_stack/rdf/common/partition/layout/TripleLayoutDecimal.scala message=If block needs braces line=18 column=12
warning file=/usr/share/tomcat8/.jenkins/jobs/SANSA-Stack/branches/feature-sans.sb0bt7.eline-design/workspace/sansa-rdf/sansa-rdf-common/src/main/scala/net/sansa_stack/rdf/common/io/ntriples/NTriplesStringToJenaTriple.scala message=Header does not match expected text line=1
warning file=/usr/share/tomcat8/.jenkins/jobs/SANSA-Stack/branches/feature-sans.sb0bt7.eline-design/workspace/sansa-rdf/sansa-rdf-common/src/main/scala/net/sansa_stack/rdf/common/io/ntriples/NTriplesStringToJenaTriple.scala message=Package name does not match the regular expression '^[a-z][A-Za-z]*$' line=1 column=12
warning file=/usr/share/tomcat8/.jenkins/jobs/SANSA-Stack/branches/feature-sans.sb0bt7.eline-design/workspace/sansa-rdf/sansa-rdf-common/src/main/scala/net/sansa_stack/rdf/common/io/ntriples/NTriplesStringToJenaTriple.scala message=Avoid using null line=23 column=90
warning file=/usr/share/tomcat8/.jenkins/jobs/SANSA-Stack/branches/feature-sans.sb0bt7.eline-design/workspace/sansa-rdf/sansa-rdf-common/src/main/scala/net/sansa_stack/rdf/common/io/ntriples/NTriplesStringToJenaTriple.scala message=Argument should be named line=23 column=90
warning file=/usr/share/tomcat8/.jenkins/jobs/SANSA-Stack/branches/feature-sans.sb0bt7.eline-design/workspace/sansa-rdf/sansa-rdf-common/src/main/scala/net/sansa_stack/rdf/common/io/ntriples/JenaTripleToNTripleString.scala message=Header does not match expected text line=1
warning file=/usr/share/tomcat8/.jenkins/jobs/SANSA-Stack/branches/feature-sans.sb0bt7.eline-design/workspace/sansa-rdf/sansa-rdf-common/src/main/scala/net/sansa_stack/rdf/common/io/ntriples/JenaTripleToNTripleString.scala message=Package name does not match the regular expression '^[a-z][A-Za-z]*$' line=1 column=12
warning file=/usr/share/tomcat8/.jenkins/jobs/SANSA-Stack/branches/feature-sans.sb0bt7.eline-design/workspace/sansa-rdf/sansa-rdf-common/src/main/scala/net/sansa_stack/rdf/common/io/hadoop/RiotFileInputFormat.scala message=Header does not match expected text line=1
warning file=/usr/share/tomcat8/.jenkins/jobs/SANSA-Stack/branches/feature-sans.sb0bt7.eline-design/workspace/sansa-rdf/sansa-rdf-common/src/main/scala/net/sansa_stack/rdf/common/io/hadoop/RiotFileInputFormat.scala message=Package name does not match the regular expression '^[a-z][A-Za-z]*$' line=1 column=12
warning file=/usr/share/tomcat8/.jenkins/jobs/SANSA-Stack/branches/feature-sans.sb0bt7.eline-design/workspace/sansa-rdf/sansa-rdf-common/src/main/scala/net/sansa_stack/rdf/common/io/hadoop/RiotFileInputFormat.scala message=Avoid using null line=58 column=35
warning file=/usr/share/tomcat8/.jenkins/jobs/SANSA-Stack/branches/feature-sans.sb0bt7.eline-design/workspace/sansa-rdf/sansa-rdf-common/src/main/scala/net/sansa_stack/rdf/common/io/hadoop/RiotFileInputFormat.scala message=Avoid using null line=59 column=34
warning file=/usr/share/tomcat8/.jenkins/jobs/SANSA-Stack/branches/feature-sans.sb0bt7.eline-design/workspace/sansa-rdf/sansa-rdf-common/src/main/scala/net/sansa_stack/rdf/common/io/hadoop/RiotFileInputFormat.scala message=Avoid using null line=60 column=37
warning file=/usr/share/tomcat8/.jenkins/jobs/SANSA-Stack/branches/feature-sans.sb0bt7.eline-design/workspace/sansa-rdf/sansa-rdf-common/src/main/scala/net/sansa_stack/rdf/common/io/hadoop/RiotFileInputFormat.scala message=Avoid using null line=62 column=68
warning file=/usr/share/tomcat8/.jenkins/jobs/SANSA-Stack/branches/feature-sans.sb0bt7.eline-design/workspace/sansa-rdf/sansa-rdf-common/src/main/scala/net/sansa_stack/rdf/common/io/hadoop/RiotFileInputFormat.scala message=Avoid using null line=88 column=15
warning file=/usr/share/tomcat8/.jenkins/jobs/SANSA-Stack/branches/feature-sans.sb0bt7.eline-design/workspace/sansa-rdf/sansa-rdf-common/src/main/scala/net/sansa_stack/rdf/common/io/hadoop/RiotFileInputFormat.scala message=Avoid using null line=92 column=21
warning file=/usr/share/tomcat8/.jenkins/jobs/SANSA-Stack/branches/feature-sans.sb0bt7.eline-design/workspace/sansa-rdf/sansa-rdf-common/src/main/scala/net/sansa_stack/rdf/common/io/hadoop/RiotFileInputFormat.scala message=Avoid using null line=108 column=34
warning file=/usr/share/tomcat8/.jenkins/jobs/SANSA-Stack/branches/feature-sans.sb0bt7.eline-design/workspace/sansa-rdf/sansa-rdf-common/src/main/scala/net/sansa_stack/rdf/common/io/hadoop/RiotFileInputFormat.scala message=Avoid using null line=112 column=35
warning file=/usr/share/tomcat8/.jenkins/jobs/SANSA-Stack/branches/feature-sans.sb0bt7.eline-design/workspace/sansa-rdf/sansa-rdf-common/src/main/scala/net/sansa_stack/rdf/common/io/hadoop/RiotFileInputFormat.scala message=Avoid using null line=113 column=36
warning file=/usr/share/tomcat8/.jenkins/jobs/SANSA-Stack/branches/feature-sans.sb0bt7.eline-design/workspace/sansa-rdf/sansa-rdf-common/src/main/scala/net/sansa_stack/rdf/common/io/hadoop/RiotFileInputFormat.scala message=Avoid using null line=208 column=32
warning file=/usr/share/tomcat8/.jenkins/jobs/SANSA-Stack/branches/feature-sans.sb0bt7.eline-design/workspace/sansa-rdf/sansa-rdf-common/src/main/scala/net/sansa_stack/rdf/common/io/hadoop/RiotFileInputFormat.scala message=Avoid using null line=214 column=24
warning file=/usr/share/tomcat8/.jenkins/jobs/SANSA-Stack/branches/feature-sans.sb0bt7.eline-design/workspace/sansa-rdf/sansa-rdf-common/src/main/scala/net/sansa_stack/rdf/common/io/hadoop/RiotFileInputFormat.scala message=Regular expression matched 'println' line=151 column=20
warning file=/usr/share/tomcat8/.jenkins/jobs/SANSA-Stack/branches/feature-sans.sb0bt7.eline-design/workspace/sansa-rdf/sansa-rdf-common/src/main/scala/net/sansa_stack/rdf/common/io/hadoop/RiotFileInputFormat.scala message=If block needs braces line=67 column=6
warning file=/usr/share/tomcat8/.jenkins/jobs/SANSA-Stack/branches/feature-sans.sb0bt7.eline-design/workspace/sansa-rdf/sansa-rdf-common/src/main/scala/net/sansa_stack/rdf/common/io/hadoop/RiotFileInputFormat.scala message=If block needs braces line=208 column=8
warning file=/usr/share/tomcat8/.jenkins/jobs/SANSA-Stack/branches/feature-sans.sb0bt7.eline-design/workspace/sansa-rdf/sansa-rdf-common/src/main/scala/net/sansa_stack/rdf/common/io/hadoop/RiotFileInputFormat.scala message=If block needs braces line=309 column=14
warning file=/usr/share/tomcat8/.jenkins/jobs/SANSA-Stack/branches/feature-sans.sb0bt7.eline-design/workspace/sansa-rdf/sansa-rdf-common/src/main/scala/net/sansa_stack/rdf/common/io/hadoop/RiotFileInputFormat.scala message=Use braces in for comprehensions line=231 column=14
warning file=/usr/share/tomcat8/.jenkins/jobs/SANSA-Stack/branches/feature-sans.sb0bt7.eline-design/workspace/sansa-rdf/sansa-rdf-common/src/main/scala/net/sansa_stack/rdf/common/io/hadoop/RiotFileInputFormat.scala message=Field name does not match the regular expression '^[a-z][A-Za-z]*$' line=96 column=16
warning file=/usr/share/tomcat8/.jenkins/jobs/SANSA-Stack/branches/feature-sans.sb0bt7.eline-design/workspace/sansa-rdf/sansa-rdf-common/src/main/scala/net/sansa_stack/rdf/common/io/hadoop/RiotFileInputFormat.scala message=Field name does not match the regular expression '^[a-z][A-Za-z]*$' line=97 column=16
warning file=/usr/share/tomcat8/.jenkins/jobs/SANSA-Stack/branches/feature-sans.sb0bt7.eline-design/workspace/sansa-rdf/sansa-rdf-common/src/main/scala/net/sansa_stack/rdf/common/io/hadoop/RiotFileInputFormat.scala message=Field name does not match the regular expression '^[a-z][A-Za-z]*$' line=99 column=8
warning file=/usr/share/tomcat8/.jenkins/jobs/SANSA-Stack/branches/feature-sans.sb0bt7.eline-design/workspace/sansa-rdf/sansa-rdf-common/src/main/scala/net/sansa_stack/rdf/common/io/hadoop/RiotFileInputFormat.scala message=Field name does not match the regular expression '^[a-z][A-Za-z]*$' line=100 column=8
warning file=/usr/share/tomcat8/.jenkins/jobs/SANSA-Stack/branches/feature-sans.sb0bt7.eline-design/workspace/sansa-rdf/sansa-rdf-common/src/main/scala/net/sansa_stack/rdf/common/io/hadoop/RiotFileInputFormat.scala message=Argument should be named line=106 column=100
warning file=/usr/share/tomcat8/.jenkins/jobs/SANSA-Stack/branches/feature-sans.sb0bt7.eline-design/workspace/sansa-rdf/sansa-rdf-common/src/main/scala/net/sansa_stack/rdf/common/io/hadoop/RiotFileInputFormat.scala message=Argument should be named line=107 column=90
warning file=/usr/share/tomcat8/.jenkins/jobs/SANSA-Stack/branches/feature-sans.sb0bt7.eline-design/workspace/sansa-rdf/sansa-rdf-common/src/main/scala/net/sansa_stack/rdf/common/io/hadoop/RiotFileInputFormat.scala message=Argument should be named line=238 column=32
warning file=/usr/share/tomcat8/.jenkins/jobs/SANSA-Stack/branches/feature-sans.sb0bt7.eline-design/workspace/sansa-rdf/sansa-rdf-common/src/main/scala/net/sansa_stack/rdf/common/io/hadoop/TrigRecordReader.scala message=Header does not match expected text line=1
warning file=/usr/share/tomcat8/.jenkins/jobs/SANSA-Stack/branches/feature-sans.sb0bt7.eline-design/workspace/sansa-rdf/sansa-rdf-common/src/main/scala/net/sansa_stack/rdf/common/io/hadoop/TrigRecordReader.scala message=File line length exceeds 160 characters line=49
warning file=/usr/share/tomcat8/.jenkins/jobs/SANSA-Stack/branches/feature-sans.sb0bt7.eline-design/workspace/sansa-rdf/sansa-rdf-common/src/main/scala/net/sansa_stack/rdf/common/io/hadoop/TrigRecordReader.scala message=File line length exceeds 160 characters line=444
warning file=/usr/share/tomcat8/.jenkins/jobs/SANSA-Stack/branches/feature-sans.sb0bt7.eline-design/workspace/sansa-rdf/sansa-rdf-common/src/main/scala/net/sansa_stack/rdf/common/io/hadoop/TrigRecordReader.scala message=File line length exceeds 160 characters line=468
warning file=/usr/share/tomcat8/.jenkins/jobs/SANSA-Stack/branches/feature-sans.sb0bt7.eline-design/workspace/sansa-rdf/sansa-rdf-common/src/main/scala/net/sansa_stack/rdf/common/io/hadoop/TrigRecordReader.scala message=File line length exceeds 160 characters line=478
warning file=/usr/share/tomcat8/.jenkins/jobs/SANSA-Stack/branches/feature-sans.sb0bt7.eline-design/workspace/sansa-rdf/sansa-rdf-common/src/main/scala/net/sansa_stack/rdf/common/io/hadoop/TrigRecordReader.scala message=Package name does not match the regular expression '^[a-z][A-Za-z]*$' line=1 column=12
warning file=/usr/share/tomcat8/.jenkins/jobs/SANSA-Stack/branches/feature-sans.sb0bt7.eline-design/workspace/sansa-rdf/sansa-rdf-common/src/main/scala/net/sansa_stack/rdf/common/io/hadoop/TrigRecordReader.scala message=Magic Number line=81 column=69
warning file=/usr/share/tomcat8/.jenkins/jobs/SANSA-Stack/branches/feature-sans.sb0bt7.eline-design/workspace/sansa-rdf/sansa-rdf-common/src/main/scala/net/sansa_stack/rdf/common/io/hadoop/TrigRecordReader.scala message=Magic Number line=82 column=71
warning file=/usr/share/tomcat8/.jenkins/jobs/SANSA-Stack/branches/feature-sans.sb0bt7.eline-design/workspace/sansa-rdf/sansa-rdf-common/src/main/scala/net/sansa_stack/rdf/common/io/hadoop/TrigRecordReader.scala message=Magic Number line=483 column=12
warning file=/usr/share/tomcat8/.jenkins/jobs/SANSA-Stack/branches/feature-sans.sb0bt7.eline-design/workspace/sansa-rdf/sansa-rdf-common/src/main/scala/net/sansa_stack/rdf/common/io/hadoop/TrigRecordReader.scala message=Avoid using return line=530 column=8
warning file=/usr/share/tomcat8/.jenkins/jobs/SANSA-Stack/branches/feature-sans.sb0bt7.eline-design/workspace/sansa-rdf/sansa-rdf-common/src/main/scala/net/sansa_stack/rdf/common/io/hadoop/TrigRecordReader.scala message=Avoid using null line=86 column=67
warning file=/usr/share/tomcat8/.jenkins/jobs/SANSA-Stack/branches/feature-sans.sb0bt7.eline-design/workspace/sansa-rdf/sansa-rdf-common/src/main/scala/net/sansa_stack/rdf/common/io/hadoop/TrigRecordReader.scala message=Avoid using null line=117 column=8
warning file=/usr/share/tomcat8/.jenkins/jobs/SANSA-Stack/branches/feature-sans.sb0bt7.eline-design/workspace/sansa-rdf/sansa-rdf-common/src/main/scala/net/sansa_stack/rdf/common/io/hadoop/TrigRecordReader.scala message=Avoid using null line=144 column=31
warning file=/usr/share/tomcat8/.jenkins/jobs/SANSA-Stack/branches/feature-sans.sb0bt7.eline-design/workspace/sansa-rdf/sansa-rdf-common/src/main/scala/net/sansa_stack/rdf/common/io/hadoop/TrigRecordReader.scala message=Avoid using null line=146 column=8
warning file=/usr/share/tomcat8/.jenkins/jobs/SANSA-Stack/branches/feature-sans.sb0bt7.eline-design/workspace/sansa-rdf/sansa-rdf-common/src/main/scala/net/sansa_stack/rdf/common/io/hadoop/TrigRecordReader.scala message=Avoid using null line=290 column=67
warning file=/usr/share/tomcat8/.jenkins/jobs/SANSA-Stack/branches/feature-sans.sb0bt7.eline-design/workspace/sansa-rdf/sansa-rdf-common/src/main/scala/net/sansa_stack/rdf/common/io/hadoop/TrigRecordReader.scala message=Avoid using null line=416 column=36
warning file=/usr/share/tomcat8/.jenkins/jobs/SANSA-Stack/branches/feature-sans.sb0bt7.eline-design/workspace/sansa-rdf/sansa-rdf-common/src/main/scala/net/sansa_stack/rdf/common/io/hadoop/TrigRecordReader.scala message=Avoid using null line=420 column=20
warning file=/usr/share/tomcat8/.jenkins/jobs/SANSA-Stack/branches/feature-sans.sb0bt7.eline-design/workspace/sansa-rdf/sansa-rdf-common/src/main/scala/net/sansa_stack/rdf/common/io/hadoop/TrigRecordReader.scala message=Avoid using null line=557 column=71
warning file=/usr/share/tomcat8/.jenkins/jobs/SANSA-Stack/branches/feature-sans.sb0bt7.eline-design/workspace/sansa-rdf/sansa-rdf-common/src/main/scala/net/sansa_stack/rdf/common/io/hadoop/TrigRecordReader.scala message=Regular expression matched 'println' line=77 column=7
warning file=/usr/share/tomcat8/.jenkins/jobs/SANSA-Stack/branches/feature-sans.sb0bt7.eline-design/workspace/sansa-rdf/sansa-rdf-common/src/main/scala/net/sansa_stack/rdf/common/io/hadoop/TrigRecordReader.scala message=Regular expression matched 'println' line=134 column=7
warning file=/usr/share/tomcat8/.jenkins/jobs/SANSA-Stack/branches/feature-sans.sb0bt7.eline-design/workspace/sansa-rdf/sansa-rdf-common/src/main/scala/net/sansa_stack/rdf/common/io/hadoop/TrigRecordReader.scala message=Regular expression matched 'println' line=163 column=13
warning file=/usr/share/tomcat8/.jenkins/jobs/SANSA-Stack/branches/feature-sans.sb0bt7.eline-design/workspace/sansa-rdf/sansa-rdf-common/src/main/scala/net/sansa_stack/rdf/common/io/hadoop/TrigRecordReader.scala message=Regular expression matched 'println' line=274 column=18
warning file=/usr/share/tomcat8/.jenkins/jobs/SANSA-Stack/branches/feature-sans.sb0bt7.eline-design/workspace/sansa-rdf/sansa-rdf-common/src/main/scala/net/sansa_stack/rdf/common/io/hadoop/TrigRecordReader.scala message=Regular expression matched 'println' line=296 column=22
warning file=/usr/share/tomcat8/.jenkins/jobs/SANSA-Stack/branches/feature-sans.sb0bt7.eline-design/workspace/sansa-rdf/sansa-rdf-common/src/main/scala/net/sansa_stack/rdf/common/io/hadoop/TrigRecordReader.scala message=Regular expression matched 'println' line=327 column=7
warning file=/usr/share/tomcat8/.jenkins/jobs/SANSA-Stack/branches/feature-sans.sb0bt7.eline-design/workspace/sansa-rdf/sansa-rdf-common/src/main/scala/net/sansa_stack/rdf/common/io/hadoop/TrigRecordReader.scala message=Regular expression matched 'println' line=339 column=7
warning file=/usr/share/tomcat8/.jenkins/jobs/SANSA-Stack/branches/feature-sans.sb0bt7.eline-design/workspace/sansa-rdf/sansa-rdf-common/src/main/scala/net/sansa_stack/rdf/common/io/hadoop/TrigRecordReader.scala message=Regular expression matched 'println' line=356 column=13
warning file=/usr/share/tomcat8/.jenkins/jobs/SANSA-Stack/branches/feature-sans.sb0bt7.eline-design/workspace/sansa-rdf/sansa-rdf-common/src/main/scala/net/sansa_stack/rdf/common/io/hadoop/TrigRecordReader.scala message=Regular expression matched 'println' line=357 column=13
warning file=/usr/share/tomcat8/.jenkins/jobs/SANSA-Stack/branches/feature-sans.sb0bt7.eline-design/workspace/sansa-rdf/sansa-rdf-common/src/main/scala/net/sansa_stack/rdf/common/io/hadoop/TrigRecordReader.scala message=Regular expression matched 'println' line=370 column=13
warning file=/usr/share/tomcat8/.jenkins/jobs/SANSA-Stack/branches/feature-sans.sb0bt7.eline-design/workspace/sansa-rdf/sansa-rdf-common/src/main/scala/net/sansa_stack/rdf/common/io/hadoop/TrigRecordReader.scala message=Regular expression matched 'println' line=376 column=15
warning file=/usr/share/tomcat8/.jenkins/jobs/SANSA-Stack/branches/feature-sans.sb0bt7.eline-design/workspace/sansa-rdf/sansa-rdf-common/src/main/scala/net/sansa_stack/rdf/common/io/hadoop/TrigRecordReader.scala message=Regular expression matched 'println' line=401 column=7
warning file=/usr/share/tomcat8/.jenkins/jobs/SANSA-Stack/branches/feature-sans.sb0bt7.eline-design/workspace/sansa-rdf/sansa-rdf-common/src/main/scala/net/sansa_stack/rdf/common/io/hadoop/TrigRecordReader.scala message=Regular expression matched 'println' line=402 column=7
warning file=/usr/share/tomcat8/.jenkins/jobs/SANSA-Stack/branches/feature-sans.sb0bt7.eline-design/workspace/sansa-rdf/sansa-rdf-common/src/main/scala/net/sansa_stack/rdf/common/io/hadoop/TrigRecordReader.scala message=Regular expression matched 'println' line=437 column=15
warning file=/usr/share/tomcat8/.jenkins/jobs/SANSA-Stack/branches/feature-sans.sb0bt7.eline-design/workspace/sansa-rdf/sansa-rdf-common/src/main/scala/net/sansa_stack/rdf/common/io/hadoop/TrigRecordReader.scala message=Regular expression matched 'println' line=449 column=18
warning file=/usr/share/tomcat8/.jenkins/jobs/SANSA-Stack/branches/feature-sans.sb0bt7.eline-design/workspace/sansa-rdf/sansa-rdf-common/src/main/scala/net/sansa_stack/rdf/common/io/hadoop/TrigRecordReader.scala message=Regular expression matched 'println' line=527 column=20
warning file=/usr/share/tomcat8/.jenkins/jobs/SANSA-Stack/branches/feature-sans.sb0bt7.eline-design/workspace/sansa-rdf/sansa-rdf-common/src/main/scala/net/sansa_stack/rdf/common/io/hadoop/TrigRecordReader.scala message=Regular expression matched 'println' line=544 column=20
warning file=/usr/share/tomcat8/.jenkins/jobs/SANSA-Stack/branches/feature-sans.sb0bt7.eline-design/workspace/sansa-rdf/sansa-rdf-common/src/main/scala/net/sansa_stack/rdf/common/io/hadoop/TrigRecordReader.scala message=Regular expression matched 'println' line=549 column=20
warning file=/usr/share/tomcat8/.jenkins/jobs/SANSA-Stack/branches/feature-sans.sb0bt7.eline-design/workspace/sansa-rdf/sansa-rdf-common/src/main/scala/net/sansa_stack/rdf/common/io/hadoop/TrigRecordReader.scala message=Regular expression matched 'println' line=551 column=20
warning file=/usr/share/tomcat8/.jenkins/jobs/SANSA-Stack/branches/feature-sans.sb0bt7.eline-design/workspace/sansa-rdf/sansa-rdf-common/src/main/scala/net/sansa_stack/rdf/common/io/hadoop/TrigRecordReader.scala message=Regular expression matched 'println' line=569 column=18
warning file=/usr/share/tomcat8/.jenkins/jobs/SANSA-Stack/branches/feature-sans.sb0bt7.eline-design/workspace/sansa-rdf/sansa-rdf-common/src/main/scala/net/sansa_stack/rdf/common/io/hadoop/TrigRecordReader.scala message=Method is longer than 50 lines line=272 column=6
warning file=/usr/share/tomcat8/.jenkins/jobs/SANSA-Stack/branches/feature-sans.sb0bt7.eline-design/workspace/sansa-rdf/sansa-rdf-common/src/main/scala/net/sansa_stack/rdf/common/io/hadoop/TrigRecordReader.scala message=Field name does not match the regular expression '^[A-Z][A-Za-z]*$' line=38 column=6
warning file=/usr/share/tomcat8/.jenkins/jobs/SANSA-Stack/branches/feature-sans.sb0bt7.eline-design/workspace/sansa-rdf/sansa-rdf-common/src/main/scala/net/sansa_stack/rdf/common/io/hadoop/TrigRecordReader.scala message=Field name does not match the regular expression '^[A-Z][A-Za-z]*$' line=39 column=6
warning file=/usr/share/tomcat8/.jenkins/jobs/SANSA-Stack/branches/feature-sans.sb0bt7.eline-design/workspace/sansa-rdf/sansa-rdf-common/src/main/scala/net/sansa_stack/rdf/common/io/hadoop/TrigRecordReader.scala message=Field name does not match the regular expression '^[A-Z][A-Za-z]*$' line=40 column=6
warning file=/usr/share/tomcat8/.jenkins/jobs/SANSA-Stack/branches/feature-sans.sb0bt7.eline-design/workspace/sansa-rdf/sansa-rdf-common/src/main/scala/net/sansa_stack/rdf/common/io/hadoop/TrigRecordReader.scala message=Field name does not match the regular expression '^[a-z][A-Za-z]*$' line=56 column=14
warning file=/usr/share/tomcat8/.jenkins/jobs/SANSA-Stack/branches/feature-sans.sb0bt7.eline-design/workspace/sansa-rdf/sansa-rdf-common/src/main/scala/net/sansa_stack/rdf/common/io/hadoop/TrigRecordReader.scala message=Use of TODO/FIXME comment line=202 column=4
warning file=/usr/share/tomcat8/.jenkins/jobs/SANSA-Stack/branches/feature-sans.sb0bt7.eline-design/workspace/sansa-rdf/sansa-rdf-common/src/main/scala/net/sansa_stack/rdf/common/io/hadoop/TrigRecordReader.scala message=Use of TODO/FIXME comment line=285 column=6
warning file=/usr/share/tomcat8/.jenkins/jobs/SANSA-Stack/branches/feature-sans.sb0bt7.eline-design/workspace/sansa-rdf/sansa-rdf-common/src/main/scala/net/sansa_stack/rdf/common/io/hadoop/TrigRecordReader.scala message=Argument should be named line=81 column=69
warning file=/usr/share/tomcat8/.jenkins/jobs/SANSA-Stack/branches/feature-sans.sb0bt7.eline-design/workspace/sansa-rdf/sansa-rdf-common/src/main/scala/net/sansa_stack/rdf/common/io/hadoop/TrigRecordReader.scala message=Argument should be named line=82 column=71
warning file=/usr/share/tomcat8/.jenkins/jobs/SANSA-Stack/branches/feature-sans.sb0bt7.eline-design/workspace/sansa-rdf/sansa-rdf-common/src/main/scala/net/sansa_stack/rdf/common/io/hadoop/TrigRecordReader.scala message=Argument should be named line=86 column=67
warning file=/usr/share/tomcat8/.jenkins/jobs/SANSA-Stack/branches/feature-sans.sb0bt7.eline-design/workspace/sansa-rdf/sansa-rdf-common/src/main/scala/net/sansa_stack/rdf/common/io/hadoop/TrigRecordReader.scala message=Argument should be named line=213 column=35
warning file=/usr/share/tomcat8/.jenkins/jobs/SANSA-Stack/branches/feature-sans.sb0bt7.eline-design/workspace/sansa-rdf/sansa-rdf-common/src/main/scala/net/sansa_stack/rdf/common/io/hadoop/TrigRecordReader.scala message=Argument should be named line=221 column=37
warning file=/usr/share/tomcat8/.jenkins/jobs/SANSA-Stack/branches/feature-sans.sb0bt7.eline-design/workspace/sansa-rdf/sansa-rdf-common/src/main/scala/net/sansa_stack/rdf/common/io/hadoop/TrigRecordReader.scala message=Argument should be named line=234 column=32
warning file=/usr/share/tomcat8/.jenkins/jobs/SANSA-Stack/branches/feature-sans.sb0bt7.eline-design/workspace/sansa-rdf/sansa-rdf-common/src/main/scala/net/sansa_stack/rdf/common/io/hadoop/TrigRecordReader.scala message=Argument should be named line=290 column=67
warning file=/usr/share/tomcat8/.jenkins/jobs/SANSA-Stack/branches/feature-sans.sb0bt7.eline-design/workspace/sansa-rdf/sansa-rdf-common/src/main/scala/net/sansa_stack/rdf/common/io/hadoop/TrigRecordReader.scala message=Argument should be named line=329 column=60
warning file=/usr/share/tomcat8/.jenkins/jobs/SANSA-Stack/branches/feature-sans.sb0bt7.eline-design/workspace/sansa-rdf/sansa-rdf-common/src/main/scala/net/sansa_stack/rdf/common/io/hadoop/TrigRecordReader.scala message=Argument should be named line=336 column=60
warning file=/usr/share/tomcat8/.jenkins/jobs/SANSA-Stack/branches/feature-sans.sb0bt7.eline-design/workspace/sansa-rdf/sansa-rdf-common/src/main/scala/net/sansa_stack/rdf/common/io/hadoop/TrigRecordReader.scala message=Argument should be named line=368 column=39
warning file=/usr/share/tomcat8/.jenkins/jobs/SANSA-Stack/branches/feature-sans.sb0bt7.eline-design/workspace/sansa-rdf/sansa-rdf-common/src/main/scala/net/sansa_stack/rdf/common/io/hadoop/TrigRecordReader.scala message=Argument should be named line=373 column=33
warning file=/usr/share/tomcat8/.jenkins/jobs/SANSA-Stack/branches/feature-sans.sb0bt7.eline-design/workspace/sansa-rdf/sansa-rdf-common/src/main/scala/net/sansa_stack/rdf/common/io/hadoop/TrigRecordReader.scala message=Argument should be named line=390 column=42
warning file=/usr/share/tomcat8/.jenkins/jobs/SANSA-Stack/branches/feature-sans.sb0bt7.eline-design/workspace/sansa-rdf/sansa-rdf-common/src/main/scala/net/sansa_stack/rdf/common/io/hadoop/TrigRecordReader.scala message=Argument should be named line=390 column=45
warning file=/usr/share/tomcat8/.jenkins/jobs/SANSA-Stack/branches/feature-sans.sb0bt7.eline-design/workspace/sansa-rdf/sansa-rdf-common/src/main/scala/net/sansa_stack/rdf/common/io/hadoop/TrigRecordReader.scala message=Argument should be named line=398 column=51
warning file=/usr/share/tomcat8/.jenkins/jobs/SANSA-Stack/branches/feature-sans.sb0bt7.eline-design/workspace/sansa-rdf/sansa-rdf-common/src/main/scala/net/sansa_stack/rdf/common/io/hadoop/TrigRecordReader.scala message=Argument should be named line=398 column=54
warning file=/usr/share/tomcat8/.jenkins/jobs/SANSA-Stack/branches/feature-sans.sb0bt7.eline-design/workspace/sansa-rdf/sansa-rdf-common/src/main/scala/net/sansa_stack/rdf/common/io/hadoop/TrigRecordReader.scala message=Argument should be named line=420 column=20
warning file=/usr/share/tomcat8/.jenkins/jobs/SANSA-Stack/branches/feature-sans.sb0bt7.eline-design/workspace/sansa-rdf/sansa-rdf-common/src/main/scala/net/sansa_stack/rdf/common/io/hadoop/TrigRecordReader.scala message=Argument should be named line=459 column=22
warning file=/usr/share/tomcat8/.jenkins/jobs/SANSA-Stack/branches/feature-sans.sb0bt7.eline-design/workspace/sansa-rdf/sansa-rdf-common/src/main/scala/net/sansa_stack/rdf/common/io/hadoop/TrigRecordReader.scala message=Argument should be named line=461 column=75
warning file=/usr/share/tomcat8/.jenkins/jobs/SANSA-Stack/branches/feature-sans.sb0bt7.eline-design/workspace/sansa-rdf/sansa-rdf-common/src/main/scala/net/sansa_stack/rdf/common/io/hadoop/TrigFileInputFormat.scala message=Header does not match expected text line=1
warning file=/usr/share/tomcat8/.jenkins/jobs/SANSA-Stack/branches/feature-sans.sb0bt7.eline-design/workspace/sansa-rdf/sansa-rdf-common/src/main/scala/net/sansa_stack/rdf/common/io/hadoop/TrigFileInputFormat.scala message=Package name does not match the regular expression '^[a-z][A-Za-z]*$' line=1 column=12
warning file=/usr/share/tomcat8/.jenkins/jobs/SANSA-Stack/branches/feature-sans.sb0bt7.eline-design/workspace/sansa-rdf/sansa-rdf-common/src/main/scala/net/sansa_stack/rdf/common/io/hadoop/TrigFileInputFormat.scala message=Avoid using return line=33 column=23
warning file=/usr/share/tomcat8/.jenkins/jobs/SANSA-Stack/branches/feature-sans.sb0bt7.eline-design/workspace/sansa-rdf/sansa-rdf-common/src/main/scala/net/sansa_stack/rdf/common/io/hadoop/TrigFileInputFormat.scala message=Avoid using null line=33 column=8
warning file=/usr/share/tomcat8/.jenkins/jobs/SANSA-Stack/branches/feature-sans.sb0bt7.eline-design/workspace/sansa-rdf/sansa-rdf-common/src/main/scala/net/sansa_stack/rdf/common/io/hadoop/TrigFileInputFormat.scala message=Avoid using null line=107 column=8
warning file=/usr/share/tomcat8/.jenkins/jobs/SANSA-Stack/branches/feature-sans.sb0bt7.eline-design/workspace/sansa-rdf/sansa-rdf-common/src/main/scala/net/sansa_stack/rdf/common/io/hadoop/TrigFileInputFormat.scala message=Regular expression matched 'println' line=40 column=18
warning file=/usr/share/tomcat8/.jenkins/jobs/SANSA-Stack/branches/feature-sans.sb0bt7.eline-design/workspace/sansa-rdf/sansa-rdf-common/src/main/scala/net/sansa_stack/rdf/common/io/hadoop/TrigFileInputFormat.scala message=Field name does not match the regular expression '^[a-z][A-Za-z]*$' line=27 column=6
warning file=/usr/share/tomcat8/.jenkins/jobs/SANSA-Stack/branches/feature-sans.sb0bt7.eline-design/workspace/sansa-rdf/sansa-rdf-common/src/main/scala/net/sansa_stack/rdf/common/io/hadoop/TrigFileInputFormat.scala message=Field name does not match the regular expression '^[a-z][A-Za-z]*$' line=28 column=6
warning file=/usr/share/tomcat8/.jenkins/jobs/SANSA-Stack/branches/feature-sans.sb0bt7.eline-design/workspace/sansa-rdf/sansa-rdf-common/src/main/scala/net/sansa_stack/rdf/common/io/hadoop/TrigFileInputFormat.scala message=Field name does not match the regular expression '^[a-z][A-Za-z]*$' line=29 column=6
warning file=/usr/share/tomcat8/.jenkins/jobs/SANSA-Stack/branches/feature-sans.sb0bt7.eline-design/workspace/sansa-rdf/sansa-rdf-common/src/main/scala/net/sansa_stack/rdf/common/io/hadoop/TrigFileInputFormat.scala message=Use of TODO/FIXME comment line=23 column=51
warning file=/usr/share/tomcat8/.jenkins/jobs/SANSA-Stack/branches/feature-sans.sb0bt7.eline-design/workspace/sansa-rdf/sansa-rdf-common/src/main/scala/net/sansa_stack/rdf/common/io/hadoop/TrigFileInputFormat.scala message=Use of TODO/FIXME comment line=68 column=6
warning file=/usr/share/tomcat8/.jenkins/jobs/SANSA-Stack/branches/feature-sans.sb0bt7.eline-design/workspace/sansa-rdf/sansa-rdf-common/src/main/scala/net/sansa_stack/rdf/common/io/hadoop/TrigFileInputFormat.scala message=Argument should be named line=53 column=34
warning file=/usr/share/tomcat8/.jenkins/jobs/SANSA-Stack/branches/feature-sans.sb0bt7.eline-design/workspace/sansa-rdf/sansa-rdf-common/src/main/scala/net/sansa_stack/rdf/common/kryo/jena/JenaKryoSerializers.scala message=Header does not match expected text line=1
warning file=/usr/share/tomcat8/.jenkins/jobs/SANSA-Stack/branches/feature-sans.sb0bt7.eline-design/workspace/sansa-rdf/sansa-rdf-common/src/main/scala/net/sansa_stack/rdf/common/kryo/jena/JenaKryoSerializers.scala message=Package name does not match the regular expression '^[a-z][A-Za-z]*$' line=1 column=12
warning file=/usr/share/tomcat8/.jenkins/jobs/SANSA-Stack/branches/feature-sans.sb0bt7.eline-design/workspace/sansa-rdf/sansa-rdf-common/src/main/scala/net/sansa_stack/rdf/common/kryo/jena/JenaKryoSerializers.scala message=Avoid using null line=49 column=45
warning file=/usr/share/tomcat8/.jenkins/jobs/SANSA-Stack/branches/feature-sans.sb0bt7.eline-design/workspace/sansa-rdf/sansa-rdf-common/src/main/scala/net/sansa_stack/rdf/common/kryo/jena/JenaKryoSerializers.scala message=Avoid using null line=69 column=8
warning file=/usr/share/tomcat8/.jenkins/jobs/SANSA-Stack/branches/feature-sans.sb0bt7.eline-design/workspace/sansa-rdf/sansa-rdf-common/src/main/scala/net/sansa_stack/rdf/common/kryo/jena/JenaKryoSerializers.scala message=Avoid using null line=72 column=23
warning file=/usr/share/tomcat8/.jenkins/jobs/SANSA-Stack/branches/feature-sans.sb0bt7.eline-design/workspace/sansa-rdf/sansa-rdf-common/src/main/scala/net/sansa_stack/rdf/common/kryo/jena/JenaKryoSerializers.scala message=Regular expression matched 'println' line=53 column=8
warning file=/usr/share/tomcat8/.jenkins/jobs/SANSA-Stack/branches/feature-sans.sb0bt7.eline-design/workspace/sansa-rdf/sansa-rdf-common/src/main/scala/net/sansa_stack/rdf/common/kryo/jena/JenaKryoSerializers.scala message=Regular expression matched 'println' line=62 column=8
warning file=/usr/share/tomcat8/.jenkins/jobs/SANSA-Stack/branches/feature-sans.sb0bt7.eline-design/workspace/sansa-rdf/sansa-rdf-common/src/main/scala/net/sansa_stack/rdf/common/kryo/jena/JenaKryoSerializers.scala message=Use braces in for comprehensions line=96 column=10
warning file=/usr/share/tomcat8/.jenkins/jobs/SANSA-Stack/branches/feature-sans.sb0bt7.eline-design/workspace/sansa-rdf/sansa-rdf-common/src/main/scala/net/sansa_stack/rdf/common/kryo/jena/JenaKryoSerializers.scala message=Use of TODO/FIXME comment line=253 column=2
warning file=/usr/share/tomcat8/.jenkins/jobs/SANSA-Stack/branches/feature-sans.sb0bt7.eline-design/workspace/sansa-rdf/sansa-rdf-common/src/main/scala/net/sansa_stack/rdf/common/kryo/jena/JenaKryoSerializers.scala message=Argument should be named line=49 column=45
warning file=/usr/share/tomcat8/.jenkins/jobs/SANSA-Stack/branches/feature-sans.sb0bt7.eline-design/workspace/sansa-rdf/sansa-rdf-common/src/main/scala/net/sansa_stack/rdf/common/kryo/jena/JenaKryoSerializers.scala message=Argument should be named line=72 column=23
warning file=/usr/share/tomcat8/.jenkins/jobs/SANSA-Stack/branches/feature-sans.sb0bt7.eline-design/workspace/sansa-rdf/sansa-rdf-common/src/main/scala/net/sansa_stack/rdf/common/kryo/jena/JenaKryoSerializers.scala message=Argument should be named line=85 column=124
warning file=/usr/share/tomcat8/.jenkins/jobs/SANSA-Stack/branches/feature-sans.sb0bt7.eline-design/workspace/sansa-rdf/sansa-rdf-common/src/main/scala/net/sansa_stack/rdf/common/kryo/jena/JenaKryoSerializers.scala message=Argument should be named line=85 column=130
warning file=/usr/share/tomcat8/.jenkins/jobs/SANSA-Stack/branches/feature-sans.sb0bt7.eline-design/workspace/sansa-rdf/sansa-rdf-common/src/main/scala/net/sansa_stack/rdf/common/kryo/jena/JenaKryoSerializers.scala message=Argument should be named line=95 column=34
warning file=/usr/share/tomcat8/.jenkins/jobs/SANSA-Stack/branches/feature-sans.sb0bt7.eline-design/workspace/sansa-rdf/sansa-rdf-common/src/main/scala/net/sansa_stack/rdf/common/kryo/jena/JenaKryoSerializers.scala message=Argument should be named line=102 column=52
warning file=/usr/share/tomcat8/.jenkins/jobs/SANSA-Stack/branches/feature-sans.sb0bt7.eline-design/workspace/sansa-rdf/sansa-rdf-common/src/main/scala/net/sansa_stack/rdf/common/qualityassessment/utils/vocabularies/DQV.scala message=Header does not match expected text line=1
warning file=/usr/share/tomcat8/.jenkins/jobs/SANSA-Stack/branches/feature-sans.sb0bt7.eline-design/workspace/sansa-rdf/sansa-rdf-common/src/main/scala/net/sansa_stack/rdf/common/qualityassessment/utils/vocabularies/DQV.scala message=Package name does not match the regular expression '^[a-z][A-Za-z]*$' line=1 column=12
warning file=/usr/share/tomcat8/.jenkins/jobs/SANSA-Stack/branches/feature-sans.sb0bt7.eline-design/workspace/sansa-rdf/sansa-rdf-common/src/main/scala/net/sansa_stack/rdf/common/qualityassessment/utils/vocabularies/DQV.scala message=Field name does not match the regular expression '^[A-Z][A-Za-z]*$' line=11 column=6
warning file=/usr/share/tomcat8/.jenkins/jobs/SANSA-Stack/branches/feature-sans.sb0bt7.eline-design/workspace/sansa-rdf/sansa-rdf-common/src/main/scala/net/sansa_stack/rdf/common/qualityassessment/utils/vocabularies/DQV.scala message=Field name does not match the regular expression '^[A-Z][A-Za-z]*$' line=12 column=6
warning file=/usr/share/tomcat8/.jenkins/jobs/SANSA-Stack/branches/feature-sans.sb0bt7.eline-design/workspace/sansa-rdf/sansa-rdf-common/src/main/scala/net/sansa_stack/rdf/common/qualityassessment/utils/vocabularies/DQV.scala message=Field name does not match the regular expression '^[A-Z][A-Za-z]*$' line=13 column=6
warning file=/usr/share/tomcat8/.jenkins/jobs/SANSA-Stack/branches/feature-sans.sb0bt7.eline-design/workspace/sansa-rdf/sansa-rdf-common/src/main/scala/net/sansa_stack/rdf/common/qualityassessment/utils/vocabularies/DQV.scala message=Field name does not match the regular expression '^[A-Z][A-Za-z]*$' line=14 column=6
warning file=/usr/share/tomcat8/.jenkins/jobs/SANSA-Stack/branches/feature-sans.sb0bt7.eline-design/workspace/sansa-rdf/sansa-rdf-common/src/main/scala/net/sansa_stack/rdf/common/qualityassessment/utils/vocabularies/DQV.scala message=Field name does not match the regular expression '^[A-Z][A-Za-z]*$' line=15 column=6
warning file=/usr/share/tomcat8/.jenkins/jobs/SANSA-Stack/branches/feature-sans.sb0bt7.eline-design/workspace/sansa-rdf/sansa-rdf-common/src/main/scala/net/sansa_stack/rdf/common/qualityassessment/utils/vocabularies/DQV.scala message=Field name does not match the regular expression '^[A-Z][A-Za-z]*$' line=16 column=6
warning file=/usr/share/tomcat8/.jenkins/jobs/SANSA-Stack/branches/feature-sans.sb0bt7.eline-design/workspace/sansa-rdf/sansa-rdf-common/src/main/scala/net/sansa_stack/rdf/common/qualityassessment/utils/vocabularies/DQV.scala message=Field name does not match the regular expression '^[A-Z][A-Za-z]*$' line=17 column=6
warning file=/usr/share/tomcat8/.jenkins/jobs/SANSA-Stack/branches/feature-sans.sb0bt7.eline-design/workspace/sansa-rdf/sansa-rdf-common/src/main/scala/net/sansa_stack/rdf/common/qualityassessment/utils/vocabularies/DQV.scala message=Field name does not match the regular expression '^[A-Z][A-Za-z]*$' line=18 column=6
warning file=/usr/share/tomcat8/.jenkins/jobs/SANSA-Stack/branches/feature-sans.sb0bt7.eline-design/workspace/sansa-rdf/sansa-rdf-common/src/main/scala/net/sansa_stack/rdf/common/qualityassessment/utils/vocabularies/DQV.scala message=Field name does not match the regular expression '^[A-Z][A-Za-z]*$' line=19 column=6
warning file=/usr/share/tomcat8/.jenkins/jobs/SANSA-Stack/branches/feature-sans.sb0bt7.eline-design/workspace/sansa-rdf/sansa-rdf-common/src/main/scala/net/sansa_stack/rdf/common/qualityassessment/utils/vocabularies/DQV.scala message=Field name does not match the regular expression '^[A-Z][A-Za-z]*$' line=22 column=6
warning file=/usr/share/tomcat8/.jenkins/jobs/SANSA-Stack/branches/feature-sans.sb0bt7.eline-design/workspace/sansa-rdf/sansa-rdf-common/src/main/scala/net/sansa_stack/rdf/common/qualityassessment/utils/vocabularies/DQV.scala message=Field name does not match the regular expression '^[A-Z][A-Za-z]*$' line=23 column=6
warning file=/usr/share/tomcat8/.jenkins/jobs/SANSA-Stack/branches/feature-sans.sb0bt7.eline-design/workspace/sansa-rdf/sansa-rdf-common/src/main/scala/net/sansa_stack/rdf/common/qualityassessment/utils/vocabularies/DQV.scala message=Field name does not match the regular expression '^[A-Z][A-Za-z]*$' line=24 column=6
warning file=/usr/share/tomcat8/.jenkins/jobs/SANSA-Stack/branches/feature-sans.sb0bt7.eline-design/workspace/sansa-rdf/sansa-rdf-common/src/main/scala/net/sansa_stack/rdf/common/qualityassessment/utils/vocabularies/DQV.scala message=Field name does not match the regular expression '^[A-Z][A-Za-z]*$' line=25 column=6
warning file=/usr/share/tomcat8/.jenkins/jobs/SANSA-Stack/branches/feature-sans.sb0bt7.eline-design/workspace/sansa-rdf/sansa-rdf-common/src/main/scala/net/sansa_stack/rdf/common/qualityassessment/utils/vocabularies/DQV.scala message=Field name does not match the regular expression '^[A-Z][A-Za-z]*$' line=26 column=6
warning file=/usr/share/tomcat8/.jenkins/jobs/SANSA-Stack/branches/feature-sans.sb0bt7.eline-design/workspace/sansa-rdf/sansa-rdf-common/src/main/scala/net/sansa_stack/rdf/common/qualityassessment/utils/vocabularies/DQV.scala message=Field name does not match the regular expression '^[A-Z][A-Za-z]*$' line=27 column=6
warning file=/usr/share/tomcat8/.jenkins/jobs/SANSA-Stack/branches/feature-sans.sb0bt7.eline-design/workspace/sansa-rdf/sansa-rdf-common/src/main/scala/net/sansa_stack/rdf/common/qualityassessment/utils/vocabularies/DQV.scala message=Field name does not match the regular expression '^[A-Z][A-Za-z]*$' line=28 column=6
warning file=/usr/share/tomcat8/.jenkins/jobs/SANSA-Stack/branches/feature-sans.sb0bt7.eline-design/workspace/sansa-rdf/sansa-rdf-common/src/main/scala/net/sansa_stack/rdf/common/qualityassessment/utils/vocabularies/DQV.scala message=Field name does not match the regular expression '^[A-Z][A-Za-z]*$' line=29 column=6
warning file=/usr/share/tomcat8/.jenkins/jobs/SANSA-Stack/branches/feature-sans.sb0bt7.eline-design/workspace/sansa-rdf/sansa-rdf-common/src/main/scala/net/sansa_stack/rdf/common/qualityassessment/utils/vocabularies/DQV.scala message=Field name does not match the regular expression '^[A-Z][A-Za-z]*$' line=30 column=6
warning file=/usr/share/tomcat8/.jenkins/jobs/SANSA-Stack/branches/feature-sans.sb0bt7.eline-design/workspace/sansa-rdf/sansa-rdf-common/src/main/scala/net/sansa_stack/rdf/common/qualityassessment/utils/vocabularies/DQV.scala message=Field name does not match the regular expression '^[A-Z][A-Za-z]*$' line=31 column=6
warning file=/usr/share/tomcat8/.jenkins/jobs/SANSA-Stack/branches/feature-sans.sb0bt7.eline-design/workspace/sansa-rdf/sansa-rdf-common/src/main/scala/net/sansa_stack/rdf/common/qualityassessment/utils/vocabularies/DQV.scala message=Field name does not match the regular expression '^[A-Z][A-Za-z]*$' line=34 column=6
warning file=/usr/share/tomcat8/.jenkins/jobs/SANSA-Stack/branches/feature-sans.sb0bt7.eline-design/workspace/sansa-rdf/sansa-rdf-common/src/main/scala/net/sansa_stack/rdf/common/qualityassessment/utils/vocabularies/DQV.scala message=Field name does not match the regular expression '^[A-Z][A-Za-z]*$' line=37 column=6
warning file=/usr/share/tomcat8/.jenkins/jobs/SANSA-Stack/branches/feature-sans.sb0bt7.eline-design/workspace/sansa-rdf/sansa-rdf-common/src/main/scala/net/sansa_stack/rdf/common/qualityassessment/utils/vocabularies/DQV.scala message=Field name does not match the regular expression '^[A-Z][A-Za-z]*$' line=38 column=6
warning file=/usr/share/tomcat8/.jenkins/jobs/SANSA-Stack/branches/feature-sans.sb0bt7.eline-design/workspace/sansa-rdf/sansa-rdf-common/src/main/scala/net/sansa_stack/rdf/common/qualityassessment/utils/vocabularies/DQV.scala message=Field name does not match the regular expression '^[A-Z][A-Za-z]*$' line=40 column=6
warning file=/usr/share/tomcat8/.jenkins/jobs/SANSA-Stack/branches/feature-sans.sb0bt7.eline-design/workspace/sansa-rdf/sansa-rdf-common/src/main/scala/net/sansa_stack/rdf/common/qualityassessment/utils/DatasetUtils.scala message=Header does not match expected text line=1
warning file=/usr/share/tomcat8/.jenkins/jobs/SANSA-Stack/branches/feature-sans.sb0bt7.eline-design/workspace/sansa-rdf/sansa-rdf-common/src/main/scala/net/sansa_stack/rdf/common/qualityassessment/utils/DatasetUtils.scala message=Package name does not match the regular expression '^[a-z][A-Za-z]*$' line=1 column=12
warning file=/usr/share/tomcat8/.jenkins/jobs/SANSA-Stack/branches/feature-sans.sb0bt7.eline-design/workspace/sansa-rdf/sansa-rdf-common/src/main/scala/net/sansa_stack/rdf/common/qualityassessment/utils/DatasetUtils.scala message=Field name does not match the regular expression '^[A-Z][A-Za-z]*$' line=12 column=22
warning file=/usr/share/tomcat8/.jenkins/jobs/SANSA-Stack/branches/feature-sans.sb0bt7.eline-design/workspace/sansa-rdf/sansa-rdf-common/src/main/scala/net/sansa_stack/rdf/common/qualityassessment/utils/DatasetUtils.scala message=Field name does not match the regular expression '^[A-Z][A-Za-z]*$' line=14 column=6
warning file=/usr/share/tomcat8/.jenkins/jobs/SANSA-Stack/branches/feature-sans.sb0bt7.eline-design/workspace/sansa-rdf/sansa-rdf-common/src/main/scala/net/sansa_stack/rdf/common/qualityassessment/utils/DatasetUtils.scala message=Field name does not match the regular expression '^[A-Z][A-Za-z]*$' line=20 column=6
warning file=/usr/share/tomcat8/.jenkins/jobs/SANSA-Stack/branches/feature-sans.sb0bt7.eline-design/workspace/sansa-rdf/sansa-rdf-common/src/main/scala/net/sansa_stack/rdf/common/qualityassessment/utils/DatasetUtils.scala message=Field name does not match the regular expression '^[A-Z][A-Za-z]*$' line=26 column=6
warning file=/usr/share/tomcat8/.jenkins/jobs/SANSA-Stack/branches/feature-sans.sb0bt7.eline-design/workspace/sansa-rdf/sansa-rdf-common/src/main/scala/net/sansa_stack/rdf/common/qualityassessment/utils/DatasetUtils.scala message=Field name does not match the regular expression '^[A-Z][A-Za-z]*$' line=32 column=6
warning file=/usr/share/tomcat8/.jenkins/jobs/SANSA-Stack/branches/feature-sans.sb0bt7.eline-design/workspace/sansa-rdf/sansa-rdf-common/src/main/scala/net/sansa_stack/rdf/common/qualityassessment/utils/DatasetUtils.scala message=Field name does not match the regular expression '^[A-Z][A-Za-z]*$' line=38 column=6
warning file=/usr/share/tomcat8/.jenkins/jobs/SANSA-Stack/branches/feature-sans.sb0bt7.eline-design/workspace/sansa-rdf/sansa-rdf-common/src/main/scala/net/sansa_stack/rdf/common/qualityassessment/utils/DatasetUtils.scala message=Field name does not match the regular expression '^[A-Z][A-Za-z]*$' line=40 column=6
warning file=/usr/share/tomcat8/.jenkins/jobs/SANSA-Stack/branches/feature-sans.sb0bt7.eline-design/workspace/sansa-rdf/sansa-rdf-common/src/main/scala/net/sansa_stack/rdf/common/qualityassessment/utils/NodeUtils.scala message=Header does not match expected text line=1
warning file=/usr/share/tomcat8/.jenkins/jobs/SANSA-Stack/branches/feature-sans.sb0bt7.eline-design/workspace/sansa-rdf/sansa-rdf-common/src/main/scala/net/sansa_stack/rdf/common/qualityassessment/utils/NodeUtils.scala message=File line length exceeds 160 characters line=56
warning file=/usr/share/tomcat8/.jenkins/jobs/SANSA-Stack/branches/feature-sans.sb0bt7.eline-design/workspace/sansa-rdf/sansa-rdf-common/src/main/scala/net/sansa_stack/rdf/common/qualityassessment/utils/NodeUtils.scala message=Package name does not match the regular expression '^[a-z][A-Za-z]*$' line=1 column=12
warning file=/usr/share/tomcat8/.jenkins/jobs/SANSA-Stack/branches/feature-sans.sb0bt7.eline-design/workspace/sansa-rdf/sansa-rdf-common/src/main/scala/net/sansa_stack/rdf/common/qualityassessment/utils/NodeUtils.scala message=Avoid using null line=80 column=22
warning file=/usr/share/tomcat8/.jenkins/jobs/SANSA-Stack/branches/feature-sans.sb0bt7.eline-design/workspace/sansa-rdf/sansa-rdf-common/src/main/scala/net/sansa_stack/rdf/common/qualityassessment/utils/NodeUtils.scala message=Avoid using null line=90 column=37
warning file=/usr/share/tomcat8/.jenkins/jobs/SANSA-Stack/branches/feature-sans.sb0bt7.eline-design/workspace/sansa-rdf/sansa-rdf-common/src/main/scala/net/sansa_stack/rdf/common/qualityassessment/utils/NodeUtils.scala message=If block needs braces line=140 column=6
warning file=/usr/share/tomcat8/.jenkins/jobs/SANSA-Stack/branches/feature-sans.sb0bt7.eline-design/workspace/sansa-rdf/sansa-rdf-common/src/main/scala/net/sansa_stack/rdf/common/qualityassessment/utils/NodeUtils.scala message=Method is longer than 50 lines line=78 column=6
warning file=/usr/share/tomcat8/.jenkins/jobs/SANSA-Stack/branches/feature-sans.sb0bt7.eline-design/workspace/sansa-rdf/sansa-rdf-common/src/main/scala/net/sansa_stack/rdf/common/qualityassessment/utils/NodeUtils.scala message=Field name does not match the regular expression '^[A-Z][A-Za-z]*$' line=42 column=6
warning file=/usr/share/tomcat8/.jenkins/jobs/SANSA-Stack/branches/feature-sans.sb0bt7.eline-design/workspace/sansa-rdf/sansa-rdf-common/src/main/scala/net/sansa_stack/rdf/common/qualityassessment/utils/NodeUtils.scala message=Field name does not match the regular expression '^[A-Z][A-Za-z]*$' line=43 column=6
warning file=/usr/share/tomcat8/.jenkins/jobs/SANSA-Stack/branches/feature-sans.sb0bt7.eline-design/workspace/sansa-rdf/sansa-rdf-common/src/main/scala/net/sansa_stack/rdf/common/qualityassessment/utils/NodeUtils.scala message=Field name does not match the regular expression '^[A-Z][A-Za-z]*$' line=63 column=6
warning file=/usr/share/tomcat8/.jenkins/jobs/SANSA-Stack/branches/feature-sans.sb0bt7.eline-design/workspace/sansa-rdf/sansa-rdf-common/src/main/scala/net/sansa_stack/rdf/common/qualityassessment/utils/NodeUtils.scala message=Argument should be named line=138 column=50
warning file=/usr/share/tomcat8/.jenkins/jobs/SANSA-Stack/branches/feature-sans.sb0bt7.eline-design/workspace/sansa-rdf/sansa-rdf-common/src/main/scala/net/sansa_stack/rdf/common/qualityassessment/utils/NodeUtils.scala message=Argument should be named line=141 column=44
warning file=/usr/share/tomcat8/.jenkins/jobs/SANSA-Stack/branches/feature-sans.sb0bt7.eline-design/workspace/sansa-rdf/sansa-rdf-common/src/test/scala/net/sansa_stack/rdf/common/partition/utils/RdfTermTests.scala message=Header does not match expected text line=1
warning file=/usr/share/tomcat8/.jenkins/jobs/SANSA-Stack/branches/feature-sans.sb0bt7.eline-design/workspace/sansa-rdf/sansa-rdf-common/src/test/scala/net/sansa_stack/rdf/common/partition/utils/RdfTermTests.scala message=Package name does not match the regular expression '^[a-z][A-Za-z]*$' line=1 column=12
warning file=/usr/share/tomcat8/.jenkins/jobs/SANSA-Stack/branches/feature-sans.sb0bt7.eline-design/workspace/sansa-rdf/sansa-rdf-common/src/test/scala/net/sansa_stack/rdf/common/partition/utils/RdfTermTests.scala message=Avoid using null line=23 column=80
warning file=/usr/share/tomcat8/.jenkins/jobs/SANSA-Stack/branches/feature-sans.sb0bt7.eline-design/workspace/sansa-rdf/sansa-rdf-common/src/test/scala/net/sansa_stack/rdf/common/partition/utils/RdfTermTests.scala message=Avoid using null line=23 column=86
warning file=/usr/share/tomcat8/.jenkins/jobs/SANSA-Stack/branches/feature-sans.sb0bt7.eline-design/workspace/sansa-rdf/sansa-rdf-common/src/test/scala/net/sansa_stack/rdf/common/partition/utils/RdfTermTests.scala message=Argument should be named line=23 column=38
warning file=/usr/share/tomcat8/.jenkins/jobs/SANSA-Stack/branches/feature-sans.sb0bt7.eline-design/workspace/sansa-rdf/sansa-rdf-common/src/test/scala/net/sansa_stack/rdf/common/partition/utils/RdfTermTests.scala message=Argument should be named line=23 column=80
warning file=/usr/share/tomcat8/.jenkins/jobs/SANSA-Stack/branches/feature-sans.sb0bt7.eline-design/workspace/sansa-rdf/sansa-rdf-common/src/test/scala/net/sansa_stack/rdf/common/partition/utils/RdfTermTests.scala message=Argument should be named line=23 column=86
warning file=/usr/share/tomcat8/.jenkins/jobs/SANSA-Stack/branches/feature-sans.sb0bt7.eline-design/workspace/sansa-rdf/sansa-rdf-common/src/test/scala/net/sansa_stack/rdf/common/partition/model/sparqlify/SparqlifyUtils2Tests.scala message=Header does not match expected text line=1
warning file=/usr/share/tomcat8/.jenkins/jobs/SANSA-Stack/branches/feature-sans.sb0bt7.eline-design/workspace/sansa-rdf/sansa-rdf-common/src/test/scala/net/sansa_stack/rdf/common/partition/model/sparqlify/SparqlifyUtils2Tests.scala message=File line length exceeds 160 characters line=22
warning file=/usr/share/tomcat8/.jenkins/jobs/SANSA-Stack/branches/feature-sans.sb0bt7.eline-design/workspace/sansa-rdf/sansa-rdf-common/src/test/scala/net/sansa_stack/rdf/common/partition/model/sparqlify/SparqlifyUtils2Tests.scala message=Package name does not match the regular expression '^[a-z][A-Za-z]*$' line=1 column=12
warning file=/usr/share/tomcat8/.jenkins/jobs/SANSA-Stack/branches/feature-sans.sb0bt7.eline-design/workspace/sansa-rdf/sansa-rdf-common/src/test/scala/net/sansa_stack/rdf/common/partition/core/RdfPartitionerDefaultTests.scala message=Header does not match expected text line=1
warning file=/usr/share/tomcat8/.jenkins/jobs/SANSA-Stack/branches/feature-sans.sb0bt7.eline-design/workspace/sansa-rdf/sansa-rdf-common/src/test/scala/net/sansa_stack/rdf/common/partition/core/RdfPartitionerDefaultTests.scala message=Package name does not match the regular expression '^[a-z][A-Za-z]*$' line=1 column=12
warning file=/usr/share/tomcat8/.jenkins/jobs/SANSA-Stack/branches/feature-sans.sb0bt7.eline-design/workspace/sansa-rdf/sansa-rdf-common/src/test/scala/net/sansa_stack/rdf/common/partition/core/RdfPartitionerDefaultTests.scala message=Argument should be named line=37 column=52
warning file=/usr/share/tomcat8/.jenkins/jobs/SANSA-Stack/branches/feature-sans.sb0bt7.eline-design/workspace/sansa-rdf/sansa-rdf-common/src/test/scala/net/sansa_stack/rdf/common/partition/core/RdfPartitionerDefaultTests.scala message=Argument should be named line=38 column=6
warning file=/usr/share/tomcat8/.jenkins/jobs/SANSA-Stack/branches/feature-sans.sb0bt7.eline-design/workspace/sansa-rdf/sansa-rdf-common/src/test/scala/net/sansa_stack/rdf/common/partition/core/RdfPartitionerDefaultTests.scala message=Argument should be named line=38 column=52
warning file=/usr/share/tomcat8/.jenkins/jobs/SANSA-Stack/branches/feature-sans.sb0bt7.eline-design/workspace/sansa-rdf/sansa-rdf-common/src/test/scala/net/sansa_stack/rdf/common/partition/core/RdfPartitionDefaultTests.scala message=Header does not match expected text line=1
warning file=/usr/share/tomcat8/.jenkins/jobs/SANSA-Stack/branches/feature-sans.sb0bt7.eline-design/workspace/sansa-rdf/sansa-rdf-common/src/test/scala/net/sansa_stack/rdf/common/partition/core/RdfPartitionDefaultTests.scala message=Package name does not match the regular expression '^[a-z][A-Za-z]*$' line=1 column=12
warning file=/usr/share/tomcat8/.jenkins/jobs/SANSA-Stack/branches/feature-sans.sb0bt7.eline-design/workspace/sansa-rdf/sansa-rdf-common/src/test/scala/net/sansa_stack/rdf/common/partition/core/RdfPartitionDefaultTests.scala message=Argument should be named line=18 column=42
warning file=/usr/share/tomcat8/.jenkins/jobs/SANSA-Stack/branches/feature-sans.sb0bt7.eline-design/workspace/sansa-rdf/sansa-rdf-common/src/test/scala/net/sansa_stack/rdf/common/partition/core/RdfPartitionDefaultTests.scala message=Argument should be named line=19 column=4
warning file=/usr/share/tomcat8/.jenkins/jobs/SANSA-Stack/branches/feature-sans.sb0bt7.eline-design/workspace/sansa-rdf/sansa-rdf-common/src/test/scala/net/sansa_stack/rdf/common/partition/core/RdfPartitionDefaultTests.scala message=Argument should be named line=19 column=50
warning file=/usr/share/tomcat8/.jenkins/jobs/SANSA-Stack/branches/feature-sans.sb0bt7.eline-design/workspace/sansa-rdf/sansa-rdf-common/src/test/scala/net/sansa_stack/rdf/common/partition/layout/TripleLayoutStringLangTests.scala message=Header does not match expected text line=1
warning file=/usr/share/tomcat8/.jenkins/jobs/SANSA-Stack/branches/feature-sans.sb0bt7.eline-design/workspace/sansa-rdf/sansa-rdf-common/src/test/scala/net/sansa_stack/rdf/common/partition/layout/TripleLayoutStringLangTests.scala message=Package name does not match the regular expression '^[a-z][A-Za-z]*$' line=1 column=12
warning file=/usr/share/tomcat8/.jenkins/jobs/SANSA-Stack/branches/feature-sans.sb0bt7.eline-design/workspace/sansa-rdf/sansa-rdf-common/src/test/scala/net/sansa_stack/rdf/common/partition/layout/TripleLayoutLongTests.scala message=Header does not match expected text line=1
warning file=/usr/share/tomcat8/.jenkins/jobs/SANSA-Stack/branches/feature-sans.sb0bt7.eline-design/workspace/sansa-rdf/sansa-rdf-common/src/test/scala/net/sansa_stack/rdf/common/partition/layout/TripleLayoutLongTests.scala message=Package name does not match the regular expression '^[a-z][A-Za-z]*$' line=1 column=12
warning file=/usr/share/tomcat8/.jenkins/jobs/SANSA-Stack/branches/feature-sans.sb0bt7.eline-design/workspace/sansa-rdf/sansa-rdf-common/src/test/scala/net/sansa_stack/rdf/common/partition/layout/TripleLayoutDoubleTests.scala message=Header does not match expected text line=1
warning file=/usr/share/tomcat8/.jenkins/jobs/SANSA-Stack/branches/feature-sans.sb0bt7.eline-design/workspace/sansa-rdf/sansa-rdf-common/src/test/scala/net/sansa_stack/rdf/common/partition/layout/TripleLayoutDoubleTests.scala message=Package name does not match the regular expression '^[a-z][A-Za-z]*$' line=1 column=12
warning file=/usr/share/tomcat8/.jenkins/jobs/SANSA-Stack/branches/feature-sans.sb0bt7.eline-design/workspace/sansa-rdf/sansa-rdf-common/src/test/scala/net/sansa_stack/rdf/common/partition/layout/TripleLayoutStringTests.scala message=Header does not match expected text line=1
warning file=/usr/share/tomcat8/.jenkins/jobs/SANSA-Stack/branches/feature-sans.sb0bt7.eline-design/workspace/sansa-rdf/sansa-rdf-common/src/test/scala/net/sansa_stack/rdf/common/partition/layout/TripleLayoutStringTests.scala message=Package name does not match the regular expression '^[a-z][A-Za-z]*$' line=1 column=12
warning file=/usr/share/tomcat8/.jenkins/jobs/SANSA-Stack/branches/feature-sans.sb0bt7.eline-design/workspace/sansa-rdf/sansa-rdf-common/src/test/scala/net/sansa_stack/rdf/common/partition/layout/TripleLayoutStringDatatypeTests.scala message=Header does not match expected text line=1
warning file=/usr/share/tomcat8/.jenkins/jobs/SANSA-Stack/branches/feature-sans.sb0bt7.eline-design/workspace/sansa-rdf/sansa-rdf-common/src/test/scala/net/sansa_stack/rdf/common/partition/layout/TripleLayoutStringDatatypeTests.scala message=File line length exceeds 160 characters line=20
warning file=/usr/share/tomcat8/.jenkins/jobs/SANSA-Stack/branches/feature-sans.sb0bt7.eline-design/workspace/sansa-rdf/sansa-rdf-common/src/test/scala/net/sansa_stack/rdf/common/partition/layout/TripleLayoutStringDatatypeTests.scala message=Package name does not match the regular expression '^[a-z][A-Za-z]*$' line=1 column=12
warning file=/usr/share/tomcat8/.jenkins/jobs/SANSA-Stack/branches/feature-sans.sb0bt7.eline-design/workspace/sansa-rdf/sansa-rdf-common/src/test/scala/net/sansa_stack/rdf/common/io/hadoop/TrigRecordReaderTest.scala message=Header does not match expected text line=1
warning file=/usr/share/tomcat8/.jenkins/jobs/SANSA-Stack/branches/feature-sans.sb0bt7.eline-design/workspace/sansa-rdf/sansa-rdf-common/src/test/scala/net/sansa_stack/rdf/common/io/hadoop/TrigRecordReaderTest.scala message=Package name does not match the regular expression '^[a-z][A-Za-z]*$' line=1 column=12
warning file=/usr/share/tomcat8/.jenkins/jobs/SANSA-Stack/branches/feature-sans.sb0bt7.eline-design/workspace/sansa-rdf/sansa-rdf-common/src/test/scala/net/sansa_stack/rdf/common/io/hadoop/TrigRecordReaderTest.scala message=Avoid using null line=178 column=41
warning file=/usr/share/tomcat8/.jenkins/jobs/SANSA-Stack/branches/feature-sans.sb0bt7.eline-design/workspace/sansa-rdf/sansa-rdf-common/src/test/scala/net/sansa_stack/rdf/common/io/hadoop/TrigRecordReaderTest.scala message=Regular expression matched 'println' line=83 column=11
warning file=/usr/share/tomcat8/.jenkins/jobs/SANSA-Stack/branches/feature-sans.sb0bt7.eline-design/workspace/sansa-rdf/sansa-rdf-common/src/test/scala/net/sansa_stack/rdf/common/io/hadoop/TrigRecordReaderTest.scala message=Regular expression matched 'println' line=92 column=16
warning file=/usr/share/tomcat8/.jenkins/jobs/SANSA-Stack/branches/feature-sans.sb0bt7.eline-design/workspace/sansa-rdf/sansa-rdf-common/src/test/scala/net/sansa_stack/rdf/common/io/hadoop/TrigRecordReaderTest.scala message=Regular expression matched 'println' line=107 column=21
warning file=/usr/share/tomcat8/.jenkins/jobs/SANSA-Stack/branches/feature-sans.sb0bt7.eline-design/workspace/sansa-rdf/sansa-rdf-common/src/test/scala/net/sansa_stack/rdf/common/io/hadoop/TrigRecordReaderTest.scala message=Regular expression matched 'println' line=111 column=6
warning file=/usr/share/tomcat8/.jenkins/jobs/SANSA-Stack/branches/feature-sans.sb0bt7.eline-design/workspace/sansa-rdf/sansa-rdf-common/src/test/scala/net/sansa_stack/rdf/common/io/hadoop/TrigRecordReaderTest.scala message=Regular expression matched 'println' line=155 column=9
warning file=/usr/share/tomcat8/.jenkins/jobs/SANSA-Stack/branches/feature-sans.sb0bt7.eline-design/workspace/sansa-rdf/sansa-rdf-common/src/test/scala/net/sansa_stack/rdf/common/io/hadoop/TrigRecordReaderTest.scala message=Regular expression matched 'println' line=163 column=7
warning file=/usr/share/tomcat8/.jenkins/jobs/SANSA-Stack/branches/feature-sans.sb0bt7.eline-design/workspace/sansa-rdf/sansa-rdf-common/src/test/scala/net/sansa_stack/rdf/common/io/hadoop/TrigRecordReaderTest.scala message=Regular expression matched 'println' line=192 column=15
warning file=/usr/share/tomcat8/.jenkins/jobs/SANSA-Stack/branches/feature-sans.sb0bt7.eline-design/workspace/sansa-rdf/sansa-rdf-common/src/test/scala/net/sansa_stack/rdf/common/io/hadoop/TrigRecordReaderTest.scala message=Regular expression matched 'println' line=194 column=17
warning file=/usr/share/tomcat8/.jenkins/jobs/SANSA-Stack/branches/feature-sans.sb0bt7.eline-design/workspace/sansa-rdf/sansa-rdf-common/src/test/scala/net/sansa_stack/rdf/common/io/hadoop/TrigRecordReaderTest.scala message=Regular expression matched 'println' line=197 column=15
warning file=/usr/share/tomcat8/.jenkins/jobs/SANSA-Stack/branches/feature-sans.sb0bt7.eline-design/workspace/sansa-rdf/sansa-rdf-common/src/test/scala/net/sansa_stack/rdf/common/io/hadoop/TrigRecordReaderTest.scala message=Regular expression matched 'println' line=199 column=17
warning file=/usr/share/tomcat8/.jenkins/jobs/SANSA-Stack/branches/feature-sans.sb0bt7.eline-design/workspace/sansa-rdf/sansa-rdf-common/src/test/scala/net/sansa_stack/rdf/common/io/hadoop/TrigRecordReaderTest.scala message=Regular expression matched 'println' line=202 column=15
warning file=/usr/share/tomcat8/.jenkins/jobs/SANSA-Stack/branches/feature-sans.sb0bt7.eline-design/workspace/sansa-rdf/sansa-rdf-common/src/test/scala/net/sansa_stack/rdf/common/io/hadoop/TrigRecordReaderTest.scala message=Regular expression matched 'println' line=206 column=15
warning file=/usr/share/tomcat8/.jenkins/jobs/SANSA-Stack/branches/feature-sans.sb0bt7.eline-design/workspace/sansa-rdf/sansa-rdf-common/src/test/scala/net/sansa_stack/rdf/common/io/hadoop/TrigRecordReaderTest.scala message=Regular expression matched 'println' line=208 column=15
warning file=/usr/share/tomcat8/.jenkins/jobs/SANSA-Stack/branches/feature-sans.sb0bt7.eline-design/workspace/sansa-rdf/sansa-rdf-common/src/test/scala/net/sansa_stack/rdf/common/io/hadoop/TrigRecordReaderTest.scala message=Regular expression matched 'println' line=210 column=15
warning file=/usr/share/tomcat8/.jenkins/jobs/SANSA-Stack/branches/feature-sans.sb0bt7.eline-design/workspace/sansa-rdf/sansa-rdf-common/src/test/scala/net/sansa_stack/rdf/common/io/hadoop/TrigRecordReaderTest.scala message=Use braces in for comprehensions line=75 column=6
warning file=/usr/share/tomcat8/.jenkins/jobs/SANSA-Stack/branches/feature-sans.sb0bt7.eline-design/workspace/sansa-rdf/sansa-rdf-common/src/test/scala/net/sansa_stack/rdf/common/io/hadoop/TrigRecordReaderTest.scala message=Use braces in for comprehensions line=173 column=8
warning file=/usr/share/tomcat8/.jenkins/jobs/SANSA-Stack/branches/feature-sans.sb0bt7.eline-design/workspace/sansa-rdf/sansa-rdf-common/src/test/scala/net/sansa_stack/rdf/common/io/hadoop/TrigRecordReaderTest.scala message=Field name does not match the regular expression '^[a-z][A-Za-z]*$' line=224 column=10
warning file=/usr/share/tomcat8/.jenkins/jobs/SANSA-Stack/branches/feature-sans.sb0bt7.eline-design/workspace/sansa-rdf/sansa-rdf-common/src/test/scala/net/sansa_stack/rdf/common/io/hadoop/TrigRecordReaderTest.scala message=Field name does not match the regular expression '^[a-z][A-Za-z]*$' line=225 column=10
warning file=/usr/share/tomcat8/.jenkins/jobs/SANSA-Stack/branches/feature-sans.sb0bt7.eline-design/workspace/sansa-rdf/sansa-rdf-common/src/test/scala/net/sansa_stack/rdf/common/io/hadoop/TrigRecordReaderTest.scala message=Argument should be named line=33 column=31
warning file=/usr/share/tomcat8/.jenkins/jobs/SANSA-Stack/branches/feature-sans.sb0bt7.eline-design/workspace/sansa-rdf/sansa-rdf-common/src/test/scala/net/sansa_stack/rdf/common/io/hadoop/TrigRecordReaderTest.scala message=Argument should be named line=178 column=41
warning file=/usr/share/tomcat8/.jenkins/jobs/SANSA-Stack/branches/feature-sans.sb0bt7.eline-design/workspace/sansa-rdf/sansa-rdf-common/src/test/scala/net/sansa_stack/rdf/common/qualityassessment/utils/QANodeUtilsTests.scala message=Header does not match expected text line=1
warning file=/usr/share/tomcat8/.jenkins/jobs/SANSA-Stack/branches/feature-sans.sb0bt7.eline-design/workspace/sansa-rdf/sansa-rdf-common/src/test/scala/net/sansa_stack/rdf/common/qualityassessment/utils/QANodeUtilsTests.scala message=Package name does not match the regular expression '^[a-z][A-Za-z]*$' line=1 column=12
Saving to outputFile=/usr/share/tomcat8/.jenkins/jobs/SANSA-Stack/branches/feature-sans.sb0bt7.eline-design/workspace/sansa-rdf/sansa-rdf-common/scalastyle-output.xml
Processed 48 file(s)
Found 0 errors
Found 305 warnings
Found 0 infos
Finished in 1937 ms
[INFO] 
[INFO] --- maven-install-plugin:2.4:install (default-install) @ sansa-rdf-common_2.12 ---
[INFO] Installing /usr/share/tomcat8/.jenkins/jobs/SANSA-Stack/branches/feature-sans.sb0bt7.eline-design/workspace/sansa-rdf/sansa-rdf-common/target/sansa-rdf-common_2.12-0.7.2-SNAPSHOT.jar to /usr/share/tomcat8/.m2/repository/net/sansa-stack/sansa-rdf-common_2.12/0.7.2-SNAPSHOT/sansa-rdf-common_2.12-0.7.2-SNAPSHOT.jar
[INFO] Installing /usr/share/tomcat8/.jenkins/jobs/SANSA-Stack/branches/feature-sans.sb0bt7.eline-design/workspace/sansa-rdf/sansa-rdf-common/pom.xml to /usr/share/tomcat8/.m2/repository/net/sansa-stack/sansa-rdf-common_2.12/0.7.2-SNAPSHOT/sansa-rdf-common_2.12-0.7.2-SNAPSHOT.pom
[INFO] Installing /usr/share/tomcat8/.jenkins/jobs/SANSA-Stack/branches/feature-sans.sb0bt7.eline-design/workspace/sansa-rdf/sansa-rdf-common/target/sansa-rdf-common_2.12-0.7.2-SNAPSHOT-javadoc.jar to /usr/share/tomcat8/.m2/repository/net/sansa-stack/sansa-rdf-common_2.12/0.7.2-SNAPSHOT/sansa-rdf-common_2.12-0.7.2-SNAPSHOT-javadoc.jar
[INFO] Installing /usr/share/tomcat8/.jenkins/jobs/SANSA-Stack/branches/feature-sans.sb0bt7.eline-design/workspace/sansa-rdf/sansa-rdf-common/target/sansa-rdf-common_2.12-0.7.2-SNAPSHOT-javadoc.jar to /usr/share/tomcat8/.m2/repository/net/sansa-stack/sansa-rdf-common_2.12/0.7.2-SNAPSHOT/sansa-rdf-common_2.12-0.7.2-SNAPSHOT-javadoc.jar
[INFO] Installing /usr/share/tomcat8/.jenkins/jobs/SANSA-Stack/branches/feature-sans.sb0bt7.eline-design/workspace/sansa-rdf/sansa-rdf-common/target/sansa-rdf-common_2.12-0.7.2-SNAPSHOT-sources.jar to /usr/share/tomcat8/.m2/repository/net/sansa-stack/sansa-rdf-common_2.12/0.7.2-SNAPSHOT/sansa-rdf-common_2.12-0.7.2-SNAPSHOT-sources.jar
[INFO] 
[INFO] --- maven-deploy-plugin:2.7:deploy (default-deploy) @ sansa-rdf-common_2.12 ---
[INFO] Downloading from maven.aksw.snapshots: https://maven.aksw.org/archiva/repository/snapshots/net/sansa-stack/sansa-rdf-common_2.12/0.7.2-SNAPSHOT/maven-metadata.xml
[WARNING] Could not transfer metadata net.sansa-stack:sansa-rdf-common_2.12:0.7.2-SNAPSHOT/maven-metadata.xml from/to maven.aksw.snapshots (https://maven.aksw.org/archiva/repository/snapshots): Failed to transfer file: https://maven.aksw.org/archiva/repository/snapshots/net/sansa-stack/sansa-rdf-common_2.12/0.7.2-SNAPSHOT/maven-metadata.xml. Return code is: 502 , ReasonPhrase:Bad Gateway.
[INFO] ------------------------------------------------------------------------
[INFO] Reactor Summary:
[INFO] 
[INFO] SANSA - Parent 0.7.2-SNAPSHOT ...................... SUCCESS [ 15.451 s]
[INFO] SANSA Stack - RDF Layer - Parent ................... SUCCESS [  0.163 s]
[INFO] sansa-rdf-common_2.12 .............................. FAILURE [ 45.684 s]
[INFO] sansa-rdf-spark_2.12 ............................... SKIPPED
[INFO] SANSA Stack - DataLake Layer - Parent .............. SKIPPED
[INFO] sansa-datalake-spark_2.12 .......................... SKIPPED
[INFO] SANSA Stack - Query Layer - Parent ................. SKIPPED
[INFO] sansa-query-tests_2.12 ............................. SKIPPED
[INFO] sansa-query-spark_2.12 0.7.2-SNAPSHOT .............. SKIPPED
[INFO] ------------------------------------------------------------------------
[INFO] BUILD FAILURE
[INFO] ------------------------------------------------------------------------
[INFO] Total time: 01:02 min
[INFO] Finished at: 2020-12-15T13:15:59+01:00
[INFO] ------------------------------------------------------------------------
[ERROR] Failed to execute goal org.apache.maven.plugins:maven-deploy-plugin:2.7:deploy (default-deploy) on project sansa-rdf-common_2.12: Failed to retrieve remote metadata net.sansa-stack:sansa-rdf-common_2.12:0.7.2-SNAPSHOT/maven-metadata.xml: Could not transfer metadata net.sansa-stack:sansa-rdf-common_2.12:0.7.2-SNAPSHOT/maven-metadata.xml from/to maven.aksw.snapshots (https://maven.aksw.org/archiva/repository/snapshots): Failed to transfer file: https://maven.aksw.org/archiva/repository/snapshots/net/sansa-stack/sansa-rdf-common_2.12/0.7.2-SNAPSHOT/maven-metadata.xml. Return code is: 502 , ReasonPhrase:Bad Gateway. -> [Help 1]
org.apache.maven.lifecycle.LifecycleExecutionException: Failed to execute goal org.apache.maven.plugins:maven-deploy-plugin:2.7:deploy (default-deploy) on project sansa-rdf-common_2.12: Failed to retrieve remote metadata net.sansa-stack:sansa-rdf-common_2.12:0.7.2-SNAPSHOT/maven-metadata.xml: Could not transfer metadata net.sansa-stack:sansa-rdf-common_2.12:0.7.2-SNAPSHOT/maven-metadata.xml from/to maven.aksw.snapshots (https://maven.aksw.org/archiva/repository/snapshots): Failed to transfer file: https://maven.aksw.org/archiva/repository/snapshots/net/sansa-stack/sansa-rdf-common_2.12/0.7.2-SNAPSHOT/maven-metadata.xml. Return code is: 502 , ReasonPhrase:Bad Gateway.
    at org.apache.maven.lifecycle.internal.MojoExecutor.execute (MojoExecutor.java:213)
    at org.apache.maven.lifecycle.internal.MojoExecutor.execute (MojoExecutor.java:154)
    at org.apache.maven.lifecycle.internal.MojoExecutor.execute (MojoExecutor.java:146)
    at org.apache.maven.lifecycle.internal.LifecycleModuleBuilder.buildProject (LifecycleModuleBuilder.java:117)
    at org.apache.maven.lifecycle.internal.LifecycleModuleBuilder.buildProject (LifecycleModuleBuilder.java:81)
    at org.apache.maven.lifecycle.internal.builder.singlethreaded.SingleThreadedBuilder.build (SingleThreadedBuilder.java:56)
    at org.apache.maven.lifecycle.internal.LifecycleStarter.execute (LifecycleStarter.java:128)
    at org.apache.maven.DefaultMaven.doExecute (DefaultMaven.java:305)
    at org.apache.maven.DefaultMaven.doExecute (DefaultMaven.java:192)
    at org.apache.maven.DefaultMaven.execute (DefaultMaven.java:105)
    at org.apache.maven.cli.MavenCli.execute (MavenCli.java:954)
    at org.apache.maven.cli.MavenCli.doMain (MavenCli.java:288)
    at org.apache.maven.cli.MavenCli.main (MavenCli.java:192)
    at sun.reflect.NativeMethodAccessorImpl.invoke0 (Native Method)
    at sun.reflect.NativeMethodAccessorImpl.invoke (NativeMethodAccessorImpl.java:62)
    at sun.reflect.DelegatingMethodAccessorImpl.invoke (DelegatingMethodAccessorImpl.java:43)
    at java.lang.reflect.Method.invoke (Method.java:498)
    at org.codehaus.plexus.classworlds.launcher.Launcher.launchEnhanced (Launcher.java:289)
    at org.codehaus.plexus.classworlds.launcher.Launcher.launch (Launcher.java:229)
    at org.codehaus.plexus.classworlds.launcher.Launcher.mainWithExitCode (Launcher.java:415)
    at org.codehaus.plexus.classworlds.launcher.Launcher.main (Launcher.java:356)
Caused by: org.apache.maven.plugin.MojoExecutionException: Failed to retrieve remote metadata net.sansa-stack:sansa-rdf-common_2.12:0.7.2-SNAPSHOT/maven-metadata.xml: Could not transfer metadata net.sansa-stack:sansa-rdf-common_2.12:0.7.2-SNAPSHOT/maven-metadata.xml from/to maven.aksw.snapshots (https://maven.aksw.org/archiva/repository/snapshots): Failed to transfer file: https://maven.aksw.org/archiva/repository/snapshots/net/sansa-stack/sansa-rdf-common_2.12/0.7.2-SNAPSHOT/maven-metadata.xml. Return code is: 502 , ReasonPhrase:Bad Gateway.
    at org.apache.maven.plugin.deploy.DeployMojo.execute (DeployMojo.java:193)
    at org.apache.maven.plugin.DefaultBuildPluginManager.executeMojo (DefaultBuildPluginManager.java:137)
    at org.apache.maven.lifecycle.internal.MojoExecutor.execute (MojoExecutor.java:208)
    at org.apache.maven.lifecycle.internal.MojoExecutor.execute (MojoExecutor.java:154)
    at org.apache.maven.lifecycle.internal.MojoExecutor.execute (MojoExecutor.java:146)
    at org.apache.maven.lifecycle.internal.LifecycleModuleBuilder.buildProject (LifecycleModuleBuilder.java:117)
    at org.apache.maven.lifecycle.internal.LifecycleModuleBuilder.buildProject (LifecycleModuleBuilder.java:81)
    at org.apache.maven.lifecycle.internal.builder.singlethreaded.SingleThreadedBuilder.build (SingleThreadedBuilder.java:56)
    at org.apache.maven.lifecycle.internal.LifecycleStarter.execute (LifecycleStarter.java:128)
    at org.apache.maven.DefaultMaven.doExecute (DefaultMaven.java:305)
    at org.apache.maven.DefaultMaven.doExecute (DefaultMaven.java:192)
    at org.apache.maven.DefaultMaven.execute (DefaultMaven.java:105)
    at org.apache.maven.cli.MavenCli.execute (MavenCli.java:954)
    at org.apache.maven.cli.MavenCli.doMain (MavenCli.java:288)
    at org.apache.maven.cli.MavenCli.main (MavenCli.java:192)
    at sun.reflect.NativeMethodAccessorImpl.invoke0 (Native Method)
    at sun.reflect.NativeMethodAccessorImpl.invoke (NativeMethodAccessorImpl.java:62)
    at sun.reflect.DelegatingMethodAccessorImpl.invoke (DelegatingMethodAccessorImpl.java:43)
    at java.lang.reflect.Method.invoke (Method.java:498)
    at org.codehaus.plexus.classworlds.launcher.Launcher.launchEnhanced (Launcher.java:289)
    at org.codehaus.plexus.classworlds.launcher.Launcher.launch (Launcher.java:229)
    at org.codehaus.plexus.classworlds.launcher.Launcher.mainWithExitCode (Launcher.java:415)
    at org.codehaus.plexus.classworlds.launcher.Launcher.main (Launcher.java:356)
Caused by: org.apache.maven.artifact.deployer.ArtifactDeploymentException: Failed to retrieve remote metadata net.sansa-stack:sansa-rdf-common_2.12:0.7.2-SNAPSHOT/maven-metadata.xml: Could not transfer metadata net.sansa-stack:sansa-rdf-common_2.12:0.7.2-SNAPSHOT/maven-metadata.xml from/to maven.aksw.snapshots (https://maven.aksw.org/archiva/repository/snapshots): Failed to transfer file: https://maven.aksw.org/archiva/repository/snapshots/net/sansa-stack/sansa-rdf-common_2.12/0.7.2-SNAPSHOT/maven-metadata.xml. Return code is: 502 , ReasonPhrase:Bad Gateway.
    at org.apache.maven.artifact.deployer.DefaultArtifactDeployer.deploy (DefaultArtifactDeployer.java:146)
    at org.apache.maven.plugin.deploy.AbstractDeployMojo.deploy (AbstractDeployMojo.java:167)
    at org.apache.maven.plugin.deploy.DeployMojo.execute (DeployMojo.java:157)
    at org.apache.maven.plugin.DefaultBuildPluginManager.executeMojo (DefaultBuildPluginManager.java:137)
    at org.apache.maven.lifecycle.internal.MojoExecutor.execute (MojoExecutor.java:208)
    at org.apache.maven.lifecycle.internal.MojoExecutor.execute (MojoExecutor.java:154)
    at org.apache.maven.lifecycle.internal.MojoExecutor.execute (MojoExecutor.java:146)
    at org.apache.maven.lifecycle.internal.LifecycleModuleBuilder.buildProject (LifecycleModuleBuilder.java:117)
    at org.apache.maven.lifecycle.internal.LifecycleModuleBuilder.buildProject (LifecycleModuleBuilder.java:81)
    at org.apache.maven.lifecycle.internal.builder.singlethreaded.SingleThreadedBuilder.build (SingleThreadedBuilder.java:56)
    at org.apache.maven.lifecycle.internal.LifecycleStarter.execute (LifecycleStarter.java:128)
    at org.apache.maven.DefaultMaven.doExecute (DefaultMaven.java:305)
    at org.apache.maven.DefaultMaven.doExecute (DefaultMaven.java:192)
    at org.apache.maven.DefaultMaven.execute (DefaultMaven.java:105)
    at org.apache.maven.cli.MavenCli.execute (MavenCli.java:954)
    at org.apache.maven.cli.MavenCli.doMain (MavenCli.java:288)
    at org.apache.maven.cli.MavenCli.main (MavenCli.java:192)
    at sun.reflect.NativeMethodAccessorImpl.invoke0 (Native Method)
    at sun.reflect.NativeMethodAccessorImpl.invoke (NativeMethodAccessorImpl.java:62)
    at sun.reflect.DelegatingMethodAccessorImpl.invoke (DelegatingMethodAccessorImpl.java:43)
    at java.lang.reflect.Method.invoke (Method.java:498)
    at org.codehaus.plexus.classworlds.launcher.Launcher.launchEnhanced (Launcher.java:289)
    at org.codehaus.plexus.classworlds.launcher.Launcher.launch (Launcher.java:229)
    at org.codehaus.plexus.classworlds.launcher.Launcher.mainWithExitCode (Launcher.java:415)
    at org.codehaus.plexus.classworlds.launcher.Launcher.main (Launcher.java:356)
Caused by: org.eclipse.aether.deployment.DeploymentException: Failed to retrieve remote metadata net.sansa-stack:sansa-rdf-common_2.12:0.7.2-SNAPSHOT/maven-metadata.xml: Could not transfer metadata net.sansa-stack:sansa-rdf-common_2.12:0.7.2-SNAPSHOT/maven-metadata.xml from/to maven.aksw.snapshots (https://maven.aksw.org/archiva/repository/snapshots): Failed to transfer file: https://maven.aksw.org/archiva/repository/snapshots/net/sansa-stack/sansa-rdf-common_2.12/0.7.2-SNAPSHOT/maven-metadata.xml. Return code is: 502 , ReasonPhrase:Bad Gateway.
    at org.eclipse.aether.internal.impl.DefaultDeployer.upload (DefaultDeployer.java:425)
    at org.eclipse.aether.internal.impl.DefaultDeployer.deploy (DefaultDeployer.java:268)
    at org.eclipse.aether.internal.impl.DefaultDeployer.deploy (DefaultDeployer.java:223)
    at org.eclipse.aether.internal.impl.DefaultRepositorySystem.deploy (DefaultRepositorySystem.java:384)
    at org.apache.maven.artifact.deployer.DefaultArtifactDeployer.deploy (DefaultArtifactDeployer.java:142)
    at org.apache.maven.plugin.deploy.AbstractDeployMojo.deploy (AbstractDeployMojo.java:167)
    at org.apache.maven.plugin.deploy.DeployMojo.execute (DeployMojo.java:157)
    at org.apache.maven.plugin.DefaultBuildPluginManager.executeMojo (DefaultBuildPluginManager.java:137)
    at org.apache.maven.lifecycle.internal.MojoExecutor.execute (MojoExecutor.java:208)
    at org.apache.maven.lifecycle.internal.MojoExecutor.execute (MojoExecutor.java:154)
    at org.apache.maven.lifecycle.internal.MojoExecutor.execute (MojoExecutor.java:146)
    at org.apache.maven.lifecycle.internal.LifecycleModuleBuilder.buildProject (LifecycleModuleBuilder.java:117)
    at org.apache.maven.lifecycle.internal.LifecycleModuleBuilder.buildProject (LifecycleModuleBuilder.java:81)
    at org.apache.maven.lifecycle.internal.builder.singlethreaded.SingleThreadedBuilder.build (SingleThreadedBuilder.java:56)
    at org.apache.maven.lifecycle.internal.LifecycleStarter.execute (LifecycleStarter.java:128)
    at org.apache.maven.DefaultMaven.doExecute (DefaultMaven.java:305)
    at org.apache.maven.DefaultMaven.doExecute (DefaultMaven.java:192)
    at org.apache.maven.DefaultMaven.execute (DefaultMaven.java:105)
    at org.apache.maven.cli.MavenCli.execute (MavenCli.java:954)
    at org.apache.maven.cli.MavenCli.doMain (MavenCli.java:288)
    at org.apache.maven.cli.MavenCli.main (MavenCli.java:192)
    at sun.reflect.NativeMethodAccessorImpl.invoke0 (Native Method)
    at sun.reflect.NativeMethodAccessorImpl.invoke (NativeMethodAccessorImpl.java:62)
    at sun.reflect.DelegatingMethodAccessorImpl.invoke (DelegatingMethodAccessorImpl.java:43)
    at java.lang.reflect.Method.invoke (Method.java:498)
    at org.codehaus.plexus.classworlds.launcher.Launcher.launchEnhanced (Launcher.java:289)
    at org.codehaus.plexus.classworlds.launcher.Launcher.launch (Launcher.java:229)
    at org.codehaus.plexus.classworlds.launcher.Launcher.mainWithExitCode (Launcher.java:415)
    at org.codehaus.plexus.classworlds.launcher.Launcher.main (Launcher.java:356)
Caused by: org.eclipse.aether.transfer.MetadataTransferException: Could not transfer metadata net.sansa-stack:sansa-rdf-common_2.12:0.7.2-SNAPSHOT/maven-metadata.xml from/to maven.aksw.snapshots (https://maven.aksw.org/archiva/repository/snapshots): Failed to transfer file: https://maven.aksw.org/archiva/repository/snapshots/net/sansa-stack/sansa-rdf-common_2.12/0.7.2-SNAPSHOT/maven-metadata.xml. Return code is: 502 , ReasonPhrase:Bad Gateway.
    at org.eclipse.aether.connector.basic.MetadataTransportListener.transferFailed (MetadataTransportListener.java:52)
    at org.eclipse.aether.connector.basic.BasicRepositoryConnector$TaskRunner.run (BasicRepositoryConnector.java:365)
    at org.eclipse.aether.util.concurrency.RunnableErrorForwarder$1.run (RunnableErrorForwarder.java:75)
    at org.eclipse.aether.connector.basic.BasicRepositoryConnector$DirectExecutor.execute (BasicRepositoryConnector.java:583)
    at org.eclipse.aether.connector.basic.BasicRepositoryConnector.get (BasicRepositoryConnector.java:232)
    at org.eclipse.aether.internal.impl.DefaultDeployer.upload (DefaultDeployer.java:395)
    at org.eclipse.aether.internal.impl.DefaultDeployer.deploy (DefaultDeployer.java:268)
    at org.eclipse.aether.internal.impl.DefaultDeployer.deploy (DefaultDeployer.java:223)
    at org.eclipse.aether.internal.impl.DefaultRepositorySystem.deploy (DefaultRepositorySystem.java:384)
    at org.apache.maven.artifact.deployer.DefaultArtifactDeployer.deploy (DefaultArtifactDeployer.java:142)
    at org.apache.maven.plugin.deploy.AbstractDeployMojo.deploy (AbstractDeployMojo.java:167)
    at org.apache.maven.plugin.deploy.DeployMojo.execute (DeployMojo.java:157)
    at org.apache.maven.plugin.DefaultBuildPluginManager.executeMojo (DefaultBuildPluginManager.java:137)
    at org.apache.maven.lifecycle.internal.MojoExecutor.execute (MojoExecutor.java:208)
    at org.apache.maven.lifecycle.internal.MojoExecutor.execute (MojoExecutor.java:154)
    at org.apache.maven.lifecycle.internal.MojoExecutor.execute (MojoExecutor.java:146)
    at org.apache.maven.lifecycle.internal.LifecycleModuleBuilder.buildProject (LifecycleModuleBuilder.java:117)
    at org.apache.maven.lifecycle.internal.LifecycleModuleBuilder.buildProject (LifecycleModuleBuilder.java:81)
    at org.apache.maven.lifecycle.internal.builder.singlethreaded.SingleThreadedBuilder.build (SingleThreadedBuilder.java:56)
    at org.apache.maven.lifecycle.internal.LifecycleStarter.execute (LifecycleStarter.java:128)
    at org.apache.maven.DefaultMaven.doExecute (DefaultMaven.java:305)
    at org.apache.maven.DefaultMaven.doExecute (DefaultMaven.java:192)
    at org.apache.maven.DefaultMaven.execute (DefaultMaven.java:105)
    at org.apache.maven.cli.MavenCli.execute (MavenCli.java:954)
    at org.apache.maven.cli.MavenCli.doMain (MavenCli.java:288)
    at org.apache.maven.cli.MavenCli.main (MavenCli.java:192)
    at sun.reflect.NativeMethodAccessorImpl.invoke0 (Native Method)
    at sun.reflect.NativeMethodAccessorImpl.invoke (NativeMethodAccessorImpl.java:62)
    at sun.reflect.DelegatingMethodAccessorImpl.invoke (DelegatingMethodAccessorImpl.java:43)
    at java.lang.reflect.Method.invoke (Method.java:498)
    at org.codehaus.plexus.classworlds.launcher.Launcher.launchEnhanced (Launcher.java:289)
    at org.codehaus.plexus.classworlds.launcher.Launcher.launch (Launcher.java:229)
    at org.codehaus.plexus.classworlds.launcher.Launcher.mainWithExitCode (Launcher.java:415)
    at org.codehaus.plexus.classworlds.launcher.Launcher.main (Launcher.java:356)
Caused by: org.apache.maven.wagon.TransferFailedException: Failed to transfer file: https://maven.aksw.org/archiva/repository/snapshots/net/sansa-stack/sansa-rdf-common_2.12/0.7.2-SNAPSHOT/maven-metadata.xml. Return code is: 502 , ReasonPhrase:Bad Gateway.
    at org.apache.maven.wagon.providers.http.wagon.shared.AbstractHttpClientWagon.fillInputData (AbstractHttpClientWagon.java:1024)
    at org.apache.maven.wagon.providers.http.wagon.shared.AbstractHttpClientWagon.fillInputData (AbstractHttpClientWagon.java:963)
    at org.apache.maven.wagon.StreamWagon.getInputStream (StreamWagon.java:126)
    at org.apache.maven.wagon.StreamWagon.getIfNewer (StreamWagon.java:88)
    at org.apache.maven.wagon.StreamWagon.get (StreamWagon.java:61)
    at org.eclipse.aether.transport.wagon.WagonTransporter$GetTaskRunner.run (WagonTransporter.java:567)
    at org.eclipse.aether.transport.wagon.WagonTransporter.execute (WagonTransporter.java:435)
    at org.eclipse.aether.transport.wagon.WagonTransporter.get (WagonTransporter.java:412)
    at org.eclipse.aether.connector.basic.BasicRepositoryConnector$GetTaskRunner.runTask (BasicRepositoryConnector.java:453)
    at org.eclipse.aether.connector.basic.BasicRepositoryConnector$TaskRunner.run (BasicRepositoryConnector.java:360)
    at org.eclipse.aether.util.concurrency.RunnableErrorForwarder$1.run (RunnableErrorForwarder.java:75)
    at org.eclipse.aether.connector.basic.BasicRepositoryConnector$DirectExecutor.execute (BasicRepositoryConnector.java:583)
    at org.eclipse.aether.connector.basic.BasicRepositoryConnector.get (BasicRepositoryConnector.java:232)
    at org.eclipse.aether.internal.impl.DefaultDeployer.upload (DefaultDeployer.java:395)
    at org.eclipse.aether.internal.impl.DefaultDeployer.deploy (DefaultDeployer.java:268)
    at org.eclipse.aether.internal.impl.DefaultDeployer.deploy (DefaultDeployer.java:223)
    at org.eclipse.aether.internal.impl.DefaultRepositorySystem.deploy (DefaultRepositorySystem.java:384)
    at org.apache.maven.artifact.deployer.DefaultArtifactDeployer.deploy (DefaultArtifactDeployer.java:142)
    at org.apache.maven.plugin.deploy.AbstractDeployMojo.deploy (AbstractDeployMojo.java:167)
    at org.apache.maven.plugin.deploy.DeployMojo.execute (DeployMojo.java:157)
    at org.apache.maven.plugin.DefaultBuildPluginManager.executeMojo (DefaultBuildPluginManager.java:137)
    at org.apache.maven.lifecycle.internal.MojoExecutor.execute (MojoExecutor.java:208)
    at org.apache.maven.lifecycle.internal.MojoExecutor.execute (MojoExecutor.java:154)
    at org.apache.maven.lifecycle.internal.MojoExecutor.execute (MojoExecutor.java:146)
    at org.apache.maven.lifecycle.internal.LifecycleModuleBuilder.buildProject (LifecycleModuleBuilder.java:117)
    at org.apache.maven.lifecycle.internal.LifecycleModuleBuilder.buildProject (LifecycleModuleBuilder.java:81)
    at org.apache.maven.lifecycle.internal.builder.singlethreaded.SingleThreadedBuilder.build (SingleThreadedBuilder.java:56)
    at org.apache.maven.lifecycle.internal.LifecycleStarter.execute (LifecycleStarter.java:128)
    at org.apache.maven.DefaultMaven.doExecute (DefaultMaven.java:305)
    at org.apache.maven.DefaultMaven.doExecute (DefaultMaven.java:192)
    at org.apache.maven.DefaultMaven.execute (DefaultMaven.java:105)
    at org.apache.maven.cli.MavenCli.execute (MavenCli.java:954)
    at org.apache.maven.cli.MavenCli.doMain (MavenCli.java:288)
    at org.apache.maven.cli.MavenCli.main (MavenCli.java:192)
    at sun.reflect.NativeMethodAccessorImpl.invoke0 (Native Method)
    at sun.reflect.NativeMethodAccessorImpl.invoke (NativeMethodAccessorImpl.java:62)
    at sun.reflect.DelegatingMethodAccessorImpl.invoke (DelegatingMethodAccessorImpl.java:43)
    at java.lang.reflect.Method.invoke (Method.java:498)
    at org.codehaus.plexus.classworlds.launcher.Launcher.launchEnhanced (Launcher.java:289)
    at org.codehaus.plexus.classworlds.launcher.Launcher.launch (Launcher.java:229)
    at org.codehaus.plexus.classworlds.launcher.Launcher.mainWithExitCode (Launcher.java:415)
    at org.codehaus.plexus.classworlds.launcher.Launcher.main (Launcher.java:356)
[ERROR] 
[ERROR] Re-run Maven using the -X switch to enable full debug logging.
[ERROR] 
[ERROR] For more information about the errors and possible solutions, please read the following articles:
[ERROR] [Help 1] http://cwiki.apache.org/confluence/display/MAVEN/MojoExecutionException
[ERROR] 
[ERROR] After correcting the problems, you can resume the build with the command
[ERROR]   mvn <goals> -rf :sansa-rdf-common_2.12
[Pipeline] }
[Pipeline] // withEnv
[Pipeline] }
[Pipeline] // stage
[Pipeline] }
[Pipeline] // withEnv
[Pipeline] }
[Pipeline] // withEnv
[Pipeline] }
[Pipeline] // withEnv
[Pipeline] }
[Pipeline] // node
[Pipeline] End of Pipeline

GitHub has been notified of this commit’s build result

ERROR: script returned exit code 1
Finished: FAILURE