FailedConsole Output

Started by GitHub push by Aklakan
Running as SYSTEM
Building on master in workspace /usr/share/tomcat8/.jenkins/jobs/Sparqlify/workspace
No credentials specified
 > git rev-parse --is-inside-work-tree # timeout=10
Fetching changes from the remote Git repository
 > git config remote.origin.url git://github.com/SmartDataAnalytics/Sparqlify.git # timeout=10
Fetching upstream changes from git://github.com/SmartDataAnalytics/Sparqlify.git
 > git --version # timeout=10
 > git fetch --tags --progress -- git://github.com/SmartDataAnalytics/Sparqlify.git +refs/heads/*:refs/remotes/origin/* # timeout=10
 > git rev-parse origin/develop^{commit} # timeout=10
Checking out Revision b6ed6318a400f83d6146ef4d1b1b63410dc1b5ba (origin/develop)
 > git config core.sparsecheckout # timeout=10
 > git checkout -f b6ed6318a400f83d6146ef4d1b1b63410dc1b5ba # timeout=10
Commit message: "Migrated sparqlify result set adapter to jena's latest approacho"
 > git rev-list --no-walk 474f706bd82085f2eadd04878fe116f713c09126 # timeout=10
Parsing POMs
Modules changed, recalculating dependency graph
Established TCP socket on 37601
[workspace] $ /usr/lib/jvm/java-11-openjdk-amd64/bin/java -Xmx2048m -Xss512m -cp /usr/share/tomcat8/.jenkins/plugins/maven-plugin/WEB-INF/lib/maven35-agent-1.13.jar:/opt/maven/boot/plexus-classworlds-2.6.0.jar:/opt/maven/conf/logging jenkins.maven3.agent.Maven35Main /opt/maven /var/lib/tomcat8/webapps/jenkins/WEB-INF/lib/remoting-4.3.jar /usr/share/tomcat8/.jenkins/plugins/maven-plugin/WEB-INF/lib/maven35-interceptor-1.13.jar /usr/share/tomcat8/.jenkins/plugins/maven-plugin/WEB-INF/lib/maven3-interceptor-commons-1.13.jar 37601
NOTE: Picked up JDK_JAVA_OPTIONS:  --add-opens=java.base/java.lang=ALL-UNNAMED --add-opens=java.base/java.io=ALL-UNNAMED --add-opens=java.rmi/sun.rmi.transport=ALL-UNNAMED
<===[JENKINS REMOTING CAPACITY]===>channel started
Executing Maven:  -B -f /usr/share/tomcat8/.jenkins/jobs/Sparqlify/workspace/pom.xml -U -B -e clean install
[INFO] Error stacktraces are turned on.
[INFO] Scanning for projects...
[INFO] Inspecting build with total of 20 modules...
[INFO] Installing Nexus Staging features:
[INFO]   ... total of 6 executions of maven-deploy-plugin replaced with nexus-staging-maven-plugin
[INFO] ------------------------------------------------------------------------
[INFO] Reactor Build Order:
[INFO] 
[INFO] Sparqlify SPARQL->SQL rewriter - Parent                            [pom]
[INFO] obda-api-parent                                                    [pom]
[INFO] obda-api-core                                                      [jar]
[INFO] obda-api-r2rml                                                     [jar]
[INFO] obda-api-sml                                                       [jar]
[INFO] obda-api-bundle                                                    [jar]
[INFO] Sparqlify SPARQL->SQL rewriter - Type System                       [jar]
[INFO] Sparqlify SPARQL->SQL rewriter - Tests                             [jar]
[INFO] Sparqlify SPARQL->SQL rewriter - Core                              [jar]
[INFO] obda-api-examples                                                  [jar]
[INFO] Sparqlify SPARQL->SQL rewriter - Cli                               [jar]
[INFO] Sparqlify SPARQL->SQL rewriter - Platform                          [war]
[INFO] Sparqlify SPARQL->SQL rewriter - Tests                             [jar]
[INFO] Sparqlify SPARQL->SQL rewriter - JPA Mapper                        [jar]
[INFO] Sparqlify SPARQL->SQL rewriter - Web Admin Server                  [war]
[INFO] Sparqlify - Debian Packaging - Cli                                 [jar]
[INFO] Sparqlify - Debian Packaging - Tomcat Common                       [war]
[INFO] Sparqlify - Debian Packaging - Tomcat7                             [jar]
[INFO] Sparqlify - Debian Packaging - Tomcat8                             [jar]
[INFO] Sparqlify - Nexus Deploy Workaround                                [jar]
[INFO] 
[INFO] ----------------< org.aksw.sparqlify:sparqlify-parent >-----------------
[INFO] Building Sparqlify SPARQL->SQL rewriter - Parent 0.9.1-SNAPSHOT   [1/20]
[INFO] --------------------------------[ pom ]---------------------------------
[INFO] 
[INFO] --- maven-clean-plugin:2.5:clean (default-clean) @ sparqlify-parent ---
[INFO] 
[INFO] --- maven-javadoc-plugin:2.9.1:jar (attach-javadocs) @ sparqlify-parent ---
[INFO] Not executing Javadoc as the project is not a Java classpath-capable package
[INFO] 
[INFO] --- maven-source-plugin:3.0.1:jar-no-fork (attach-sources) @ sparqlify-parent ---
[INFO] 
[INFO] --- tattletale-maven:1.1.0.Final:report (default) @ sparqlify-parent ---
[INFO] Scanning: /usr/share/tomcat8/.jenkins/jobs/Sparqlify/workspace/target/sparqlify-parent-0.9.1-SNAPSHOT/WEB-INF/lib
[INFO] 
[INFO] --- maven-install-plugin:2.4:install (default-install) @ sparqlify-parent ---
[INFO] Installing /usr/share/tomcat8/.jenkins/jobs/Sparqlify/workspace/pom.xml to /usr/share/tomcat8/.m2/repository/org/aksw/sparqlify/sparqlify-parent/0.9.1-SNAPSHOT/sparqlify-parent-0.9.1-SNAPSHOT.pom
[INFO] 
[INFO] -----------------< org.aksw.sparqlify:obda-api-parent >-----------------
[INFO] Building obda-api-parent 0.9.1-SNAPSHOT                           [2/20]
[INFO] --------------------------------[ pom ]---------------------------------
[INFO] 
[INFO] --- maven-clean-plugin:2.5:clean (default-clean) @ obda-api-parent ---
[INFO] 
[INFO] --- maven-javadoc-plugin:2.9.1:jar (attach-javadocs) @ obda-api-parent ---
[INFO] Not executing Javadoc as the project is not a Java classpath-capable package
[INFO] 
[INFO] --- maven-source-plugin:3.0.1:jar-no-fork (attach-sources) @ obda-api-parent ---
[INFO] 
[INFO] --- tattletale-maven:1.1.0.Final:report (default) @ obda-api-parent ---
[INFO] Scanning: /usr/share/tomcat8/.jenkins/jobs/Sparqlify/workspace/obda-api-parent/target/obda-api-parent-0.9.1-SNAPSHOT/WEB-INF/lib
[INFO] 
[INFO] --- maven-install-plugin:2.4:install (default-install) @ obda-api-parent ---
[INFO] Installing /usr/share/tomcat8/.jenkins/jobs/Sparqlify/workspace/obda-api-parent/pom.xml to /usr/share/tomcat8/.m2/repository/org/aksw/sparqlify/obda-api-parent/0.9.1-SNAPSHOT/obda-api-parent-0.9.1-SNAPSHOT.pom
[INFO] 
[INFO] ------------------< org.aksw.sparqlify:obda-api-core >------------------
[INFO] Building obda-api-core 0.9.1-SNAPSHOT                             [3/20]
[INFO] --------------------------------[ jar ]---------------------------------
[INFO] Downloading from maven.aksw.snapshots: https://maven.aksw.org/repository/snapshots/org/aksw/jenax/jenax-arq-algebra/4.3.0-1-SNAPSHOT/maven-metadata.xml
[INFO] Downloading from maven.aksw.internal: https://maven.aksw.org/repository/internal/org/aksw/jenax/jenax-arq-algebra/4.3.0-1-SNAPSHOT/maven-metadata.xml
[INFO] Downloaded from maven.aksw.snapshots: https://maven.aksw.org/repository/snapshots/org/aksw/jenax/jenax-arq-algebra/4.3.0-1-SNAPSHOT/maven-metadata.xml (371 B at 1.4 kB/s)
[INFO] Downloading from maven.aksw.internal: https://maven.aksw.org/repository/internal/org/aksw/jenax/jenax-arq-parent/4.3.0-1-SNAPSHOT/maven-metadata.xml
[INFO] Downloading from maven.aksw.snapshots: https://maven.aksw.org/repository/snapshots/org/aksw/jenax/jenax-arq-parent/4.3.0-1-SNAPSHOT/maven-metadata.xml
[INFO] Downloaded from maven.aksw.snapshots: https://maven.aksw.org/repository/snapshots/org/aksw/jenax/jenax-arq-parent/4.3.0-1-SNAPSHOT/maven-metadata.xml (370 B at 31 kB/s)
[INFO] Downloading from maven.aksw.internal: https://maven.aksw.org/repository/internal/org/aksw/jenax/jenax-parent/4.3.0-1-SNAPSHOT/maven-metadata.xml
[INFO] Downloading from maven.aksw.snapshots: https://maven.aksw.org/repository/snapshots/org/aksw/jenax/jenax-parent/4.3.0-1-SNAPSHOT/maven-metadata.xml
[INFO] Downloaded from maven.aksw.snapshots: https://maven.aksw.org/repository/snapshots/org/aksw/jenax/jenax-parent/4.3.0-1-SNAPSHOT/maven-metadata.xml (366 B at 33 kB/s)
[INFO] Downloading from maven.aksw.internal: https://maven.aksw.org/repository/internal/org/aksw/commons/subgraph-isomorphism-index-jena/1.5.1-1-SNAPSHOT/maven-metadata.xml
[INFO] Downloading from maven.aksw.snapshots: https://maven.aksw.org/repository/snapshots/org/aksw/commons/subgraph-isomorphism-index-jena/1.5.1-1-SNAPSHOT/maven-metadata.xml
[INFO] Downloaded from maven.aksw.snapshots: https://maven.aksw.org/repository/snapshots/org/aksw/commons/subgraph-isomorphism-index-jena/1.5.1-1-SNAPSHOT/maven-metadata.xml (386 B at 35 kB/s)
[INFO] Downloading from maven.aksw.internal: https://maven.aksw.org/repository/internal/org/aksw/commons/subgraph-isomorphism-index-parent/1.5.1-1-SNAPSHOT/maven-metadata.xml
[INFO] Downloading from maven.aksw.snapshots: https://maven.aksw.org/repository/snapshots/org/aksw/commons/subgraph-isomorphism-index-parent/1.5.1-1-SNAPSHOT/maven-metadata.xml
[INFO] Downloaded from maven.aksw.snapshots: https://maven.aksw.org/repository/snapshots/org/aksw/commons/subgraph-isomorphism-index-parent/1.5.1-1-SNAPSHOT/maven-metadata.xml (388 B at 35 kB/s)
[INFO] Downloading from maven.aksw.internal: https://maven.aksw.org/repository/internal/org/aksw/commons/jena-jgrapht-bindings/1.5.1-1-SNAPSHOT/maven-metadata.xml
[INFO] Downloading from maven.aksw.snapshots: https://maven.aksw.org/repository/snapshots/org/aksw/commons/jena-jgrapht-bindings/1.5.1-1-SNAPSHOT/maven-metadata.xml
[INFO] Downloading from maven-default-http-blocker: http://0.0.0.0/org/aksw/commons/jena-jgrapht-bindings/1.5.1-1-SNAPSHOT/maven-metadata.xml
[INFO] Downloaded from maven.aksw.snapshots: https://maven.aksw.org/repository/snapshots/org/aksw/commons/jena-jgrapht-bindings/1.5.1-1-SNAPSHOT/maven-metadata.xml (376 B at 34 kB/s)
[WARNING] Could not transfer metadata org.aksw.commons:jena-jgrapht-bindings:1.5.1-1-SNAPSHOT/maven-metadata.xml from/to maven-default-http-blocker (http://0.0.0.0/): transfer failed for http://0.0.0.0/org/aksw/commons/jena-jgrapht-bindings/1.5.1-1-SNAPSHOT/maven-metadata.xml
[WARNING] org.aksw.commons:jena-jgrapht-bindings:1.5.1-1-SNAPSHOT/maven-metadata.xmlfailed to transfer from http://0.0.0.0/ during a previous attempt. This failure was cached in the local repository and resolution will not be reattempted until the update interval of maven-default-http-blocker has elapsed or updates are forced. Original error: Could not transfer metadata org.aksw.commons:jena-jgrapht-bindings:1.5.1-1-SNAPSHOT/maven-metadata.xml from/to maven-default-http-blocker (http://0.0.0.0/): transfer failed for http://0.0.0.0/org/aksw/commons/jena-jgrapht-bindings/1.5.1-1-SNAPSHOT/maven-metadata.xml
[INFO] Downloading from maven.aksw.internal: https://maven.aksw.org/repository/internal/org/apache/jena/jena-arq/4.3.0-SNAPSHOT/maven-metadata.xml
[INFO] Downloading from maven.aksw.snapshots: https://maven.aksw.org/repository/snapshots/org/apache/jena/jena-arq/4.3.0-SNAPSHOT/maven-metadata.xml
[INFO] Downloading from maven-default-http-blocker: http://0.0.0.0/org/apache/jena/jena-arq/4.3.0-SNAPSHOT/maven-metadata.xml
[WARNING] Could not transfer metadata org.apache.jena:jena-arq:4.3.0-SNAPSHOT/maven-metadata.xml from/to maven-default-http-blocker (http://0.0.0.0/): transfer failed for http://0.0.0.0/org/apache/jena/jena-arq/4.3.0-SNAPSHOT/maven-metadata.xml
[WARNING] org.apache.jena:jena-arq:4.3.0-SNAPSHOT/maven-metadata.xmlfailed to transfer from http://0.0.0.0/ during a previous attempt. This failure was cached in the local repository and resolution will not be reattempted until the update interval of maven-default-http-blocker has elapsed or updates are forced. Original error: Could not transfer metadata org.apache.jena:jena-arq:4.3.0-SNAPSHOT/maven-metadata.xml from/to maven-default-http-blocker (http://0.0.0.0/): transfer failed for http://0.0.0.0/org/apache/jena/jena-arq/4.3.0-SNAPSHOT/maven-metadata.xml
[INFO] Downloading from maven.aksw.internal: https://maven.aksw.org/repository/internal/org/apache/jena/jena-arq/4.3.0-SNAPSHOT/jena-arq-4.3.0-SNAPSHOT.pom
[INFO] Downloading from maven.aksw.snapshots: https://maven.aksw.org/repository/snapshots/org/apache/jena/jena-arq/4.3.0-SNAPSHOT/jena-arq-4.3.0-SNAPSHOT.pom
[INFO] Downloading from maven.aksw.snapshots: https://maven.aksw.org/repository/snapshots/org/aksw/commons/subgraph-isomorphism-index-jgrapht/1.5.1-1-SNAPSHOT/maven-metadata.xml
[INFO] Downloading from maven.aksw.internal: https://maven.aksw.org/repository/internal/org/aksw/commons/subgraph-isomorphism-index-jgrapht/1.5.1-1-SNAPSHOT/maven-metadata.xml
[INFO] Downloading from maven-default-http-blocker: http://0.0.0.0/org/aksw/commons/subgraph-isomorphism-index-jgrapht/1.5.1-1-SNAPSHOT/maven-metadata.xml
[INFO] Downloaded from maven.aksw.snapshots: https://maven.aksw.org/repository/snapshots/org/aksw/commons/subgraph-isomorphism-index-jgrapht/1.5.1-1-SNAPSHOT/maven-metadata.xml (389 B at 32 kB/s)
[WARNING] Could not transfer metadata org.aksw.commons:subgraph-isomorphism-index-jgrapht:1.5.1-1-SNAPSHOT/maven-metadata.xml from/to maven-default-http-blocker (http://0.0.0.0/): transfer failed for http://0.0.0.0/org/aksw/commons/subgraph-isomorphism-index-jgrapht/1.5.1-1-SNAPSHOT/maven-metadata.xml
[WARNING] org.aksw.commons:subgraph-isomorphism-index-jgrapht:1.5.1-1-SNAPSHOT/maven-metadata.xmlfailed to transfer from http://0.0.0.0/ during a previous attempt. This failure was cached in the local repository and resolution will not be reattempted until the update interval of maven-default-http-blocker has elapsed or updates are forced. Original error: Could not transfer metadata org.aksw.commons:subgraph-isomorphism-index-jgrapht:1.5.1-1-SNAPSHOT/maven-metadata.xml from/to maven-default-http-blocker (http://0.0.0.0/): transfer failed for http://0.0.0.0/org/aksw/commons/subgraph-isomorphism-index-jgrapht/1.5.1-1-SNAPSHOT/maven-metadata.xml
[INFO] Downloading from maven.aksw.internal: https://maven.aksw.org/repository/internal/org/aksw/commons/subgraph-isomorphism-index-core/1.5.1-1-SNAPSHOT/maven-metadata.xml
[INFO] Downloading from maven.aksw.snapshots: https://maven.aksw.org/repository/snapshots/org/aksw/commons/subgraph-isomorphism-index-core/1.5.1-1-SNAPSHOT/maven-metadata.xml
[INFO] Downloading from maven-default-http-blocker: http://0.0.0.0/org/aksw/commons/subgraph-isomorphism-index-core/1.5.1-1-SNAPSHOT/maven-metadata.xml
[INFO] Downloaded from maven.aksw.snapshots: https://maven.aksw.org/repository/snapshots/org/aksw/commons/subgraph-isomorphism-index-core/1.5.1-1-SNAPSHOT/maven-metadata.xml (386 B at 39 kB/s)
[WARNING] Could not transfer metadata org.aksw.commons:subgraph-isomorphism-index-core:1.5.1-1-SNAPSHOT/maven-metadata.xml from/to maven-default-http-blocker (http://0.0.0.0/): transfer failed for http://0.0.0.0/org/aksw/commons/subgraph-isomorphism-index-core/1.5.1-1-SNAPSHOT/maven-metadata.xml
[WARNING] org.aksw.commons:subgraph-isomorphism-index-core:1.5.1-1-SNAPSHOT/maven-metadata.xmlfailed to transfer from http://0.0.0.0/ during a previous attempt. This failure was cached in the local repository and resolution will not be reattempted until the update interval of maven-default-http-blocker has elapsed or updates are forced. Original error: Could not transfer metadata org.aksw.commons:subgraph-isomorphism-index-core:1.5.1-1-SNAPSHOT/maven-metadata.xml from/to maven-default-http-blocker (http://0.0.0.0/): transfer failed for http://0.0.0.0/org/aksw/commons/subgraph-isomorphism-index-core/1.5.1-1-SNAPSHOT/maven-metadata.xml
[INFO] Downloading from maven.aksw.internal: https://maven.aksw.org/repository/internal/org/aksw/jenax/jenax-arq-propertypaths/4.3.0-1-SNAPSHOT/maven-metadata.xml
[INFO] Downloading from maven.aksw.snapshots: https://maven.aksw.org/repository/snapshots/org/aksw/jenax/jenax-arq-propertypaths/4.3.0-1-SNAPSHOT/maven-metadata.xml
[INFO] Downloaded from maven.aksw.snapshots: https://maven.aksw.org/repository/snapshots/org/aksw/jenax/jenax-arq-propertypaths/4.3.0-1-SNAPSHOT/maven-metadata.xml (377 B at 38 kB/s)
[INFO] Downloading from maven.aksw.snapshots: https://maven.aksw.org/repository/snapshots/org/aksw/jenax/jenax-arq-utils/4.3.0-1-SNAPSHOT/maven-metadata.xml
[INFO] Downloading from maven.aksw.internal: https://maven.aksw.org/repository/internal/org/aksw/jenax/jenax-arq-utils/4.3.0-1-SNAPSHOT/maven-metadata.xml
[INFO] Downloaded from maven.aksw.snapshots: https://maven.aksw.org/repository/snapshots/org/aksw/jenax/jenax-arq-utils/4.3.0-1-SNAPSHOT/maven-metadata.xml (369 B at 28 kB/s)
[INFO] Downloading from maven.aksw.internal: https://maven.aksw.org/repository/internal/org/aksw/commons/aksw-commons-utils/0.9.1-SNAPSHOT/maven-metadata.xml
[INFO] Downloading from maven.aksw.snapshots: https://maven.aksw.org/repository/snapshots/org/aksw/commons/aksw-commons-utils/0.9.1-SNAPSHOT/maven-metadata.xml
[INFO] Downloaded from maven.aksw.snapshots: https://maven.aksw.org/repository/snapshots/org/aksw/commons/aksw-commons-utils/0.9.1-SNAPSHOT/maven-metadata.xml (372 B at 34 kB/s)
[INFO] Downloading from maven.aksw.internal: https://maven.aksw.org/repository/internal/org/aksw/commons/aksw-commons-parent/0.9.1-SNAPSHOT/maven-metadata.xml
[INFO] Downloading from maven.aksw.snapshots: https://maven.aksw.org/repository/snapshots/org/aksw/commons/aksw-commons-parent/0.9.1-SNAPSHOT/maven-metadata.xml
[INFO] Downloaded from maven.aksw.snapshots: https://maven.aksw.org/repository/snapshots/org/aksw/commons/aksw-commons-parent/0.9.1-SNAPSHOT/maven-metadata.xml (373 B at 37 kB/s)
[INFO] Downloading from maven.aksw.internal: https://maven.aksw.org/repository/internal/org/aksw/commons/aksw-commons-collections/0.9.1-SNAPSHOT/maven-metadata.xml
[INFO] Downloading from maven.aksw.snapshots: https://maven.aksw.org/repository/snapshots/org/aksw/commons/aksw-commons-collections/0.9.1-SNAPSHOT/maven-metadata.xml
[INFO] Downloaded from maven.aksw.snapshots: https://maven.aksw.org/repository/snapshots/org/aksw/commons/aksw-commons-collections/0.9.1-SNAPSHOT/maven-metadata.xml (378 B at 34 kB/s)
[INFO] Downloading from maven.aksw.internal: https://maven.aksw.org/repository/internal/org/aksw/jenax/jenax-arq-relations/4.3.0-1-SNAPSHOT/maven-metadata.xml
[INFO] Downloading from maven.aksw.snapshots: https://maven.aksw.org/repository/snapshots/org/aksw/jenax/jenax-arq-relations/4.3.0-1-SNAPSHOT/maven-metadata.xml
[INFO] Downloaded from maven.aksw.snapshots: https://maven.aksw.org/repository/snapshots/org/aksw/jenax/jenax-arq-relations/4.3.0-1-SNAPSHOT/maven-metadata.xml (373 B at 37 kB/s)
[INFO] Downloading from maven.aksw.internal: https://maven.aksw.org/repository/internal/org/aksw/jenax/jenax-arq-stmt/4.3.0-1-SNAPSHOT/maven-metadata.xml
[INFO] Downloading from maven.aksw.snapshots: https://maven.aksw.org/repository/snapshots/org/aksw/jenax/jenax-arq-stmt/4.3.0-1-SNAPSHOT/maven-metadata.xml
[INFO] Downloaded from maven.aksw.snapshots: https://maven.aksw.org/repository/snapshots/org/aksw/jenax/jenax-arq-stmt/4.3.0-1-SNAPSHOT/maven-metadata.xml (368 B at 37 kB/s)
[INFO] Downloading from maven.aksw.internal: https://maven.aksw.org/repository/internal/org/aksw/jenax/jenax-resources-prefixes/4.3.0-1-SNAPSHOT/maven-metadata.xml
[INFO] Downloading from maven.aksw.snapshots: https://maven.aksw.org/repository/snapshots/org/aksw/jenax/jenax-resources-prefixes/4.3.0-1-SNAPSHOT/maven-metadata.xml
[INFO] Downloaded from maven.aksw.snapshots: https://maven.aksw.org/repository/snapshots/org/aksw/jenax/jenax-resources-prefixes/4.3.0-1-SNAPSHOT/maven-metadata.xml (378 B at 38 kB/s)
[INFO] Downloading from maven.aksw.internal: https://maven.aksw.org/repository/internal/org/aksw/jenax/jenax-resources-parent/4.3.0-1-SNAPSHOT/maven-metadata.xml
[INFO] Downloading from maven.aksw.snapshots: https://maven.aksw.org/repository/snapshots/org/aksw/jenax/jenax-resources-parent/4.3.0-1-SNAPSHOT/maven-metadata.xml
[INFO] Downloaded from maven.aksw.snapshots: https://maven.aksw.org/repository/snapshots/org/aksw/jenax/jenax-resources-parent/4.3.0-1-SNAPSHOT/maven-metadata.xml (376 B at 38 kB/s)
[INFO] Downloading from maven.aksw.internal: https://maven.aksw.org/repository/internal/org/apache/jena/jena-rdfconnection/4.3.0-SNAPSHOT/maven-metadata.xml
[INFO] Downloading from maven.aksw.snapshots: https://maven.aksw.org/repository/snapshots/org/apache/jena/jena-rdfconnection/4.3.0-SNAPSHOT/maven-metadata.xml
[INFO] Downloading from maven.aksw.internal: https://maven.aksw.org/repository/internal/org/apache/jena/jena-rdfconnection/4.3.0-SNAPSHOT/jena-rdfconnection-4.3.0-SNAPSHOT.pom
[INFO] Downloading from maven.aksw.snapshots: https://maven.aksw.org/repository/snapshots/org/apache/jena/jena-rdfconnection/4.3.0-SNAPSHOT/jena-rdfconnection-4.3.0-SNAPSHOT.pom
[WARNING] The POM for org.apache.jena:jena-rdfconnection:jar:4.3.0-SNAPSHOT is missing, no dependency information available
[INFO] Downloading from maven.aksw.internal: https://maven.aksw.org/repository/internal/org/aksw/jenax/jenax-arq-udf/4.3.0-1-SNAPSHOT/maven-metadata.xml
[INFO] Downloading from maven.aksw.snapshots: https://maven.aksw.org/repository/snapshots/org/aksw/jenax/jenax-arq-udf/4.3.0-1-SNAPSHOT/maven-metadata.xml
[INFO] Downloaded from maven.aksw.snapshots: https://maven.aksw.org/repository/snapshots/org/aksw/jenax/jenax-arq-udf/4.3.0-1-SNAPSHOT/maven-metadata.xml (367 B at 37 kB/s)
[INFO] Downloading from maven.aksw.internal: https://maven.aksw.org/repository/internal/org/aksw/jenax/jenax-reprogen-core/4.3.0-1-SNAPSHOT/maven-metadata.xml
[INFO] Downloading from maven.aksw.snapshots: https://maven.aksw.org/repository/snapshots/org/aksw/jenax/jenax-reprogen-core/4.3.0-1-SNAPSHOT/maven-metadata.xml
[INFO] Downloaded from maven.aksw.snapshots: https://maven.aksw.org/repository/snapshots/org/aksw/jenax/jenax-reprogen-core/4.3.0-1-SNAPSHOT/maven-metadata.xml (373 B at 37 kB/s)
[INFO] Downloading from maven.aksw.internal: https://maven.aksw.org/repository/internal/org/aksw/jenax/jenax-reprogen-parent/4.3.0-1-SNAPSHOT/maven-metadata.xml
[INFO] Downloading from maven.aksw.snapshots: https://maven.aksw.org/repository/snapshots/org/aksw/jenax/jenax-reprogen-parent/4.3.0-1-SNAPSHOT/maven-metadata.xml
[INFO] Downloaded from maven.aksw.snapshots: https://maven.aksw.org/repository/snapshots/org/aksw/jenax/jenax-reprogen-parent/4.3.0-1-SNAPSHOT/maven-metadata.xml (375 B at 38 kB/s)
[INFO] Downloading from maven.aksw.internal: https://maven.aksw.org/repository/internal/org/aksw/commons/aksw-commons-beans/0.9.1-SNAPSHOT/maven-metadata.xml
[INFO] Downloading from maven.aksw.snapshots: https://maven.aksw.org/repository/snapshots/org/aksw/commons/aksw-commons-beans/0.9.1-SNAPSHOT/maven-metadata.xml
[INFO] Downloaded from maven.aksw.snapshots: https://maven.aksw.org/repository/snapshots/org/aksw/commons/aksw-commons-beans/0.9.1-SNAPSHOT/maven-metadata.xml (372 B at 37 kB/s)
[INFO] Downloading from maven.aksw.internal: https://maven.aksw.org/repository/internal/org/aksw/jenax/jenax-arq-collections/4.3.0-1-SNAPSHOT/maven-metadata.xml
[INFO] Downloading from maven.aksw.snapshots: https://maven.aksw.org/repository/snapshots/org/aksw/jenax/jenax-arq-collections/4.3.0-1-SNAPSHOT/maven-metadata.xml
[INFO] Downloaded from maven.aksw.snapshots: https://maven.aksw.org/repository/snapshots/org/aksw/jenax/jenax-arq-collections/4.3.0-1-SNAPSHOT/maven-metadata.xml (375 B at 38 kB/s)
[INFO] Downloading from maven.aksw.internal: https://maven.aksw.org/repository/internal/org/aksw/commons/aksw-commons-lambdas-serializable/0.9.1-SNAPSHOT/maven-metadata.xml
[INFO] Downloading from maven.aksw.snapshots: https://maven.aksw.org/repository/snapshots/org/aksw/commons/aksw-commons-lambdas-serializable/0.9.1-SNAPSHOT/maven-metadata.xml
[INFO] Downloaded from maven.aksw.snapshots: https://maven.aksw.org/repository/snapshots/org/aksw/commons/aksw-commons-lambdas-serializable/0.9.1-SNAPSHOT/maven-metadata.xml (387 B at 39 kB/s)
[INFO] Downloading from maven.aksw.internal: https://maven.aksw.org/repository/internal/org/aksw/commons/aksw-commons-lambdas-parent/0.9.1-SNAPSHOT/maven-metadata.xml
[INFO] Downloading from maven.aksw.snapshots: https://maven.aksw.org/repository/snapshots/org/aksw/commons/aksw-commons-lambdas-parent/0.9.1-SNAPSHOT/maven-metadata.xml
[INFO] Downloaded from maven.aksw.snapshots: https://maven.aksw.org/repository/snapshots/org/aksw/commons/aksw-commons-lambdas-parent/0.9.1-SNAPSHOT/maven-metadata.xml (381 B at 38 kB/s)
[INFO] Downloading from maven.aksw.internal: https://maven.aksw.org/repository/internal/org/aksw/jenax/jenax-annotations-reprogen/4.3.0-1-SNAPSHOT/maven-metadata.xml
[INFO] Downloading from maven.aksw.snapshots: https://maven.aksw.org/repository/snapshots/org/aksw/jenax/jenax-annotations-reprogen/4.3.0-1-SNAPSHOT/maven-metadata.xml
[INFO] Downloaded from maven.aksw.snapshots: https://maven.aksw.org/repository/snapshots/org/aksw/jenax/jenax-annotations-reprogen/4.3.0-1-SNAPSHOT/maven-metadata.xml (380 B at 38 kB/s)
[INFO] Downloading from maven.aksw.internal: https://maven.aksw.org/repository/internal/org/aksw/jenax/jenax-annotations-parent/4.3.0-1-SNAPSHOT/maven-metadata.xml
[INFO] Downloading from maven.aksw.snapshots: https://maven.aksw.org/repository/snapshots/org/aksw/jenax/jenax-annotations-parent/4.3.0-1-SNAPSHOT/maven-metadata.xml
[INFO] Downloaded from maven.aksw.snapshots: https://maven.aksw.org/repository/snapshots/org/aksw/jenax/jenax-annotations-parent/4.3.0-1-SNAPSHOT/maven-metadata.xml (378 B at 42 kB/s)
[INFO] Downloading from maven.aksw.internal: https://maven.aksw.org/repository/internal/org/aksw/jenax/jenax-reprogen-shared/4.3.0-1-SNAPSHOT/maven-metadata.xml
[INFO] Downloading from maven.aksw.snapshots: https://maven.aksw.org/repository/snapshots/org/aksw/jenax/jenax-reprogen-shared/4.3.0-1-SNAPSHOT/maven-metadata.xml
[INFO] Downloaded from maven.aksw.snapshots: https://maven.aksw.org/repository/snapshots/org/aksw/jenax/jenax-reprogen-shared/4.3.0-1-SNAPSHOT/maven-metadata.xml (375 B at 42 kB/s)
[INFO] Downloading from maven.aksw.internal: https://maven.aksw.org/repository/internal/org/aksw/jenax/jenax-arq-rx/4.3.0-1-SNAPSHOT/maven-metadata.xml
[INFO] Downloading from maven.aksw.snapshots: https://maven.aksw.org/repository/snapshots/org/aksw/jenax/jenax-arq-rx/4.3.0-1-SNAPSHOT/maven-metadata.xml
[INFO] Downloaded from maven.aksw.snapshots: https://maven.aksw.org/repository/snapshots/org/aksw/jenax/jenax-arq-rx/4.3.0-1-SNAPSHOT/maven-metadata.xml (366 B at 41 kB/s)
[INFO] Downloading from maven.aksw.internal: https://maven.aksw.org/repository/internal/org/aksw/jenax/jenax-arq-connection-core/4.3.0-1-SNAPSHOT/maven-metadata.xml
[INFO] Downloading from maven.aksw.snapshots: https://maven.aksw.org/repository/snapshots/org/aksw/jenax/jenax-arq-connection-core/4.3.0-1-SNAPSHOT/maven-metadata.xml
[INFO] Downloaded from maven.aksw.snapshots: https://maven.aksw.org/repository/snapshots/org/aksw/jenax/jenax-arq-connection-core/4.3.0-1-SNAPSHOT/maven-metadata.xml (379 B at 38 kB/s)
[INFO] Downloading from maven.aksw.internal: https://maven.aksw.org/repository/internal/org/aksw/jenax/jenax-arq-connection-parent/4.3.0-1-SNAPSHOT/maven-metadata.xml
[INFO] Downloading from maven.aksw.snapshots: https://maven.aksw.org/repository/snapshots/org/aksw/jenax/jenax-arq-connection-parent/4.3.0-1-SNAPSHOT/maven-metadata.xml
[INFO] Downloaded from maven.aksw.snapshots: https://maven.aksw.org/repository/snapshots/org/aksw/jenax/jenax-arq-connection-parent/4.3.0-1-SNAPSHOT/maven-metadata.xml (381 B at 38 kB/s)
[INFO] Downloading from maven.aksw.internal: https://maven.aksw.org/repository/internal/org/aksw/jenax/jenax-arq-aggregators/4.3.0-1-SNAPSHOT/maven-metadata.xml
[INFO] Downloading from maven.aksw.snapshots: https://maven.aksw.org/repository/snapshots/org/aksw/jenax/jenax-arq-aggregators/4.3.0-1-SNAPSHOT/maven-metadata.xml
[INFO] Downloaded from maven.aksw.snapshots: https://maven.aksw.org/repository/snapshots/org/aksw/jenax/jenax-arq-aggregators/4.3.0-1-SNAPSHOT/maven-metadata.xml (375 B at 38 kB/s)
[INFO] Downloading from maven.aksw.internal: https://maven.aksw.org/repository/internal/org/aksw/commons/aksw-commons-collectors/0.9.1-SNAPSHOT/maven-metadata.xml
[INFO] Downloading from maven.aksw.snapshots: https://maven.aksw.org/repository/snapshots/org/aksw/commons/aksw-commons-collectors/0.9.1-SNAPSHOT/maven-metadata.xml
[INFO] Downloaded from maven.aksw.snapshots: https://maven.aksw.org/repository/snapshots/org/aksw/commons/aksw-commons-collectors/0.9.1-SNAPSHOT/maven-metadata.xml (377 B at 38 kB/s)
[INFO] Downloading from maven.aksw.internal: https://maven.aksw.org/repository/internal/org/aksw/jenax/jenax-arq-rdfterm/4.3.0-1-SNAPSHOT/maven-metadata.xml
[INFO] Downloading from maven.aksw.snapshots: https://maven.aksw.org/repository/snapshots/org/aksw/jenax/jenax-arq-rdfterm/4.3.0-1-SNAPSHOT/maven-metadata.xml
[INFO] Downloaded from maven.aksw.snapshots: https://maven.aksw.org/repository/snapshots/org/aksw/jenax/jenax-arq-rdfterm/4.3.0-1-SNAPSHOT/maven-metadata.xml (371 B at 41 kB/s)
[INFO] Downloading from maven.aksw.internal: https://maven.aksw.org/repository/internal/org/aksw/jenax/jenax-arq-functions/4.3.0-1-SNAPSHOT/maven-metadata.xml
[INFO] Downloading from maven.aksw.snapshots: https://maven.aksw.org/repository/snapshots/org/aksw/jenax/jenax-arq-functions/4.3.0-1-SNAPSHOT/maven-metadata.xml
[INFO] Downloaded from maven.aksw.snapshots: https://maven.aksw.org/repository/snapshots/org/aksw/jenax/jenax-arq-functions/4.3.0-1-SNAPSHOT/maven-metadata.xml (373 B at 41 kB/s)
[INFO] Downloading from maven.aksw.internal: https://maven.aksw.org/repository/internal/org/aksw/jenax/jenax-arq-datasets-orderaware/4.3.0-1-SNAPSHOT/maven-metadata.xml
[INFO] Downloading from maven.aksw.snapshots: https://maven.aksw.org/repository/snapshots/org/aksw/jenax/jenax-arq-datasets-orderaware/4.3.0-1-SNAPSHOT/maven-metadata.xml
[INFO] Downloaded from maven.aksw.snapshots: https://maven.aksw.org/repository/snapshots/org/aksw/jenax/jenax-arq-datasets-orderaware/4.3.0-1-SNAPSHOT/maven-metadata.xml (383 B at 38 kB/s)
[INFO] Downloading from maven.aksw.internal: https://maven.aksw.org/repository/internal/org/aksw/jenax/jenax-arq-datasets-parent/4.3.0-1-SNAPSHOT/maven-metadata.xml
[INFO] Downloading from maven.aksw.snapshots: https://maven.aksw.org/repository/snapshots/org/aksw/jenax/jenax-arq-datasets-parent/4.3.0-1-SNAPSHOT/maven-metadata.xml
[INFO] Downloaded from maven.aksw.snapshots: https://maven.aksw.org/repository/snapshots/org/aksw/jenax/jenax-arq-datasets-parent/4.3.0-1-SNAPSHOT/maven-metadata.xml (379 B at 42 kB/s)
[INFO] Downloading from maven.aksw.internal: https://maven.aksw.org/repository/internal/org/apache/jena/jena-dboe-storage/4.3.0-SNAPSHOT/maven-metadata.xml
[INFO] Downloading from maven.aksw.snapshots: https://maven.aksw.org/repository/snapshots/org/apache/jena/jena-dboe-storage/4.3.0-SNAPSHOT/maven-metadata.xml
[INFO] Downloading from maven.aksw.internal: https://maven.aksw.org/repository/internal/org/apache/jena/jena-dboe-storage/4.3.0-SNAPSHOT/jena-dboe-storage-4.3.0-SNAPSHOT.pom
[INFO] Downloading from maven.aksw.snapshots: https://maven.aksw.org/repository/snapshots/org/apache/jena/jena-dboe-storage/4.3.0-SNAPSHOT/jena-dboe-storage-4.3.0-SNAPSHOT.pom
[WARNING] The POM for org.apache.jena:jena-dboe-storage:jar:4.3.0-SNAPSHOT is missing, no dependency information available
[INFO] Downloading from maven.aksw.internal: https://maven.aksw.org/repository/internal/org/aksw/jenax/jenax-arq-json/4.3.0-1-SNAPSHOT/maven-metadata.xml
[INFO] Downloading from maven.aksw.snapshots: https://maven.aksw.org/repository/snapshots/org/aksw/jenax/jenax-arq-json/4.3.0-1-SNAPSHOT/maven-metadata.xml
[INFO] Downloaded from maven.aksw.snapshots: https://maven.aksw.org/repository/snapshots/org/aksw/jenax/jenax-arq-json/4.3.0-1-SNAPSHOT/maven-metadata.xml (368 B at 41 kB/s)
[INFO] Downloading from maven.aksw.internal: https://maven.aksw.org/repository/internal/org/apache/jena/jena-geosparql/4.3.0-SNAPSHOT/maven-metadata.xml
[INFO] Downloading from maven.aksw.snapshots: https://maven.aksw.org/repository/snapshots/org/apache/jena/jena-geosparql/4.3.0-SNAPSHOT/maven-metadata.xml
[INFO] Downloading from maven.aksw.internal: https://maven.aksw.org/repository/internal/org/apache/jena/jena-geosparql/4.3.0-SNAPSHOT/jena-geosparql-4.3.0-SNAPSHOT.pom
[INFO] Downloading from maven.aksw.snapshots: https://maven.aksw.org/repository/snapshots/org/apache/jena/jena-geosparql/4.3.0-SNAPSHOT/jena-geosparql-4.3.0-SNAPSHOT.pom
[WARNING] The POM for org.apache.jena:jena-geosparql:jar:4.3.0-SNAPSHOT is missing, no dependency information available
[INFO] Downloading from maven.aksw.internal: https://maven.aksw.org/repository/internal/org/aksw/jenax/jenax-arq-datasets-oneng/4.3.0-1-SNAPSHOT/maven-metadata.xml
[INFO] Downloading from maven.aksw.snapshots: https://maven.aksw.org/repository/snapshots/org/aksw/jenax/jenax-arq-datasets-oneng/4.3.0-1-SNAPSHOT/maven-metadata.xml
[INFO] Downloaded from maven.aksw.snapshots: https://maven.aksw.org/repository/snapshots/org/aksw/jenax/jenax-arq-datasets-oneng/4.3.0-1-SNAPSHOT/maven-metadata.xml (378 B at 47 kB/s)
[INFO] Downloading from maven.aksw.internal: https://maven.aksw.org/repository/internal/org/aksw/jenax/jenax-arq-rdfnode-in-dataset/4.3.0-1-SNAPSHOT/maven-metadata.xml
[INFO] Downloading from maven.aksw.snapshots: https://maven.aksw.org/repository/snapshots/org/aksw/jenax/jenax-arq-rdfnode-in-dataset/4.3.0-1-SNAPSHOT/maven-metadata.xml
[INFO] Downloaded from maven.aksw.snapshots: https://maven.aksw.org/repository/snapshots/org/aksw/jenax/jenax-arq-rdfnode-in-dataset/4.3.0-1-SNAPSHOT/maven-metadata.xml (382 B at 42 kB/s)
[INFO] Downloading from maven.aksw.internal: https://maven.aksw.org/repository/internal/org/aksw/commons/aksw-commons-io-utils/0.9.1-SNAPSHOT/maven-metadata.xml
[INFO] Downloading from maven.aksw.snapshots: https://maven.aksw.org/repository/snapshots/org/aksw/commons/aksw-commons-io-utils/0.9.1-SNAPSHOT/maven-metadata.xml
[INFO] Downloaded from maven.aksw.snapshots: https://maven.aksw.org/repository/snapshots/org/aksw/commons/aksw-commons-io-utils/0.9.1-SNAPSHOT/maven-metadata.xml (375 B at 42 kB/s)
[INFO] Downloading from maven.aksw.internal: https://maven.aksw.org/repository/internal/org/aksw/commons/aksw-commons-io-parent/0.9.1-SNAPSHOT/maven-metadata.xml
[INFO] Downloading from maven.aksw.snapshots: https://maven.aksw.org/repository/snapshots/org/aksw/commons/aksw-commons-io-parent/0.9.1-SNAPSHOT/maven-metadata.xml
[INFO] Downloaded from maven.aksw.snapshots: https://maven.aksw.org/repository/snapshots/org/aksw/commons/aksw-commons-io-parent/0.9.1-SNAPSHOT/maven-metadata.xml (376 B at 42 kB/s)
[INFO] Downloading from maven.aksw.internal: https://maven.aksw.org/repository/internal/org/aksw/commons/aksw-commons-lambdas-throwing/0.9.1-SNAPSHOT/maven-metadata.xml
[INFO] Downloading from maven.aksw.snapshots: https://maven.aksw.org/repository/snapshots/org/aksw/commons/aksw-commons-lambdas-throwing/0.9.1-SNAPSHOT/maven-metadata.xml
[INFO] Downloaded from maven.aksw.snapshots: https://maven.aksw.org/repository/snapshots/org/aksw/commons/aksw-commons-lambdas-throwing/0.9.1-SNAPSHOT/maven-metadata.xml (383 B at 43 kB/s)
[INFO] Downloading from maven.aksw.internal: https://maven.aksw.org/repository/internal/org/aksw/commons/aksw-commons-rx/0.9.1-SNAPSHOT/maven-metadata.xml
[INFO] Downloading from maven.aksw.snapshots: https://maven.aksw.org/repository/snapshots/org/aksw/commons/aksw-commons-rx/0.9.1-SNAPSHOT/maven-metadata.xml
[INFO] Downloaded from maven.aksw.snapshots: https://maven.aksw.org/repository/snapshots/org/aksw/commons/aksw-commons-rx/0.9.1-SNAPSHOT/maven-metadata.xml (369 B at 46 kB/s)
[INFO] Downloading from maven.aksw.internal: https://maven.aksw.org/repository/internal/org/aksw/commons/aksw-commons-rx-ex/0.9.1-SNAPSHOT/maven-metadata.xml
[INFO] Downloading from maven.aksw.snapshots: https://maven.aksw.org/repository/snapshots/org/aksw/commons/aksw-commons-rx-ex/0.9.1-SNAPSHOT/maven-metadata.xml
[INFO] Downloaded from maven.aksw.snapshots: https://maven.aksw.org/repository/snapshots/org/aksw/commons/aksw-commons-rx-ex/0.9.1-SNAPSHOT/maven-metadata.xml (372 B at 37 kB/s)
[INFO] ------------------------------------------------------------------------
[INFO] Reactor Summary for Sparqlify SPARQL->SQL rewriter - Parent 0.9.1-SNAPSHOT:
[INFO] 
[INFO] Sparqlify SPARQL->SQL rewriter - Parent ............ SUCCESS [  1.465 s]
[INFO] obda-api-parent .................................... SUCCESS [  0.086 s]
[INFO] obda-api-core ...................................... FAILURE [  1.491 s]
[INFO] obda-api-r2rml ..................................... SKIPPED
[INFO] obda-api-sml ....................................... SKIPPED
[INFO] obda-api-bundle .................................... SKIPPED
[INFO] Sparqlify SPARQL->SQL rewriter - Type System ....... SKIPPED
[INFO] Sparqlify SPARQL->SQL rewriter - Tests ............. SKIPPED
[INFO] Sparqlify SPARQL->SQL rewriter - Core .............. SKIPPED
[INFO] obda-api-examples .................................. SKIPPED
[INFO] Sparqlify SPARQL->SQL rewriter - Cli ............... SKIPPED
[INFO] Sparqlify SPARQL->SQL rewriter - Platform .......... SKIPPED
[INFO] Sparqlify SPARQL->SQL rewriter - Tests ............. SKIPPED
[INFO] Sparqlify SPARQL->SQL rewriter - JPA Mapper ........ SKIPPED
[INFO] Sparqlify SPARQL->SQL rewriter - Web Admin Server .. SKIPPED
[INFO] Sparqlify - Debian Packaging - Cli ................. SKIPPED
[INFO] Sparqlify - Debian Packaging - Tomcat Common ....... SKIPPED
[INFO] Sparqlify - Debian Packaging - Tomcat7 ............. SKIPPED
[INFO] Sparqlify - Debian Packaging - Tomcat8 ............. SKIPPED
[INFO] Sparqlify - Nexus Deploy Workaround ................ SKIPPED
[INFO] ------------------------------------------------------------------------
[INFO] BUILD FAILURE
[INFO] ------------------------------------------------------------------------
[INFO] Total time:  10.749 s
[INFO] Finished at: 2021-11-19T00:08:42+01:00
[INFO] ------------------------------------------------------------------------
Waiting for Jenkins to finish collecting data
[ERROR] Failed to execute goal on project obda-api-core: Could not resolve dependencies for project org.aksw.sparqlify:obda-api-core:jar:0.9.1-SNAPSHOT: Failed to collect dependencies at org.aksw.jenax:jenax-arq-algebra:jar:4.3.0-1-SNAPSHOT -> org.aksw.commons:subgraph-isomorphism-index-jena:jar:1.5.1-1-SNAPSHOT -> org.aksw.commons:jena-jgrapht-bindings:jar:1.5.1-1-SNAPSHOT -> org.apache.jena:jena-arq:jar:4.3.0-SNAPSHOT: Failed to read artifact descriptor for org.apache.jena:jena-arq:jar:4.3.0-SNAPSHOT: Could not transfer artifact org.apache.jena:jena-arq:pom:4.3.0-SNAPSHOT from/to maven-default-http-blocker (http://0.0.0.0/): Blocked mirror for repositories: [maven.aksw.snapshots (http://maven.aksw.org/archiva/repository/snapshots, default, snapshots)] -> [Help 1]
org.apache.maven.lifecycle.LifecycleExecutionException: Failed to execute goal on project obda-api-core: Could not resolve dependencies for project org.aksw.sparqlify:obda-api-core:jar:0.9.1-SNAPSHOT: Failed to collect dependencies at org.aksw.jenax:jenax-arq-algebra:jar:4.3.0-1-SNAPSHOT -> org.aksw.commons:subgraph-isomorphism-index-jena:jar:1.5.1-1-SNAPSHOT -> org.aksw.commons:jena-jgrapht-bindings:jar:1.5.1-1-SNAPSHOT -> org.apache.jena:jena-arq:jar:4.3.0-SNAPSHOT
    at org.apache.maven.lifecycle.internal.LifecycleDependencyResolver.getDependencies (LifecycleDependencyResolver.java:269)
    at org.apache.maven.lifecycle.internal.LifecycleDependencyResolver.resolveProjectDependencies (LifecycleDependencyResolver.java:147)
    at org.apache.maven.lifecycle.internal.MojoExecutor.ensureDependenciesAreResolved (MojoExecutor.java:248)
    at org.apache.maven.lifecycle.internal.MojoExecutor.execute (MojoExecutor.java:202)
    at org.apache.maven.lifecycle.internal.MojoExecutor.execute (MojoExecutor.java:156)
    at org.apache.maven.lifecycle.internal.MojoExecutor.execute (MojoExecutor.java:148)
    at org.apache.maven.lifecycle.internal.LifecycleModuleBuilder.buildProject (LifecycleModuleBuilder.java:117)
    at org.apache.maven.lifecycle.internal.LifecycleModuleBuilder.buildProject (LifecycleModuleBuilder.java:81)
    at org.apache.maven.lifecycle.internal.builder.singlethreaded.SingleThreadedBuilder.build (SingleThreadedBuilder.java:56)
    at org.apache.maven.lifecycle.internal.LifecycleStarter.execute (LifecycleStarter.java:128)
    at org.apache.maven.DefaultMaven.doExecute (DefaultMaven.java:305)
    at org.apache.maven.DefaultMaven.doExecute (DefaultMaven.java:192)
    at org.apache.maven.DefaultMaven.execute (DefaultMaven.java:105)
    at org.jvnet.hudson.maven3.launcher.Maven35Launcher.main (Maven35Launcher.java:130)
    at jdk.internal.reflect.NativeMethodAccessorImpl.invoke0 (Native Method)
    at jdk.internal.reflect.NativeMethodAccessorImpl.invoke (NativeMethodAccessorImpl.java:62)
    at jdk.internal.reflect.DelegatingMethodAccessorImpl.invoke (DelegatingMethodAccessorImpl.java:43)
    at java.lang.reflect.Method.invoke (Method.java:566)
    at org.codehaus.plexus.classworlds.launcher.Launcher.launchEnhanced (Launcher.java:282)
    at org.codehaus.plexus.classworlds.launcher.Launcher.launch (Launcher.java:225)
    at jenkins.maven3.agent.Maven35Main.launch (Maven35Main.java:178)
    at jdk.internal.reflect.NativeMethodAccessorImpl.invoke0 (Native Method)
    at jdk.internal.reflect.NativeMethodAccessorImpl.invoke (NativeMethodAccessorImpl.java:62)
    at jdk.internal.reflect.DelegatingMethodAccessorImpl.invoke (DelegatingMethodAccessorImpl.java:43)
    at java.lang.reflect.Method.invoke (Method.java:566)
    at hudson.maven.Maven3Builder.call (Maven3Builder.java:139)
    at hudson.maven.Maven3Builder.call (Maven3Builder.java:70)
    at hudson.remoting.UserRequest.perform (UserRequest.java:211)
    at hudson.remoting.UserRequest.perform (UserRequest.java:54)
    at hudson.remoting.Request$2.run (Request.java:369)
    at hudson.remoting.InterceptingExecutorService$1.call (InterceptingExecutorService.java:72)
    at java.util.concurrent.FutureTask.run (FutureTask.java:264)
    at java.util.concurrent.ThreadPoolExecutor.runWorker (ThreadPoolExecutor.java:1128)
    at java.util.concurrent.ThreadPoolExecutor$Worker.run (ThreadPoolExecutor.java:628)
    at java.lang.Thread.run (Thread.java:829)
Caused by: org.apache.maven.project.DependencyResolutionException: Could not resolve dependencies for project org.aksw.sparqlify:obda-api-core:jar:0.9.1-SNAPSHOT: Failed to collect dependencies at org.aksw.jenax:jenax-arq-algebra:jar:4.3.0-1-SNAPSHOT -> org.aksw.commons:subgraph-isomorphism-index-jena:jar:1.5.1-1-SNAPSHOT -> org.aksw.commons:jena-jgrapht-bindings:jar:1.5.1-1-SNAPSHOT -> org.apache.jena:jena-arq:jar:4.3.0-SNAPSHOT
    at org.apache.maven.project.DefaultProjectDependenciesResolver.resolve (DefaultProjectDependenciesResolver.java:178)
    at org.apache.maven.lifecycle.internal.LifecycleDependencyResolver.getDependencies (LifecycleDependencyResolver.java:243)
    at org.apache.maven.lifecycle.internal.LifecycleDependencyResolver.resolveProjectDependencies (LifecycleDependencyResolver.java:147)
    at org.apache.maven.lifecycle.internal.MojoExecutor.ensureDependenciesAreResolved (MojoExecutor.java:248)
    at org.apache.maven.lifecycle.internal.MojoExecutor.execute (MojoExecutor.java:202)
    at org.apache.maven.lifecycle.internal.MojoExecutor.execute (MojoExecutor.java:156)
    at org.apache.maven.lifecycle.internal.MojoExecutor.execute (MojoExecutor.java:148)
    at org.apache.maven.lifecycle.internal.LifecycleModuleBuilder.buildProject (LifecycleModuleBuilder.java:117)
    at org.apache.maven.lifecycle.internal.LifecycleModuleBuilder.buildProject (LifecycleModuleBuilder.java:81)
    at org.apache.maven.lifecycle.internal.builder.singlethreaded.SingleThreadedBuilder.build (SingleThreadedBuilder.java:56)
    at org.apache.maven.lifecycle.internal.LifecycleStarter.execute (LifecycleStarter.java:128)
    at org.apache.maven.DefaultMaven.doExecute (DefaultMaven.java:305)
    at org.apache.maven.DefaultMaven.doExecute (DefaultMaven.java:192)
    at org.apache.maven.DefaultMaven.execute (DefaultMaven.java:105)
    at org.jvnet.hudson.maven3.launcher.Maven35Launcher.main (Maven35Launcher.java:130)
    at jdk.internal.reflect.NativeMethodAccessorImpl.invoke0 (Native Method)
    at jdk.internal.reflect.NativeMethodAccessorImpl.invoke (NativeMethodAccessorImpl.java:62)
    at jdk.internal.reflect.DelegatingMethodAccessorImpl.invoke (DelegatingMethodAccessorImpl.java:43)
    at java.lang.reflect.Method.invoke (Method.java:566)
    at org.codehaus.plexus.classworlds.launcher.Launcher.launchEnhanced (Launcher.java:282)
    at org.codehaus.plexus.classworlds.launcher.Launcher.launch (Launcher.java:225)
    at jenkins.maven3.agent.Maven35Main.launch (Maven35Main.java:178)
    at jdk.internal.reflect.NativeMethodAccessorImpl.invoke0 (Native Method)
    at jdk.internal.reflect.NativeMethodAccessorImpl.invoke (NativeMethodAccessorImpl.java:62)
    at jdk.internal.reflect.DelegatingMethodAccessorImpl.invoke (DelegatingMethodAccessorImpl.java:43)
    at java.lang.reflect.Method.invoke (Method.java:566)
    at hudson.maven.Maven3Builder.call (Maven3Builder.java:139)
    at hudson.maven.Maven3Builder.call (Maven3Builder.java:70)
    at hudson.remoting.UserRequest.perform (UserRequest.java:211)
    at hudson.remoting.UserRequest.perform (UserRequest.java:54)
    at hudson.remoting.Request$2.run (Request.java:369)
    at hudson.remoting.InterceptingExecutorService$1.call (InterceptingExecutorService.java:72)
    at java.util.concurrent.FutureTask.run (FutureTask.java:264)
    at java.util.concurrent.ThreadPoolExecutor.runWorker (ThreadPoolExecutor.java:1128)
    at java.util.concurrent.ThreadPoolExecutor$Worker.run (ThreadPoolExecutor.java:628)
    at java.lang.Thread.run (Thread.java:829)
Caused by: org.eclipse.aether.collection.DependencyCollectionException: Failed to collect dependencies at org.aksw.jenax:jenax-arq-algebra:jar:4.3.0-1-SNAPSHOT -> org.aksw.commons:subgraph-isomorphism-index-jena:jar:1.5.1-1-SNAPSHOT -> org.aksw.commons:jena-jgrapht-bindings:jar:1.5.1-1-SNAPSHOT -> org.apache.jena:jena-arq:jar:4.3.0-SNAPSHOT
    at org.eclipse.aether.internal.impl.collect.DefaultDependencyCollector.collectDependencies (DefaultDependencyCollector.java:288)
    at org.eclipse.aether.internal.impl.DefaultRepositorySystem.collectDependencies (DefaultRepositorySystem.java:284)
    at org.apache.maven.project.DefaultProjectDependenciesResolver.resolve (DefaultProjectDependenciesResolver.java:169)
    at org.apache.maven.lifecycle.internal.LifecycleDependencyResolver.getDependencies (LifecycleDependencyResolver.java:243)
    at org.apache.maven.lifecycle.internal.LifecycleDependencyResolver.resolveProjectDependencies (LifecycleDependencyResolver.java:147)
    at org.apache.maven.lifecycle.internal.MojoExecutor.ensureDependenciesAreResolved (MojoExecutor.java:248)
    at org.apache.maven.lifecycle.internal.MojoExecutor.execute (MojoExecutor.java:202)
    at org.apache.maven.lifecycle.internal.MojoExecutor.execute (MojoExecutor.java:156)
    at org.apache.maven.lifecycle.internal.MojoExecutor.execute (MojoExecutor.java:148)
    at org.apache.maven.lifecycle.internal.LifecycleModuleBuilder.buildProject (LifecycleModuleBuilder.java:117)
    at org.apache.maven.lifecycle.internal.LifecycleModuleBuilder.buildProject (LifecycleModuleBuilder.java:81)
    at org.apache.maven.lifecycle.internal.builder.singlethreaded.SingleThreadedBuilder.build (SingleThreadedBuilder.java:56)
    at org.apache.maven.lifecycle.internal.LifecycleStarter.execute (LifecycleStarter.java:128)
    at org.apache.maven.DefaultMaven.doExecute (DefaultMaven.java:305)
    at org.apache.maven.DefaultMaven.doExecute (DefaultMaven.java:192)
    at org.apache.maven.DefaultMaven.execute (DefaultMaven.java:105)
    at org.jvnet.hudson.maven3.launcher.Maven35Launcher.main (Maven35Launcher.java:130)
    at jdk.internal.reflect.NativeMethodAccessorImpl.invoke0 (Native Method)
    at jdk.internal.reflect.NativeMethodAccessorImpl.invoke (NativeMethodAccessorImpl.java:62)
    at jdk.internal.reflect.DelegatingMethodAccessorImpl.invoke (DelegatingMethodAccessorImpl.java:43)
    at java.lang.reflect.Method.invoke (Method.java:566)
    at org.codehaus.plexus.classworlds.launcher.Launcher.launchEnhanced (Launcher.java:282)
    at org.codehaus.plexus.classworlds.launcher.Launcher.launch (Launcher.java:225)
    at jenkins.maven3.agent.Maven35Main.launch (Maven35Main.java:178)
    at jdk.internal.reflect.NativeMethodAccessorImpl.invoke0 (Native Method)
    at jdk.internal.reflect.NativeMethodAccessorImpl.invoke (NativeMethodAccessorImpl.java:62)
    at jdk.internal.reflect.DelegatingMethodAccessorImpl.invoke (DelegatingMethodAccessorImpl.java:43)
    at java.lang.reflect.Method.invoke (Method.java:566)
    at hudson.maven.Maven3Builder.call (Maven3Builder.java:139)
    at hudson.maven.Maven3Builder.call (Maven3Builder.java:70)
    at hudson.remoting.UserRequest.perform (UserRequest.java:211)
    at hudson.remoting.UserRequest.perform (UserRequest.java:54)
    at hudson.remoting.Request$2.run (Request.java:369)
    at hudson.remoting.InterceptingExecutorService$1.call (InterceptingExecutorService.java:72)
    at java.util.concurrent.FutureTask.run (FutureTask.java:264)
    at java.util.concurrent.ThreadPoolExecutor.runWorker (ThreadPoolExecutor.java:1128)
    at java.util.concurrent.ThreadPoolExecutor$Worker.run (ThreadPoolExecutor.java:628)
    at java.lang.Thread.run (Thread.java:829)
Caused by: org.eclipse.aether.resolution.ArtifactDescriptorException: Failed to read artifact descriptor for org.apache.jena:jena-arq:jar:4.3.0-SNAPSHOT
    at org.apache.maven.repository.internal.DefaultArtifactDescriptorReader.loadPom (DefaultArtifactDescriptorReader.java:255)
    at org.apache.maven.repository.internal.DefaultArtifactDescriptorReader.readArtifactDescriptor (DefaultArtifactDescriptorReader.java:171)
    at org.eclipse.aether.internal.impl.collect.DefaultDependencyCollector.resolveCachedArtifactDescriptor (DefaultDependencyCollector.java:538)
    at org.eclipse.aether.internal.impl.collect.DefaultDependencyCollector.getArtifactDescriptorResult (DefaultDependencyCollector.java:523)
    at org.eclipse.aether.internal.impl.collect.DefaultDependencyCollector.processDependency (DefaultDependencyCollector.java:410)
    at org.eclipse.aether.internal.impl.collect.DefaultDependencyCollector.processDependency (DefaultDependencyCollector.java:362)
    at org.eclipse.aether.internal.impl.collect.DefaultDependencyCollector.process (DefaultDependencyCollector.java:349)
    at org.eclipse.aether.internal.impl.collect.DefaultDependencyCollector.doRecurse (DefaultDependencyCollector.java:506)
    at org.eclipse.aether.internal.impl.collect.DefaultDependencyCollector.processDependency (DefaultDependencyCollector.java:458)
    at org.eclipse.aether.internal.impl.collect.DefaultDependencyCollector.processDependency (DefaultDependencyCollector.java:362)
    at org.eclipse.aether.internal.impl.collect.DefaultDependencyCollector.process (DefaultDependencyCollector.java:349)
    at org.eclipse.aether.internal.impl.collect.DefaultDependencyCollector.doRecurse (DefaultDependencyCollector.java:506)
    at org.eclipse.aether.internal.impl.collect.DefaultDependencyCollector.processDependency (DefaultDependencyCollector.java:458)
    at org.eclipse.aether.internal.impl.collect.DefaultDependencyCollector.processDependency (DefaultDependencyCollector.java:362)
    at org.eclipse.aether.internal.impl.collect.DefaultDependencyCollector.process (DefaultDependencyCollector.java:349)
    at org.eclipse.aether.internal.impl.collect.DefaultDependencyCollector.doRecurse (DefaultDependencyCollector.java:506)
    at org.eclipse.aether.internal.impl.collect.DefaultDependencyCollector.processDependency (DefaultDependencyCollector.java:458)
    at org.eclipse.aether.internal.impl.collect.DefaultDependencyCollector.processDependency (DefaultDependencyCollector.java:362)
    at org.eclipse.aether.internal.impl.collect.DefaultDependencyCollector.process (DefaultDependencyCollector.java:349)
    at org.eclipse.aether.internal.impl.collect.DefaultDependencyCollector.collectDependencies (DefaultDependencyCollector.java:254)
    at org.eclipse.aether.internal.impl.DefaultRepositorySystem.collectDependencies (DefaultRepositorySystem.java:284)
    at org.apache.maven.project.DefaultProjectDependenciesResolver.resolve (DefaultProjectDependenciesResolver.java:169)
    at org.apache.maven.lifecycle.internal.LifecycleDependencyResolver.getDependencies (LifecycleDependencyResolver.java:243)
    at org.apache.maven.lifecycle.internal.LifecycleDependencyResolver.resolveProjectDependencies (LifecycleDependencyResolver.java:147)
    at org.apache.maven.lifecycle.internal.MojoExecutor.ensureDependenciesAreResolved (MojoExecutor.java:248)
    at org.apache.maven.lifecycle.internal.MojoExecutor.execute (MojoExecutor.java:202)
    at org.apache.maven.lifecycle.internal.MojoExecutor.execute (MojoExecutor.java:156)
    at org.apache.maven.lifecycle.internal.MojoExecutor.execute (MojoExecutor.java:148)
    at org.apache.maven.lifecycle.internal.LifecycleModuleBuilder.buildProject (LifecycleModuleBuilder.java:117)
    at org.apache.maven.lifecycle.internal.LifecycleModuleBuilder.buildProject (LifecycleModuleBuilder.java:81)
    at org.apache.maven.lifecycle.internal.builder.singlethreaded.SingleThreadedBuilder.build (SingleThreadedBuilder.java:56)
    at org.apache.maven.lifecycle.internal.LifecycleStarter.execute (LifecycleStarter.java:128)
    at org.apache.maven.DefaultMaven.doExecute (DefaultMaven.java:305)
    at org.apache.maven.DefaultMaven.doExecute (DefaultMaven.java:192)
    at org.apache.maven.DefaultMaven.execute (DefaultMaven.java:105)
    at org.jvnet.hudson.maven3.launcher.Maven35Launcher.main (Maven35Launcher.java:130)
    at jdk.internal.reflect.NativeMethodAccessorImpl.invoke0 (Native Method)
    at jdk.internal.reflect.NativeMethodAccessorImpl.invoke (NativeMethodAccessorImpl.java:62)
    at jdk.internal.reflect.DelegatingMethodAccessorImpl.invoke (DelegatingMethodAccessorImpl.java:43)
    at java.lang.reflect.Method.invoke (Method.java:566)
    at org.codehaus.plexus.classworlds.launcher.Launcher.launchEnhanced (Launcher.java:282)
    at org.codehaus.plexus.classworlds.launcher.Launcher.launch (Launcher.java:225)
    at jenkins.maven3.agent.Maven35Main.launch (Maven35Main.java:178)
    at jdk.internal.reflect.NativeMethodAccessorImpl.invoke0 (Native Method)
    at jdk.internal.reflect.NativeMethodAccessorImpl.invoke (NativeMethodAccessorImpl.java:62)
    at jdk.internal.reflect.DelegatingMethodAccessorImpl.invoke (DelegatingMethodAccessorImpl.java:43)
    at java.lang.reflect.Method.invoke (Method.java:566)
    at hudson.maven.Maven3Builder.call (Maven3Builder.java:139)
    at hudson.maven.Maven3Builder.call (Maven3Builder.java:70)
    at hudson.remoting.UserRequest.perform (UserRequest.java:211)
    at hudson.remoting.UserRequest.perform (UserRequest.java:54)
    at hudson.remoting.Request$2.run (Request.java:369)
    at hudson.remoting.InterceptingExecutorService$1.call (InterceptingExecutorService.java:72)
    at java.util.concurrent.FutureTask.run (FutureTask.java:264)
    at java.util.concurrent.ThreadPoolExecutor.runWorker (ThreadPoolExecutor.java:1128)
    at java.util.concurrent.ThreadPoolExecutor$Worker.run (ThreadPoolExecutor.java:628)
    at java.lang.Thread.run (Thread.java:829)
Caused by: org.eclipse.aether.resolution.ArtifactResolutionException: Could not transfer artifact org.apache.jena:jena-arq:pom:4.3.0-SNAPSHOT from/to maven-default-http-blocker (http://0.0.0.0/): Blocked mirror for repositories: [maven.aksw.snapshots (http://maven.aksw.org/archiva/repository/snapshots, default, snapshots)]
    at org.eclipse.aether.internal.impl.DefaultArtifactResolver.resolve (DefaultArtifactResolver.java:424)
    at org.eclipse.aether.internal.impl.DefaultArtifactResolver.resolveArtifacts (DefaultArtifactResolver.java:229)
    at org.eclipse.aether.internal.impl.DefaultArtifactResolver.resolveArtifact (DefaultArtifactResolver.java:207)
    at org.apache.maven.repository.internal.DefaultArtifactDescriptorReader.loadPom (DefaultArtifactDescriptorReader.java:240)
    at org.apache.maven.repository.internal.DefaultArtifactDescriptorReader.readArtifactDescriptor (DefaultArtifactDescriptorReader.java:171)
    at org.eclipse.aether.internal.impl.collect.DefaultDependencyCollector.resolveCachedArtifactDescriptor (DefaultDependencyCollector.java:538)
    at org.eclipse.aether.internal.impl.collect.DefaultDependencyCollector.getArtifactDescriptorResult (DefaultDependencyCollector.java:523)
    at org.eclipse.aether.internal.impl.collect.DefaultDependencyCollector.processDependency (DefaultDependencyCollector.java:410)
    at org.eclipse.aether.internal.impl.collect.DefaultDependencyCollector.processDependency (DefaultDependencyCollector.java:362)
    at org.eclipse.aether.internal.impl.collect.DefaultDependencyCollector.process (DefaultDependencyCollector.java:349)
    at org.eclipse.aether.internal.impl.collect.DefaultDependencyCollector.doRecurse (DefaultDependencyCollector.java:506)
    at org.eclipse.aether.internal.impl.collect.DefaultDependencyCollector.processDependency (DefaultDependencyCollector.java:458)
    at org.eclipse.aether.internal.impl.collect.DefaultDependencyCollector.processDependency (DefaultDependencyCollector.java:362)
    at org.eclipse.aether.internal.impl.collect.DefaultDependencyCollector.process (DefaultDependencyCollector.java:349)
    at org.eclipse.aether.internal.impl.collect.DefaultDependencyCollector.doRecurse (DefaultDependencyCollector.java:506)
    at org.eclipse.aether.internal.impl.collect.DefaultDependencyCollector.processDependency (DefaultDependencyCollector.java:458)
    at org.eclipse.aether.internal.impl.collect.DefaultDependencyCollector.processDependency (DefaultDependencyCollector.java:362)
    at org.eclipse.aether.internal.impl.collect.DefaultDependencyCollector.process (DefaultDependencyCollector.java:349)
    at org.eclipse.aether.internal.impl.collect.DefaultDependencyCollector.doRecurse (DefaultDependencyCollector.java:506)
    at org.eclipse.aether.internal.impl.collect.DefaultDependencyCollector.processDependency (DefaultDependencyCollector.java:458)
    at org.eclipse.aether.internal.impl.collect.DefaultDependencyCollector.processDependency (DefaultDependencyCollector.java:362)
    at org.eclipse.aether.internal.impl.collect.DefaultDependencyCollector.process (DefaultDependencyCollector.java:349)
    at org.eclipse.aether.internal.impl.collect.DefaultDependencyCollector.collectDependencies (DefaultDependencyCollector.java:254)
    at org.eclipse.aether.internal.impl.DefaultRepositorySystem.collectDependencies (DefaultRepositorySystem.java:284)
    at org.apache.maven.project.DefaultProjectDependenciesResolver.resolve (DefaultProjectDependenciesResolver.java:169)
    at org.apache.maven.lifecycle.internal.LifecycleDependencyResolver.getDependencies (LifecycleDependencyResolver.java:243)
    at org.apache.maven.lifecycle.internal.LifecycleDependencyResolver.resolveProjectDependencies (LifecycleDependencyResolver.java:147)
    at org.apache.maven.lifecycle.internal.MojoExecutor.ensureDependenciesAreResolved (MojoExecutor.java:248)
    at org.apache.maven.lifecycle.internal.MojoExecutor.execute (MojoExecutor.java:202)
    at org.apache.maven.lifecycle.internal.MojoExecutor.execute (MojoExecutor.java:156)
    at org.apache.maven.lifecycle.internal.MojoExecutor.execute (MojoExecutor.java:148)
    at org.apache.maven.lifecycle.internal.LifecycleModuleBuilder.buildProject (LifecycleModuleBuilder.java:117)
    at org.apache.maven.lifecycle.internal.LifecycleModuleBuilder.buildProject (LifecycleModuleBuilder.java:81)
    at org.apache.maven.lifecycle.internal.builder.singlethreaded.SingleThreadedBuilder.build (SingleThreadedBuilder.java:56)
    at org.apache.maven.lifecycle.internal.LifecycleStarter.execute (LifecycleStarter.java:128)
    at org.apache.maven.DefaultMaven.doExecute (DefaultMaven.java:305)
    at org.apache.maven.DefaultMaven.doExecute (DefaultMaven.java:192)
    at org.apache.maven.DefaultMaven.execute (DefaultMaven.java:105)
    at org.jvnet.hudson.maven3.launcher.Maven35Launcher.main (Maven35Launcher.java:130)
    at jdk.internal.reflect.NativeMethodAccessorImpl.invoke0 (Native Method)
    at jdk.internal.reflect.NativeMethodAccessorImpl.invoke (NativeMethodAccessorImpl.java:62)
    at jdk.internal.reflect.DelegatingMethodAccessorImpl.invoke (DelegatingMethodAccessorImpl.java:43)
    at java.lang.reflect.Method.invoke (Method.java:566)
    at org.codehaus.plexus.classworlds.launcher.Launcher.launchEnhanced (Launcher.java:282)
    at org.codehaus.plexus.classworlds.launcher.Launcher.launch (Launcher.java:225)
    at jenkins.maven3.agent.Maven35Main.launch (Maven35Main.java:178)
    at jdk.internal.reflect.NativeMethodAccessorImpl.invoke0 (Native Method)
    at jdk.internal.reflect.NativeMethodAccessorImpl.invoke (NativeMethodAccessorImpl.java:62)
    at jdk.internal.reflect.DelegatingMethodAccessorImpl.invoke (DelegatingMethodAccessorImpl.java:43)
    at java.lang.reflect.Method.invoke (Method.java:566)
    at hudson.maven.Maven3Builder.call (Maven3Builder.java:139)
    at hudson.maven.Maven3Builder.call (Maven3Builder.java:70)
    at hudson.remoting.UserRequest.perform (UserRequest.java:211)
    at hudson.remoting.UserRequest.perform (UserRequest.java:54)
    at hudson.remoting.Request$2.run (Request.java:369)
    at hudson.remoting.InterceptingExecutorService$1.call (InterceptingExecutorService.java:72)
    at java.util.concurrent.FutureTask.run (FutureTask.java:264)
    at java.util.concurrent.ThreadPoolExecutor.runWorker (ThreadPoolExecutor.java:1128)
    at java.util.concurrent.ThreadPoolExecutor$Worker.run (ThreadPoolExecutor.java:628)
    at java.lang.Thread.run (Thread.java:829)
Caused by: org.eclipse.aether.transfer.ArtifactTransferException: Could not transfer artifact org.apache.jena:jena-arq:pom:4.3.0-SNAPSHOT from/to maven-default-http-blocker (http://0.0.0.0/): Blocked mirror for repositories: [maven.aksw.snapshots (http://maven.aksw.org/archiva/repository/snapshots, default, snapshots)]
    at org.eclipse.aether.internal.impl.DefaultArtifactResolver.performDownloads (DefaultArtifactResolver.java:520)
    at org.eclipse.aether.internal.impl.DefaultArtifactResolver.resolve (DefaultArtifactResolver.java:401)
    at org.eclipse.aether.internal.impl.DefaultArtifactResolver.resolveArtifacts (DefaultArtifactResolver.java:229)
    at org.eclipse.aether.internal.impl.DefaultArtifactResolver.resolveArtifact (DefaultArtifactResolver.java:207)
    at org.apache.maven.repository.internal.DefaultArtifactDescriptorReader.loadPom (DefaultArtifactDescriptorReader.java:240)
    at org.apache.maven.repository.internal.DefaultArtifactDescriptorReader.readArtifactDescriptor (DefaultArtifactDescriptorReader.java:171)
    at org.eclipse.aether.internal.impl.collect.DefaultDependencyCollector.resolveCachedArtifactDescriptor (DefaultDependencyCollector.java:538)
    at org.eclipse.aether.internal.impl.collect.DefaultDependencyCollector.getArtifactDescriptorResult (DefaultDependencyCollector.java:523)
    at org.eclipse.aether.internal.impl.collect.DefaultDependencyCollector.processDependency (DefaultDependencyCollector.java:410)
    at org.eclipse.aether.internal.impl.collect.DefaultDependencyCollector.processDependency (DefaultDependencyCollector.java:362)
    at org.eclipse.aether.internal.impl.collect.DefaultDependencyCollector.process (DefaultDependencyCollector.java:349)
    at org.eclipse.aether.internal.impl.collect.DefaultDependencyCollector.doRecurse (DefaultDependencyCollector.java:506)
    at org.eclipse.aether.internal.impl.collect.DefaultDependencyCollector.processDependency (DefaultDependencyCollector.java:458)
    at org.eclipse.aether.internal.impl.collect.DefaultDependencyCollector.processDependency (DefaultDependencyCollector.java:362)
    at org.eclipse.aether.internal.impl.collect.DefaultDependencyCollector.process (DefaultDependencyCollector.java:349)
    at org.eclipse.aether.internal.impl.collect.DefaultDependencyCollector.doRecurse (DefaultDependencyCollector.java:506)
    at org.eclipse.aether.internal.impl.collect.DefaultDependencyCollector.processDependency (DefaultDependencyCollector.java:458)
    at org.eclipse.aether.internal.impl.collect.DefaultDependencyCollector.processDependency (DefaultDependencyCollector.java:362)
    at org.eclipse.aether.internal.impl.collect.DefaultDependencyCollector.process (DefaultDependencyCollector.java:349)
    at org.eclipse.aether.internal.impl.collect.DefaultDependencyCollector.doRecurse (DefaultDependencyCollector.java:506)
    at org.eclipse.aether.internal.impl.collect.DefaultDependencyCollector.processDependency (DefaultDependencyCollector.java:458)
    at org.eclipse.aether.internal.impl.collect.DefaultDependencyCollector.processDependency (DefaultDependencyCollector.java:362)
    at org.eclipse.aether.internal.impl.collect.DefaultDependencyCollector.process (DefaultDependencyCollector.java:349)
    at org.eclipse.aether.internal.impl.collect.DefaultDependencyCollector.collectDependencies (DefaultDependencyCollector.java:254)
    at org.eclipse.aether.internal.impl.DefaultRepositorySystem.collectDependencies (DefaultRepositorySystem.java:284)
    at org.apache.maven.project.DefaultProjectDependenciesResolver.resolve (DefaultProjectDependenciesResolver.java:169)
    at org.apache.maven.lifecycle.internal.LifecycleDependencyResolver.getDependencies (LifecycleDependencyResolver.java:243)
    at org.apache.maven.lifecycle.internal.LifecycleDependencyResolver.resolveProjectDependencies (LifecycleDependencyResolver.java:147)
    at org.apache.maven.lifecycle.internal.MojoExecutor.ensureDependenciesAreResolved (MojoExecutor.java:248)
    at org.apache.maven.lifecycle.internal.MojoExecutor.execute (MojoExecutor.java:202)
    at org.apache.maven.lifecycle.internal.MojoExecutor.execute (MojoExecutor.java:156)
    at org.apache.maven.lifecycle.internal.MojoExecutor.execute (MojoExecutor.java:148)
    at org.apache.maven.lifecycle.internal.LifecycleModuleBuilder.buildProject (LifecycleModuleBuilder.java:117)
    at org.apache.maven.lifecycle.internal.LifecycleModuleBuilder.buildProject (LifecycleModuleBuilder.java:81)
    at org.apache.maven.lifecycle.internal.builder.singlethreaded.SingleThreadedBuilder.build (SingleThreadedBuilder.java:56)
    at org.apache.maven.lifecycle.internal.LifecycleStarter.execute (LifecycleStarter.java:128)
    at org.apache.maven.DefaultMaven.doExecute (DefaultMaven.java:305)
    at org.apache.maven.DefaultMaven.doExecute (DefaultMaven.java:192)
    at org.apache.maven.DefaultMaven.execute (DefaultMaven.java:105)
    at org.jvnet.hudson.maven3.launcher.Maven35Launcher.main (Maven35Launcher.java:130)
    at jdk.internal.reflect.NativeMethodAccessorImpl.invoke0 (Native Method)
    at jdk.internal.reflect.NativeMethodAccessorImpl.invoke (NativeMethodAccessorImpl.java:62)
    at jdk.internal.reflect.DelegatingMethodAccessorImpl.invoke (DelegatingMethodAccessorImpl.java:43)
    at java.lang.reflect.Method.invoke (Method.java:566)
    at org.codehaus.plexus.classworlds.launcher.Launcher.launchEnhanced (Launcher.java:282)
    at org.codehaus.plexus.classworlds.launcher.Launcher.launch (Launcher.java:225)
    at jenkins.maven3.agent.Maven35Main.launch (Maven35Main.java:178)
    at jdk.internal.reflect.NativeMethodAccessorImpl.invoke0 (Native Method)
    at jdk.internal.reflect.NativeMethodAccessorImpl.invoke (NativeMethodAccessorImpl.java:62)
    at jdk.internal.reflect.DelegatingMethodAccessorImpl.invoke (DelegatingMethodAccessorImpl.java:43)
    at java.lang.reflect.Method.invoke (Method.java:566)
    at hudson.maven.Maven3Builder.call (Maven3Builder.java:139)
    at hudson.maven.Maven3Builder.call (Maven3Builder.java:70)
    at hudson.remoting.UserRequest.perform (UserRequest.java:211)
    at hudson.remoting.UserRequest.perform (UserRequest.java:54)
    at hudson.remoting.Request$2.run (Request.java:369)
    at hudson.remoting.InterceptingExecutorService$1.call (InterceptingExecutorService.java:72)
    at java.util.concurrent.FutureTask.run (FutureTask.java:264)
    at java.util.concurrent.ThreadPoolExecutor.runWorker (ThreadPoolExecutor.java:1128)
    at java.util.concurrent.ThreadPoolExecutor$Worker.run (ThreadPoolExecutor.java:628)
    at java.lang.Thread.run (Thread.java:829)
Caused by: org.eclipse.aether.transfer.NoRepositoryConnectorException: Blocked mirror for repositories: [maven.aksw.snapshots (http://maven.aksw.org/archiva/repository/snapshots, default, snapshots)]
    at org.eclipse.aether.internal.impl.DefaultArtifactResolver.performDownloads (DefaultArtifactResolver.java:506)
    at org.eclipse.aether.internal.impl.DefaultArtifactResolver.resolve (DefaultArtifactResolver.java:401)
    at org.eclipse.aether.internal.impl.DefaultArtifactResolver.resolveArtifacts (DefaultArtifactResolver.java:229)
    at org.eclipse.aether.internal.impl.DefaultArtifactResolver.resolveArtifact (DefaultArtifactResolver.java:207)
    at org.apache.maven.repository.internal.DefaultArtifactDescriptorReader.loadPom (DefaultArtifactDescriptorReader.java:240)
    at org.apache.maven.repository.internal.DefaultArtifactDescriptorReader.readArtifactDescriptor (DefaultArtifactDescriptorReader.java:171)
    at org.eclipse.aether.internal.impl.collect.DefaultDependencyCollector.resolveCachedArtifactDescriptor (DefaultDependencyCollector.java:538)
    at org.eclipse.aether.internal.impl.collect.DefaultDependencyCollector.getArtifactDescriptorResult (DefaultDependencyCollector.java:523)
    at org.eclipse.aether.internal.impl.collect.DefaultDependencyCollector.processDependency (DefaultDependencyCollector.java:410)
    at org.eclipse.aether.internal.impl.collect.DefaultDependencyCollector.processDependency (DefaultDependencyCollector.java:362)
    at org.eclipse.aether.internal.impl.collect.DefaultDependencyCollector.process (DefaultDependencyCollector.java:349)
    at org.eclipse.aether.internal.impl.collect.DefaultDependencyCollector.doRecurse (DefaultDependencyCollector.java:506)
    at org.eclipse.aether.internal.impl.collect.DefaultDependencyCollector.processDependency (DefaultDependencyCollector.java:458)
    at org.eclipse.aether.internal.impl.collect.DefaultDependencyCollector.processDependency (DefaultDependencyCollector.java:362)
    at org.eclipse.aether.internal.impl.collect.DefaultDependencyCollector.process (DefaultDependencyCollector.java:349)
    at org.eclipse.aether.internal.impl.collect.DefaultDependencyCollector.doRecurse (DefaultDependencyCollector.java:506)
    at org.eclipse.aether.internal.impl.collect.DefaultDependencyCollector.processDependency (DefaultDependencyCollector.java:458)
    at org.eclipse.aether.internal.impl.collect.DefaultDependencyCollector.processDependency (DefaultDependencyCollector.java:362)
    at org.eclipse.aether.internal.impl.collect.DefaultDependencyCollector.process (DefaultDependencyCollector.java:349)
    at org.eclipse.aether.internal.impl.collect.DefaultDependencyCollector.doRecurse (DefaultDependencyCollector.java:506)
    at org.eclipse.aether.internal.impl.collect.DefaultDependencyCollector.processDependency (DefaultDependencyCollector.java:458)
    at org.eclipse.aether.internal.impl.collect.DefaultDependencyCollector.processDependency (DefaultDependencyCollector.java:362)
    at org.eclipse.aether.internal.impl.collect.DefaultDependencyCollector.process (DefaultDependencyCollector.java:349)
    at org.eclipse.aether.internal.impl.collect.DefaultDependencyCollector.collectDependencies (DefaultDependencyCollector.java:254)
    at org.eclipse.aether.internal.impl.DefaultRepositorySystem.collectDependencies (DefaultRepositorySystem.java:284)
    at org.apache.maven.project.DefaultProjectDependenciesResolver.resolve (DefaultProjectDependenciesResolver.java:169)
    at org.apache.maven.lifecycle.internal.LifecycleDependencyResolver.getDependencies (LifecycleDependencyResolver.java:243)
    at org.apache.maven.lifecycle.internal.LifecycleDependencyResolver.resolveProjectDependencies (LifecycleDependencyResolver.java:147)
    at org.apache.maven.lifecycle.internal.MojoExecutor.ensureDependenciesAreResolved (MojoExecutor.java:248)
    at org.apache.maven.lifecycle.internal.MojoExecutor.execute (MojoExecutor.java:202)
    at org.apache.maven.lifecycle.internal.MojoExecutor.execute (MojoExecutor.java:156)
    at org.apache.maven.lifecycle.internal.MojoExecutor.execute (MojoExecutor.java:148)
    at org.apache.maven.lifecycle.internal.LifecycleModuleBuilder.buildProject (LifecycleModuleBuilder.java:117)
    at org.apache.maven.lifecycle.internal.LifecycleModuleBuilder.buildProject (LifecycleModuleBuilder.java:81)
    at org.apache.maven.lifecycle.internal.builder.singlethreaded.SingleThreadedBuilder.build (SingleThreadedBuilder.java:56)
    at org.apache.maven.lifecycle.internal.LifecycleStarter.execute (LifecycleStarter.java:128)
    at org.apache.maven.DefaultMaven.doExecute (DefaultMaven.java:305)
    at org.apache.maven.DefaultMaven.doExecute (DefaultMaven.java:192)
    at org.apache.maven.DefaultMaven.execute (DefaultMaven.java:105)
    at org.jvnet.hudson.maven3.launcher.Maven35Launcher.main (Maven35Launcher.java:130)
    at jdk.internal.reflect.NativeMethodAccessorImpl.invoke0 (Native Method)
    at jdk.internal.reflect.NativeMethodAccessorImpl.invoke (NativeMethodAccessorImpl.java:62)
    at jdk.internal.reflect.DelegatingMethodAccessorImpl.invoke (DelegatingMethodAccessorImpl.java:43)
    at java.lang.reflect.Method.invoke (Method.java:566)
    at org.codehaus.plexus.classworlds.launcher.Launcher.launchEnhanced (Launcher.java:282)
    at org.codehaus.plexus.classworlds.launcher.Launcher.launch (Launcher.java:225)
    at jenkins.maven3.agent.Maven35Main.launch (Maven35Main.java:178)
    at jdk.internal.reflect.NativeMethodAccessorImpl.invoke0 (Native Method)
    at jdk.internal.reflect.NativeMethodAccessorImpl.invoke (NativeMethodAccessorImpl.java:62)
    at jdk.internal.reflect.DelegatingMethodAccessorImpl.invoke (DelegatingMethodAccessorImpl.java:43)
    at java.lang.reflect.Method.invoke (Method.java:566)
    at hudson.maven.Maven3Builder.call (Maven3Builder.java:139)
    at hudson.maven.Maven3Builder.call (Maven3Builder.java:70)
    at hudson.remoting.UserRequest.perform (UserRequest.java:211)
    at hudson.remoting.UserRequest.perform (UserRequest.java:54)
    at hudson.remoting.Request$2.run (Request.java:369)
    at hudson.remoting.InterceptingExecutorService$1.call (InterceptingExecutorService.java:72)
    at java.util.concurrent.FutureTask.run (FutureTask.java:264)
    at java.util.concurrent.ThreadPoolExecutor.runWorker (ThreadPoolExecutor.java:1128)
    at java.util.concurrent.ThreadPoolExecutor$Worker.run (ThreadPoolExecutor.java:628)
    at java.lang.Thread.run (Thread.java:829)
[ERROR] 
[ERROR] Re-run Maven using the -X switch to enable full debug logging.
[ERROR] 
[ERROR] For more information about the errors and possible solutions, please read the following articles:
[ERROR] [Help 1] http://cwiki.apache.org/confluence/display/MAVEN/DependencyResolutionException
[ERROR] 
[ERROR] After correcting the problems, you can resume the build with the command
[ERROR]   mvn <goals> -rf :obda-api-core
[JENKINS] Archiving /usr/share/tomcat8/.jenkins/jobs/Sparqlify/workspace/sparqlify-debian-tomcat-common/pom.xml to org.aksw.sparqlify/sparqlify-debian-tomcat-common/0.9.1-SNAPSHOT/sparqlify-debian-tomcat-common-0.9.1-SNAPSHOT.pom
[JENKINS] Archiving /usr/share/tomcat8/.jenkins/jobs/Sparqlify/workspace/obda-api-parent/obda-api-bundle/pom.xml to org.aksw.sparqlify/obda-api-bundle/0.9.1-SNAPSHOT/obda-api-bundle-0.9.1-SNAPSHOT.pom
[JENKINS] Archiving /usr/share/tomcat8/.jenkins/jobs/Sparqlify/workspace/sparqlify-type-system/pom.xml to org.aksw.sparqlify/sparqlify-type-system/0.9.1-SNAPSHOT/sparqlify-type-system-0.9.1-SNAPSHOT.pom
[JENKINS] Archiving /usr/share/tomcat8/.jenkins/jobs/Sparqlify/workspace/pom.xml to org.aksw.sparqlify/sparqlify-parent/0.9.1-SNAPSHOT/sparqlify-parent-0.9.1-SNAPSHOT.pom
[JENKINS] Archiving /usr/share/tomcat8/.jenkins/jobs/Sparqlify/workspace/obda-api-parent/obda-api-sml/pom.xml to org.aksw.sparqlify/obda-api-sml/0.9.1-SNAPSHOT/obda-api-sml-0.9.1-SNAPSHOT.pom
[JENKINS] Archiving /usr/share/tomcat8/.jenkins/jobs/Sparqlify/workspace/sparqlify-jpa/pom.xml to org.aksw.sparqlify/sparqlify-jpa/0.9.1-SNAPSHOT/sparqlify-jpa-0.9.1-SNAPSHOT.pom
[JENKINS] Archiving /usr/share/tomcat8/.jenkins/jobs/Sparqlify/workspace/sparqlify-cli/pom.xml to org.aksw.sparqlify/sparqlify-cli/0.9.1-SNAPSHOT/sparqlify-cli-0.9.1-SNAPSHOT.pom
[JENKINS] Archiving /usr/share/tomcat8/.jenkins/jobs/Sparqlify/workspace/sparqlify-platform/pom.xml to org.aksw.sparqlify/sparqlify-platform/0.9.1-SNAPSHOT/sparqlify-platform-0.9.1-SNAPSHOT.pom
[JENKINS] Archiving /usr/share/tomcat8/.jenkins/jobs/Sparqlify/workspace/sparqlify-tests/pom.xml to org.aksw.sparqlify/sparqlify-tests/0.9.1-SNAPSHOT/sparqlify-tests-0.9.1-SNAPSHOT.pom
[JENKINS] Archiving /usr/share/tomcat8/.jenkins/jobs/Sparqlify/workspace/sparqlify-web-admin-server/pom.xml to org.aksw.sparqlify/sparqlify-web-admin-server/0.9.1-SNAPSHOT/sparqlify-web-admin-server-0.9.1-SNAPSHOT.pom
[JENKINS] Archiving /usr/share/tomcat8/.jenkins/jobs/Sparqlify/workspace/sparqlify-nexus-deploy-workaround/pom.xml to org.aksw.sparqlify/sparqlify-nexus-deploy-workaround/0.9.1-SNAPSHOT/sparqlify-nexus-deploy-workaround-0.9.1-SNAPSHOT.pom
[JENKINS] Archiving /usr/share/tomcat8/.jenkins/jobs/Sparqlify/workspace/sparqlify-benchmark/pom.xml to org.aksw.sparqlify/sparqlify-benchmark/0.9.1-SNAPSHOT/sparqlify-benchmark-0.9.1-SNAPSHOT.pom
[JENKINS] Archiving /usr/share/tomcat8/.jenkins/jobs/Sparqlify/workspace/obda-api-parent/obda-api-examples/pom.xml to org.aksw.sparqlify/obda-api-examples/0.9.1-SNAPSHOT/obda-api-examples-0.9.1-SNAPSHOT.pom
[JENKINS] Archiving /usr/share/tomcat8/.jenkins/jobs/Sparqlify/workspace/sparqlify-debian-cli/pom.xml to org.aksw.sparqlify/sparqlify-debian-cli/0.9.1-SNAPSHOT/sparqlify-debian-cli-0.9.1-SNAPSHOT.pom
[JENKINS] Archiving /usr/share/tomcat8/.jenkins/jobs/Sparqlify/workspace/obda-api-parent/obda-api-r2rml/pom.xml to org.aksw.sparqlify/obda-api-r2rml/0.9.1-SNAPSHOT/obda-api-r2rml-0.9.1-SNAPSHOT.pom
[JENKINS] Archiving /usr/share/tomcat8/.jenkins/jobs/Sparqlify/workspace/obda-api-parent/obda-api-core/pom.xml to org.aksw.sparqlify/obda-api-core/0.9.1-SNAPSHOT/obda-api-core-0.9.1-SNAPSHOT.pom
[JENKINS] Archiving /usr/share/tomcat8/.jenkins/jobs/Sparqlify/workspace/sparqlify-core/pom.xml to org.aksw.sparqlify/sparqlify-core/0.9.1-SNAPSHOT/sparqlify-core-0.9.1-SNAPSHOT.pom
[JENKINS] Archiving /usr/share/tomcat8/.jenkins/jobs/Sparqlify/workspace/obda-api-parent/pom.xml to org.aksw.sparqlify/obda-api-parent/0.9.1-SNAPSHOT/obda-api-parent-0.9.1-SNAPSHOT.pom
[JENKINS] Archiving /usr/share/tomcat8/.jenkins/jobs/Sparqlify/workspace/sparqlify-debian-tomcat8/pom.xml to org.aksw.sparqlify/sparqlify-debian-tomcat8/0.9.1-SNAPSHOT/sparqlify-debian-tomcat8-0.9.1-SNAPSHOT.pom
[JENKINS] Archiving /usr/share/tomcat8/.jenkins/jobs/Sparqlify/workspace/sparqlify-debian-tomcat7/pom.xml to org.aksw.sparqlify/sparqlify-debian-tomcat7/0.9.1-SNAPSHOT/sparqlify-debian-tomcat7-0.9.1-SNAPSHOT.pom
No mail will be sent out, as 'Sparqlify » Sparqlify - Debian Packaging - Tomcat Common #353' does not have a result yet. Please make sure you set a proper result in case of pipeline/build scripts.
No mail will be sent out, as 'Sparqlify » obda-api-bundle #353' does not have a result yet. Please make sure you set a proper result in case of pipeline/build scripts.
No mail will be sent out, as 'Sparqlify » Sparqlify SPARQL->SQL rewriter - Type System #353' does not have a result yet. Please make sure you set a proper result in case of pipeline/build scripts.
No mail will be sent out, as 'Sparqlify » obda-api-sml #353' does not have a result yet. Please make sure you set a proper result in case of pipeline/build scripts.
No mail will be sent out, as 'Sparqlify » Sparqlify SPARQL->SQL rewriter - JPA Mapper #353' does not have a result yet. Please make sure you set a proper result in case of pipeline/build scripts.
No mail will be sent out, as 'Sparqlify » Sparqlify SPARQL->SQL rewriter - Cli #353' does not have a result yet. Please make sure you set a proper result in case of pipeline/build scripts.
No mail will be sent out, as 'Sparqlify » Sparqlify SPARQL->SQL rewriter - Platform #353' does not have a result yet. Please make sure you set a proper result in case of pipeline/build scripts.
No mail will be sent out, as 'Sparqlify » Sparqlify SPARQL->SQL rewriter - Tests #353' does not have a result yet. Please make sure you set a proper result in case of pipeline/build scripts.
No mail will be sent out, as 'Sparqlify » Sparqlify SPARQL->SQL rewriter - Web Admin Server #353' does not have a result yet. Please make sure you set a proper result in case of pipeline/build scripts.
No mail will be sent out, as 'Sparqlify » Sparqlify - Nexus Deploy Workaround #353' does not have a result yet. Please make sure you set a proper result in case of pipeline/build scripts.
No mail will be sent out, as 'Sparqlify » Sparqlify SPARQL->SQL rewriter - Tests #353' does not have a result yet. Please make sure you set a proper result in case of pipeline/build scripts.
No mail will be sent out, as 'Sparqlify » obda-api-examples #353' does not have a result yet. Please make sure you set a proper result in case of pipeline/build scripts.
No mail will be sent out, as 'Sparqlify » Sparqlify - Debian Packaging - Cli #353' does not have a result yet. Please make sure you set a proper result in case of pipeline/build scripts.
No mail will be sent out, as 'Sparqlify » obda-api-r2rml #353' does not have a result yet. Please make sure you set a proper result in case of pipeline/build scripts.
Sending e-mails to: cstadler@informatik.uni-leipzig.de
No mail will be sent out, as 'Sparqlify » Sparqlify SPARQL->SQL rewriter - Core #353' does not have a result yet. Please make sure you set a proper result in case of pipeline/build scripts.
No mail will be sent out, as 'Sparqlify » Sparqlify - Debian Packaging - Tomcat8 #353' does not have a result yet. Please make sure you set a proper result in case of pipeline/build scripts.
No mail will be sent out, as 'Sparqlify » Sparqlify - Debian Packaging - Tomcat7 #353' does not have a result yet. Please make sure you set a proper result in case of pipeline/build scripts.
channel stopped
Archiving artifacts
Sending e-mails to: cstadler@informatik.uni-leipzig.de
Finished: FAILURE