SuccessConsole Output

Established TCP socket on 33107
NOTE: Picked up JDK_JAVA_OPTIONS:  --add-opens=java.base/java.lang=ALL-UNNAMED --add-opens=java.base/java.io=ALL-UNNAMED --add-opens=java.rmi/sun.rmi.transport=ALL-UNNAMED
<===[JENKINS REMOTING CAPACITY]===>channel started
Executing Maven:  -B -f /usr/share/tomcat8/.jenkins/jobs/sparql-integrate/workspace/pom.xml -gs /tmp/tomcat8-tomcat8-tmp/global-settings13808278580964364900.xml -U clean install
[INFO] Scanning for projects...
[INFO] Inspecting build with total of 8 modules...
[INFO] Installing Nexus Staging features:
[INFO]   ... total of 3 executions of maven-deploy-plugin replaced with nexus-staging-maven-plugin
[INFO] ------------------------------------------------------------------------
[INFO] Reactor Build Order:
[INFO] 
[INFO] RDF Processing Toolkit                                             [pom]
[INFO] rdf-processing-toolkit-cli                                         [jar]
[INFO] rdf-processing-toolkit-pkg-parent                                  [pom]
[INFO] rdf-processing-toolkit-pkg-deb-cli                                 [jar]
[INFO] rdf-processing-toolkit-pkg-rpm-cli                                 [rpm]
[INFO] rdf-processing-toolkit-pkg-docker-cli                              [jar]
[INFO] rdf-processing-toolkit-pkg-uberjar-cli                             [jar]
[INFO] rdf-processing-toolkit-pkg-dummy                                   [jar]
[INFO] 
[INFO] ---< org.aksw.rdf-processing-toolkit:rdf-processing-toolkit-parent >----
[INFO] Building RDF Processing Toolkit 1.9.1-SNAPSHOT                     [1/8]
[INFO] --------------------------------[ pom ]---------------------------------
[INFO] 
[INFO] --- maven-clean-plugin:2.5:clean (default-clean) @ rdf-processing-toolkit-parent ---
[INFO] 
[INFO] --- maven-javadoc-plugin:2.9.1:jar (attach-javadocs) @ rdf-processing-toolkit-parent ---
[INFO] Not executing Javadoc as the project is not a Java classpath-capable package
[INFO] 
[INFO] --- maven-source-plugin:3.0.1:jar-no-fork (attach-sources) @ rdf-processing-toolkit-parent ---
[INFO] 
[INFO] --- maven-install-plugin:2.4:install (default-install) @ rdf-processing-toolkit-parent ---
[INFO] Installing /usr/share/tomcat8/.jenkins/jobs/sparql-integrate/workspace/pom.xml to /usr/share/tomcat8/.m2/repository/org/aksw/rdf-processing-toolkit/rdf-processing-toolkit-parent/1.9.1-SNAPSHOT/rdf-processing-toolkit-parent-1.9.1-SNAPSHOT.pom
[INFO] ------------------------------------------------------------------------
[INFO] Reactor Summary for RDF Processing Toolkit 1.9.1-SNAPSHOT:
[INFO] 
[INFO] RDF Processing Toolkit ............................. SUCCESS [  8.995 s]
[INFO] rdf-processing-toolkit-cli ......................... FAILURE [02:27 min]
[INFO] rdf-processing-toolkit-pkg-parent .................. SKIPPED
[INFO] rdf-processing-toolkit-pkg-deb-cli ................. SKIPPED
[INFO] rdf-processing-toolkit-pkg-rpm-cli ................. SKIPPED
[INFO] rdf-processing-toolkit-pkg-docker-cli .............. SKIPPED
[INFO] rdf-processing-toolkit-pkg-uberjar-cli ............. SKIPPED
[INFO] rdf-processing-toolkit-pkg-dummy ................... SKIPPED
[INFO] ------------------------------------------------------------------------
[INFO] BUILD FAILURE
[INFO] ------------------------------------------------------------------------
[INFO] Total time:  02:56 min
[INFO] Finished at: 2022-05-14T16:29:12+02:00
[INFO] ------------------------------------------------------------------------
Waiting for Jenkins to finish collecting data
[ERROR] Failed to execute goal org.apache.maven.plugins:maven-compiler-plugin:3.6.0:compile (default-compile) on project rdf-processing-toolkit-cli: Compilation failure: Compilation failure:
[ERROR] /usr/share/tomcat8/.jenkins/jobs/sparql-integrate/workspace/rdf-processing-toolkit-cli/src/main/java/org/aksw/sparql_integrate/cli/main/SparqlIntegrateCmdImpls.java:[47,39] cannot find symbol
[ERROR] symbol:   class QueryExecs
[ERROR] location: package org.aksw.jenax.connection.query
[ERROR] /usr/share/tomcat8/.jenkins/jobs/sparql-integrate/workspace/rdf-processing-toolkit-cli/src/main/java/org/aksw/sparql_integrate/cli/main/SparqlIntegrateCmdImpls.java:[362,84] cannot find symbol
[ERROR] symbol:   variable QueryExecs
[ERROR] location: class org.aksw.sparql_integrate.cli.main.SparqlIntegrateCmdImpls
[ERROR] -> [Help 1]
[ERROR] 
[ERROR] To see the full stack trace of the errors, re-run Maven with the -e switch.
[ERROR] Re-run Maven using the -X switch to enable full debug logging.
[ERROR] 
[ERROR] For more information about the errors and possible solutions, please read the following articles:
[ERROR] [Help 1] http://cwiki.apache.org/confluence/display/MAVEN/MojoFailureException
[ERROR] 
[ERROR] After correcting the problems, you can resume the build with the command
[ERROR]   mvn <goals> -rf :rdf-processing-toolkit-cli