SuccessConsole Output

Skipping 59 KB.. Full Log
adata.xml
[INFO] Downloaded from maven.aksw.snapshots: https://maven.aksw.org/repository/snapshots/org/aksw/commons/aksw-commons-txn/0.9.4-SNAPSHOT/maven-metadata.xml (0 B at 0 B/s)
[INFO] Downloading from maven.aksw.internal: https://maven.aksw.org/repository/internal/org/aksw/commons/aksw-commons-rx-ex/0.9.4-SNAPSHOT/maven-metadata.xml
[INFO] Downloading from maven.aksw.snapshots: https://maven.aksw.org/repository/snapshots/org/aksw/commons/aksw-commons-rx-ex/0.9.4-SNAPSHOT/maven-metadata.xml
[INFO] Downloading from apache-repo-snapshots: https://repository.apache.org/content/repositories/snapshots/org/aksw/commons/aksw-commons-rx-ex/0.9.4-SNAPSHOT/maven-metadata.xml
[INFO] Downloaded from maven.aksw.snapshots: https://maven.aksw.org/repository/snapshots/org/aksw/commons/aksw-commons-rx-ex/0.9.4-SNAPSHOT/maven-metadata.xml (0 B at 0 B/s)
[INFO] Downloading from maven.aksw.internal: https://maven.aksw.org/repository/internal/org/aksw/jenax/jenax-io-kryo/4.5.0-1-SNAPSHOT/maven-metadata.xml
[INFO] Downloading from maven.aksw.snapshots: https://maven.aksw.org/repository/snapshots/org/aksw/jenax/jenax-io-kryo/4.5.0-1-SNAPSHOT/maven-metadata.xml
[INFO] Downloading from apache-repo-snapshots: https://repository.apache.org/content/repositories/snapshots/org/aksw/jenax/jenax-io-kryo/4.5.0-1-SNAPSHOT/maven-metadata.xml
[INFO] Downloaded from maven.aksw.snapshots: https://maven.aksw.org/repository/snapshots/org/aksw/jenax/jenax-io-kryo/4.5.0-1-SNAPSHOT/maven-metadata.xml (0 B at 0 B/s)
[INFO] Downloading from maven.aksw.internal: https://maven.aksw.org/repository/internal/org/aksw/jenax/jenax-io-json/4.5.0-1-SNAPSHOT/maven-metadata.xml
[INFO] Downloading from maven.aksw.snapshots: https://maven.aksw.org/repository/snapshots/org/aksw/jenax/jenax-io-json/4.5.0-1-SNAPSHOT/maven-metadata.xml
[INFO] Downloading from apache-repo-snapshots: https://repository.apache.org/content/repositories/snapshots/org/aksw/jenax/jenax-io-json/4.5.0-1-SNAPSHOT/maven-metadata.xml
[INFO] Downloaded from maven.aksw.snapshots: https://maven.aksw.org/repository/snapshots/org/aksw/jenax/jenax-io-json/4.5.0-1-SNAPSHOT/maven-metadata.xml (367 B at 37 kB/s)
[INFO] Downloading from maven.aksw.internal: https://maven.aksw.org/repository/internal/org/aksw/jenax/jenax-io-json/4.5.0-1-SNAPSHOT/jenax-io-json-4.5.0-1-20220427.125535-25.pom
[INFO] Downloading from maven.aksw.snapshots: https://maven.aksw.org/repository/snapshots/org/aksw/jenax/jenax-io-json/4.5.0-1-SNAPSHOT/jenax-io-json-4.5.0-1-20220427.125535-25.pom
[INFO] Downloaded from maven.aksw.snapshots: https://maven.aksw.org/repository/snapshots/org/aksw/jenax/jenax-io-json/4.5.0-1-SNAPSHOT/jenax-io-json-4.5.0-1-20220427.125535-25.pom (0 B at 0 B/s)
[INFO] Downloading from maven.aksw.internal: https://maven.aksw.org/repository/internal/org/aksw/commons/aksw-commons-io-process-pipes/0.9.4-SNAPSHOT/maven-metadata.xml
[INFO] Downloading from maven.aksw.snapshots: https://maven.aksw.org/repository/snapshots/org/aksw/commons/aksw-commons-io-process-pipes/0.9.4-SNAPSHOT/maven-metadata.xml
[INFO] Downloading from apache-repo-snapshots: https://repository.apache.org/content/repositories/snapshots/org/aksw/commons/aksw-commons-io-process-pipes/0.9.4-SNAPSHOT/maven-metadata.xml
[INFO] Downloaded from maven.aksw.snapshots: https://maven.aksw.org/repository/snapshots/org/aksw/commons/aksw-commons-io-process-pipes/0.9.4-SNAPSHOT/maven-metadata.xml (0 B at 0 B/s)
[INFO] Downloading from maven.aksw.internal: https://maven.aksw.org/repository/internal/org/aksw/jenax/jenax-fsrdfstore-system/4.5.0-1-SNAPSHOT/maven-metadata.xml
[INFO] Downloading from maven.aksw.snapshots: https://maven.aksw.org/repository/snapshots/org/aksw/jenax/jenax-fsrdfstore-system/4.5.0-1-SNAPSHOT/maven-metadata.xml
[INFO] Downloading from apache-repo-snapshots: https://repository.apache.org/content/repositories/snapshots/org/aksw/jenax/jenax-fsrdfstore-system/4.5.0-1-SNAPSHOT/maven-metadata.xml
[INFO] Downloaded from maven.aksw.snapshots: https://maven.aksw.org/repository/snapshots/org/aksw/jenax/jenax-fsrdfstore-system/4.5.0-1-SNAPSHOT/maven-metadata.xml (0 B at 0 B/s)
[INFO] Downloading from maven.aksw.internal: https://maven.aksw.org/repository/internal/org/aksw/jenax/jenax-fsrdfstore-system/4.5.0-1-SNAPSHOT/jenax-fsrdfstore-system-4.5.0-1-20220427.125535-30.pom
[INFO] Downloading from maven.aksw.snapshots: https://maven.aksw.org/repository/snapshots/org/aksw/jenax/jenax-fsrdfstore-system/4.5.0-1-SNAPSHOT/jenax-fsrdfstore-system-4.5.0-1-20220427.125535-30.pom
[INFO] Downloaded from maven.aksw.snapshots: https://maven.aksw.org/repository/snapshots/org/aksw/jenax/jenax-fsrdfstore-system/4.5.0-1-SNAPSHOT/jenax-fsrdfstore-system-4.5.0-1-20220427.125535-30.pom (0 B at 0 B/s)
[INFO] Downloading from maven.aksw.snapshots: https://maven.aksw.org/repository/snapshots/org/aksw/jenax/jenax-fsrdfstore-parent/4.5.0-1-SNAPSHOT/maven-metadata.xml
[INFO] Downloading from maven.aksw.internal: https://maven.aksw.org/repository/internal/org/aksw/jenax/jenax-fsrdfstore-parent/4.5.0-1-SNAPSHOT/maven-metadata.xml
[INFO] Downloading from apache-repo-snapshots: https://repository.apache.org/content/repositories/snapshots/org/aksw/jenax/jenax-fsrdfstore-parent/4.5.0-1-SNAPSHOT/maven-metadata.xml
[INFO] Downloaded from maven.aksw.snapshots: https://maven.aksw.org/repository/snapshots/org/aksw/jenax/jenax-fsrdfstore-parent/4.5.0-1-SNAPSHOT/maven-metadata.xml (377 B at 42 kB/s)
[INFO] Downloading from maven.aksw.snapshots: https://maven.aksw.org/repository/snapshots/org/aksw/jenax/jenax-server-standalone/4.5.0-1-SNAPSHOT/maven-metadata.xml
[INFO] Downloading from apache-repo-snapshots: https://repository.apache.org/content/repositories/snapshots/org/aksw/jenax/jenax-server-standalone/4.5.0-1-SNAPSHOT/maven-metadata.xml
[INFO] Downloading from maven.aksw.internal: https://maven.aksw.org/repository/internal/org/aksw/jenax/jenax-server-standalone/4.5.0-1-SNAPSHOT/maven-metadata.xml
[INFO] Downloaded from maven.aksw.snapshots: https://maven.aksw.org/repository/snapshots/org/aksw/jenax/jenax-server-standalone/4.5.0-1-SNAPSHOT/maven-metadata.xml (377 B at 7.5 kB/s)
[INFO] Downloading from maven.aksw.internal: https://maven.aksw.org/repository/internal/org/aksw/jenax/jenax-server-standalone/4.5.0-1-SNAPSHOT/jenax-server-standalone-4.5.0-1-20220427.125535-32.pom
[INFO] Downloading from maven.aksw.snapshots: https://maven.aksw.org/repository/snapshots/org/aksw/jenax/jenax-server-standalone/4.5.0-1-SNAPSHOT/jenax-server-standalone-4.5.0-1-20220427.125535-32.pom
[INFO] Downloaded from maven.aksw.snapshots: https://maven.aksw.org/repository/snapshots/org/aksw/jenax/jenax-server-standalone/4.5.0-1-SNAPSHOT/jenax-server-standalone-4.5.0-1-20220427.125535-32.pom (0 B at 0 B/s)
[INFO] Downloading from maven.aksw.internal: https://maven.aksw.org/repository/internal/org/aksw/jenax/jenax-server-parent/4.5.0-1-SNAPSHOT/maven-metadata.xml
[INFO] Downloading from maven.aksw.snapshots: https://maven.aksw.org/repository/snapshots/org/aksw/jenax/jenax-server-parent/4.5.0-1-SNAPSHOT/maven-metadata.xml
[INFO] Downloading from apache-repo-snapshots: https://repository.apache.org/content/repositories/snapshots/org/aksw/jenax/jenax-server-parent/4.5.0-1-SNAPSHOT/maven-metadata.xml
[INFO] Downloaded from maven.aksw.snapshots: https://maven.aksw.org/repository/snapshots/org/aksw/jenax/jenax-server-parent/4.5.0-1-SNAPSHOT/maven-metadata.xml (373 B at 41 kB/s)
[INFO] Downloading from maven.aksw.internal: https://maven.aksw.org/repository/internal/org/aksw/jenax/jenax-server-frontends/4.5.0-1-SNAPSHOT/maven-metadata.xml
[INFO] Downloading from maven.aksw.snapshots: https://maven.aksw.org/repository/snapshots/org/aksw/jenax/jenax-server-frontends/4.5.0-1-SNAPSHOT/maven-metadata.xml
[INFO] Downloading from apache-repo-snapshots: https://repository.apache.org/content/repositories/snapshots/org/aksw/jenax/jenax-server-frontends/4.5.0-1-SNAPSHOT/maven-metadata.xml
[INFO] Downloaded from maven.aksw.snapshots: https://maven.aksw.org/repository/snapshots/org/aksw/jenax/jenax-server-frontends/4.5.0-1-SNAPSHOT/maven-metadata.xml (376 B at 4.2 kB/s)
[INFO] Downloading from maven.aksw.internal: https://maven.aksw.org/repository/internal/org/aksw/jenax/jenax-server-frontends/4.5.0-1-SNAPSHOT/jenax-server-frontends-4.5.0-1-20220427.125535-32.pom
[INFO] Downloading from maven.aksw.snapshots: https://maven.aksw.org/repository/snapshots/org/aksw/jenax/jenax-server-frontends/4.5.0-1-SNAPSHOT/jenax-server-frontends-4.5.0-1-20220427.125535-32.pom
[INFO] Downloaded from maven.aksw.snapshots: https://maven.aksw.org/repository/snapshots/org/aksw/jenax/jenax-server-frontends/4.5.0-1-SNAPSHOT/jenax-server-frontends-4.5.0-1-20220427.125535-32.pom (5.8 kB at 155 kB/s)
[INFO] Downloading from maven.aksw.internal: https://maven.aksw.org/repository/internal/org/aksw/jenax/jenax-server-core/4.5.0-1-SNAPSHOT/maven-metadata.xml
[INFO] Downloading from maven.aksw.snapshots: https://maven.aksw.org/repository/snapshots/org/aksw/jenax/jenax-server-core/4.5.0-1-SNAPSHOT/maven-metadata.xml
[INFO] Downloading from apache-repo-snapshots: https://repository.apache.org/content/repositories/snapshots/org/aksw/jenax/jenax-server-core/4.5.0-1-SNAPSHOT/maven-metadata.xml
[INFO] Downloaded from maven.aksw.snapshots: https://maven.aksw.org/repository/snapshots/org/aksw/jenax/jenax-server-core/4.5.0-1-SNAPSHOT/maven-metadata.xml (371 B at 7.7 kB/s)
[INFO] Downloading from maven.aksw.internal: https://maven.aksw.org/repository/internal/org/aksw/jenax/jenax-server-core/4.5.0-1-SNAPSHOT/jenax-server-core-4.5.0-1-20220427.125535-32.pom
[INFO] Downloading from maven.aksw.snapshots: https://maven.aksw.org/repository/snapshots/org/aksw/jenax/jenax-server-core/4.5.0-1-SNAPSHOT/jenax-server-core-4.5.0-1-20220427.125535-32.pom
[INFO] Downloaded from maven.aksw.snapshots: https://maven.aksw.org/repository/snapshots/org/aksw/jenax/jenax-server-core/4.5.0-1-SNAPSHOT/jenax-server-core-4.5.0-1-20220427.125535-32.pom (6.0 kB at 100 kB/s)
[INFO] Downloading from maven.aksw.internal: https://maven.aksw.org/repository/internal/org/aksw/jenax/jenax-fsrdfstore-facade/4.5.0-1-SNAPSHOT/maven-metadata.xml
[INFO] Downloading from maven.aksw.snapshots: https://maven.aksw.org/repository/snapshots/org/aksw/jenax/jenax-fsrdfstore-facade/4.5.0-1-SNAPSHOT/maven-metadata.xml
[INFO] Downloading from apache-repo-snapshots: https://repository.apache.org/content/repositories/snapshots/org/aksw/jenax/jenax-fsrdfstore-facade/4.5.0-1-SNAPSHOT/maven-metadata.xml
[INFO] Downloaded from maven.aksw.snapshots: https://maven.aksw.org/repository/snapshots/org/aksw/jenax/jenax-fsrdfstore-facade/4.5.0-1-SNAPSHOT/maven-metadata.xml (0 B at 0 B/s)
[INFO] Downloading from maven.aksw.internal: https://maven.aksw.org/repository/internal/org/aksw/jenax/jenax-fsrdfstore-core/4.5.0-1-SNAPSHOT/maven-metadata.xml
[INFO] Downloading from maven.aksw.snapshots: https://maven.aksw.org/repository/snapshots/org/aksw/jenax/jenax-fsrdfstore-core/4.5.0-1-SNAPSHOT/maven-metadata.xml
[INFO] Downloading from apache-repo-snapshots: https://repository.apache.org/content/repositories/snapshots/org/aksw/jenax/jenax-fsrdfstore-core/4.5.0-1-SNAPSHOT/maven-metadata.xml
[INFO] Downloaded from maven.aksw.snapshots: https://maven.aksw.org/repository/snapshots/org/aksw/jenax/jenax-fsrdfstore-core/4.5.0-1-SNAPSHOT/maven-metadata.xml (0 B at 0 B/s)
[INFO] Downloading from maven.aksw.internal: https://maven.aksw.org/repository/internal/org/aksw/jenax/jenax-jgrapht-bindings/4.5.0-1-SNAPSHOT/maven-metadata.xml
[INFO] Downloading from maven.aksw.snapshots: https://maven.aksw.org/repository/snapshots/org/aksw/jenax/jenax-jgrapht-bindings/4.5.0-1-SNAPSHOT/maven-metadata.xml
[INFO] Downloading from apache-repo-snapshots: https://repository.apache.org/content/repositories/snapshots/org/aksw/jenax/jenax-jgrapht-bindings/4.5.0-1-SNAPSHOT/maven-metadata.xml
[INFO] Downloaded from maven.aksw.snapshots: https://maven.aksw.org/repository/snapshots/org/aksw/jenax/jenax-jgrapht-bindings/4.5.0-1-SNAPSHOT/maven-metadata.xml (0 B at 0 B/s)
[INFO] Downloading from maven.aksw.internal: https://maven.aksw.org/repository/internal/org/aksw/jenax/jenax-jgrapht-parent/4.5.0-1-SNAPSHOT/maven-metadata.xml
[INFO] Downloading from maven.aksw.snapshots: https://maven.aksw.org/repository/snapshots/org/aksw/jenax/jenax-jgrapht-parent/4.5.0-1-SNAPSHOT/maven-metadata.xml
[INFO] Downloading from apache-repo-snapshots: https://repository.apache.org/content/repositories/snapshots/org/aksw/jenax/jenax-jgrapht-parent/4.5.0-1-SNAPSHOT/maven-metadata.xml
[INFO] Downloaded from maven.aksw.snapshots: https://maven.aksw.org/repository/snapshots/org/aksw/jenax/jenax-jgrapht-parent/4.5.0-1-SNAPSHOT/maven-metadata.xml (374 B at 29 kB/s)
[INFO] Downloading from maven.aksw.internal: https://maven.aksw.org/repository/internal/org/aksw/jenax/jenax-arq-datasets-diff/4.5.0-1-SNAPSHOT/maven-metadata.xml
[INFO] Downloading from apache-repo-snapshots: https://repository.apache.org/content/repositories/snapshots/org/aksw/jenax/jenax-arq-datasets-diff/4.5.0-1-SNAPSHOT/maven-metadata.xml
[INFO] Downloading from maven.aksw.snapshots: https://maven.aksw.org/repository/snapshots/org/aksw/jenax/jenax-arq-datasets-diff/4.5.0-1-SNAPSHOT/maven-metadata.xml
[INFO] Downloaded from maven.aksw.snapshots: https://maven.aksw.org/repository/snapshots/org/aksw/jenax/jenax-arq-datasets-diff/4.5.0-1-SNAPSHOT/maven-metadata.xml (0 B at 0 B/s)
[INFO] Downloading from maven.aksw.snapshots: https://maven.aksw.org/repository/snapshots/org/aksw/jenax/jenax-rx-dataaccess/4.5.0-1-SNAPSHOT/maven-metadata.xml
[INFO] Downloading from maven.aksw.internal: https://maven.aksw.org/repository/internal/org/aksw/jenax/jenax-rx-dataaccess/4.5.0-1-SNAPSHOT/maven-metadata.xml
[INFO] Downloading from apache-repo-snapshots: https://repository.apache.org/content/repositories/snapshots/org/aksw/jenax/jenax-rx-dataaccess/4.5.0-1-SNAPSHOT/maven-metadata.xml
[INFO] Downloaded from maven.aksw.snapshots: https://maven.aksw.org/repository/snapshots/org/aksw/jenax/jenax-rx-dataaccess/4.5.0-1-SNAPSHOT/maven-metadata.xml (0 B at 0 B/s)
[INFO] Downloading from maven.aksw.internal: https://maven.aksw.org/repository/internal/org/aksw/jenax/jenax-rx-dataaccess/4.5.0-1-SNAPSHOT/jenax-rx-dataaccess-4.5.0-1-20220427.125535-31.pom
[INFO] Downloading from maven.aksw.snapshots: https://maven.aksw.org/repository/snapshots/org/aksw/jenax/jenax-rx-dataaccess/4.5.0-1-SNAPSHOT/jenax-rx-dataaccess-4.5.0-1-20220427.125535-31.pom
[INFO] Downloaded from maven.aksw.snapshots: https://maven.aksw.org/repository/snapshots/org/aksw/jenax/jenax-rx-dataaccess/4.5.0-1-SNAPSHOT/jenax-rx-dataaccess-4.5.0-1-20220427.125535-31.pom (4.8 kB at 537 kB/s)
[INFO] Downloading from maven.aksw.internal: https://maven.aksw.org/repository/internal/org/aksw/jenax/jenax-rx-parent/4.5.0-1-SNAPSHOT/maven-metadata.xml
[INFO] Downloading from maven.aksw.snapshots: https://maven.aksw.org/repository/snapshots/org/aksw/jenax/jenax-rx-parent/4.5.0-1-SNAPSHOT/maven-metadata.xml
[INFO] Downloading from apache-repo-snapshots: https://repository.apache.org/content/repositories/snapshots/org/aksw/jenax/jenax-rx-parent/4.5.0-1-SNAPSHOT/maven-metadata.xml
[INFO] Downloaded from maven.aksw.snapshots: https://maven.aksw.org/repository/snapshots/org/aksw/jenax/jenax-rx-parent/4.5.0-1-SNAPSHOT/maven-metadata.xml (0 B at 0 B/s)
[INFO] Downloading from maven.aksw.internal: https://maven.aksw.org/repository/internal/org/aksw/jenax/jenax-analytics-core/4.5.0-1-SNAPSHOT/maven-metadata.xml
[INFO] Downloading from maven.aksw.snapshots: https://maven.aksw.org/repository/snapshots/org/aksw/jenax/jenax-analytics-core/4.5.0-1-SNAPSHOT/maven-metadata.xml
[INFO] Downloading from apache-repo-snapshots: https://repository.apache.org/content/repositories/snapshots/org/aksw/jenax/jenax-analytics-core/4.5.0-1-SNAPSHOT/maven-metadata.xml
[INFO] Downloaded from maven.aksw.snapshots: https://maven.aksw.org/repository/snapshots/org/aksw/jenax/jenax-analytics-core/4.5.0-1-SNAPSHOT/maven-metadata.xml (0 B at 0 B/s)
[INFO] Downloading from maven.aksw.internal: https://maven.aksw.org/repository/internal/org/aksw/jenax/jenax-analytics-parent/4.5.0-1-SNAPSHOT/maven-metadata.xml
[INFO] Downloading from maven.aksw.snapshots: https://maven.aksw.org/repository/snapshots/org/aksw/jenax/jenax-analytics-parent/4.5.0-1-SNAPSHOT/maven-metadata.xml
[INFO] Downloading from apache-repo-snapshots: https://repository.apache.org/content/repositories/snapshots/org/aksw/jenax/jenax-analytics-parent/4.5.0-1-SNAPSHOT/maven-metadata.xml
[INFO] Downloaded from maven.aksw.snapshots: https://maven.aksw.org/repository/snapshots/org/aksw/jenax/jenax-analytics-parent/4.5.0-1-SNAPSHOT/maven-metadata.xml (376 B at 47 kB/s)
[INFO] Downloading from maven.aksw.snapshots: https://maven.aksw.org/repository/snapshots/org/aksw/jenax/jenax-arq-entityquery/4.5.0-1-SNAPSHOT/maven-metadata.xml
[INFO] Downloading from maven.aksw.internal: https://maven.aksw.org/repository/internal/org/aksw/jenax/jenax-arq-entityquery/4.5.0-1-SNAPSHOT/maven-metadata.xml
[INFO] Downloading from apache-repo-snapshots: https://repository.apache.org/content/repositories/snapshots/org/aksw/jenax/jenax-arq-entityquery/4.5.0-1-SNAPSHOT/maven-metadata.xml
[INFO] Downloaded from maven.aksw.snapshots: https://maven.aksw.org/repository/snapshots/org/aksw/jenax/jenax-arq-entityquery/4.5.0-1-SNAPSHOT/maven-metadata.xml (0 B at 0 B/s)
[INFO] Downloading from maven.aksw.internal: https://maven.aksw.org/repository/internal/org/aksw/jenax/jenax-arq-quadengine/4.5.0-1-SNAPSHOT/maven-metadata.xml
[INFO] Downloading from maven.aksw.snapshots: https://maven.aksw.org/repository/snapshots/org/aksw/jenax/jenax-arq-quadengine/4.5.0-1-SNAPSHOT/maven-metadata.xml
[INFO] Downloading from apache-repo-snapshots: https://repository.apache.org/content/repositories/snapshots/org/aksw/jenax/jenax-arq-quadengine/4.5.0-1-SNAPSHOT/maven-metadata.xml
[INFO] Downloaded from maven.aksw.snapshots: https://maven.aksw.org/repository/snapshots/org/aksw/jenax/jenax-arq-quadengine/4.5.0-1-SNAPSHOT/maven-metadata.xml (0 B at 0 B/s)
[INFO] Downloading from maven.aksw.internal: https://maven.aksw.org/repository/internal/org/aksw/jenax/jenax-arq-quadengine/4.5.0-1-SNAPSHOT/jenax-arq-quadengine-4.5.0-1-20220427.125535-32.pom
[INFO] Downloading from maven.aksw.snapshots: https://maven.aksw.org/repository/snapshots/org/aksw/jenax/jenax-arq-quadengine/4.5.0-1-SNAPSHOT/jenax-arq-quadengine-4.5.0-1-20220427.125535-32.pom
[INFO] Downloaded from maven.aksw.snapshots: https://maven.aksw.org/repository/snapshots/org/aksw/jenax/jenax-arq-quadengine/4.5.0-1-SNAPSHOT/jenax-arq-quadengine-4.5.0-1-20220427.125535-32.pom (956 B at 106 kB/s)
[INFO] Downloading from maven.aksw.snapshots: https://maven.aksw.org/repository/snapshots/net/sansa-stack/sansa-spark-jena-java_2.12/0.8.0-RC3-SNAPSHOT/maven-metadata.xml
[INFO] Downloading from maven.aksw.internal: https://maven.aksw.org/repository/internal/net/sansa-stack/sansa-spark-jena-java_2.12/0.8.0-RC3-SNAPSHOT/maven-metadata.xml
[INFO] Downloading from apache-repo-snapshots: https://repository.apache.org/content/repositories/snapshots/net/sansa-stack/sansa-spark-jena-java_2.12/0.8.0-RC3-SNAPSHOT/maven-metadata.xml
[INFO] Downloaded from maven.aksw.snapshots: https://maven.aksw.org/repository/snapshots/net/sansa-stack/sansa-spark-jena-java_2.12/0.8.0-RC3-SNAPSHOT/maven-metadata.xml (0 B at 0 B/s)
[INFO] Downloading from maven.aksw.internal: https://maven.aksw.org/repository/internal/net/sansa-stack/sansa-parent_2.12/0.8.0-RC3-SNAPSHOT/maven-metadata.xml
[INFO] Downloading from maven.aksw.snapshots: https://maven.aksw.org/repository/snapshots/net/sansa-stack/sansa-parent_2.12/0.8.0-RC3-SNAPSHOT/maven-metadata.xml
[INFO] Downloading from apache-repo-snapshots: https://repository.apache.org/content/repositories/snapshots/net/sansa-stack/sansa-parent_2.12/0.8.0-RC3-SNAPSHOT/maven-metadata.xml
[INFO] Downloaded from maven.aksw.snapshots: https://maven.aksw.org/repository/snapshots/net/sansa-stack/sansa-parent_2.12/0.8.0-RC3-SNAPSHOT/maven-metadata.xml (0 B at 0 B/s)
[INFO] Downloading from maven.aksw.internal: https://maven.aksw.org/repository/internal/net/sansa-stack/sansa-hadoop-jena/0.8.0-RC3-SNAPSHOT/maven-metadata.xml
[INFO] Downloading from maven.aksw.snapshots: https://maven.aksw.org/repository/snapshots/net/sansa-stack/sansa-hadoop-jena/0.8.0-RC3-SNAPSHOT/maven-metadata.xml
[INFO] Downloading from apache-repo-snapshots: https://repository.apache.org/content/repositories/snapshots/net/sansa-stack/sansa-hadoop-jena/0.8.0-RC3-SNAPSHOT/maven-metadata.xml
[INFO] Downloading from apache-snapshot: https://repository.apache.org/content/repositories/snapshots/net/sansa-stack/sansa-hadoop-jena/0.8.0-RC3-SNAPSHOT/maven-metadata.xml
[INFO] Downloaded from maven.aksw.snapshots: https://maven.aksw.org/repository/snapshots/net/sansa-stack/sansa-hadoop-jena/0.8.0-RC3-SNAPSHOT/maven-metadata.xml (0 B at 0 B/s)
[INFO] Downloading from maven.aksw.snapshots: https://maven.aksw.org/repository/snapshots/net/minidev/json-smart/maven-metadata.xml
[INFO] Downloading from apache-repo-snapshots: https://repository.apache.org/content/repositories/snapshots/net/minidev/json-smart/maven-metadata.xml
[INFO] Downloading from maven.aksw.internal: https://maven.aksw.org/repository/internal/net/minidev/json-smart/maven-metadata.xml
[INFO] Downloading from central: https://repo.maven.apache.org/maven2/net/minidev/json-smart/maven-metadata.xml
[INFO] Downloading from oss-sonatype-releases: https://oss.sonatype.org/content/repositories/releases/net/minidev/json-smart/maven-metadata.xml
[INFO] Downloading from apache-snapshot: https://repository.apache.org/content/repositories/snapshots/net/minidev/json-smart/maven-metadata.xml
[INFO] Downloading from apache.snapshots.https: https://repository.apache.org/content/repositories/snapshots/net/minidev/json-smart/maven-metadata.xml
[INFO] Downloading from repository.jboss.org: http://repository.jboss.org/nexus/content/groups/public/net/minidev/json-smart/maven-metadata.xml
[INFO] Downloaded from central: https://repo.maven.apache.org/maven2/net/minidev/json-smart/maven-metadata.xml (0 B at 0 B/s)
[INFO] Downloaded from maven.aksw.internal: https://maven.aksw.org/repository/internal/net/minidev/json-smart/maven-metadata.xml (0 B at 0 B/s)
[INFO] Downloaded from oss-sonatype-releases: https://oss.sonatype.org/content/repositories/releases/net/minidev/json-smart/maven-metadata.xml (0 B at 0 B/s)
[INFO] Downloading from maven.aksw.internal: https://maven.aksw.org/repository/internal/org/aksw/commons/aksw-commons-collectors/0.9.3-SNAPSHOT/maven-metadata.xml
[INFO] Downloading from maven.aksw.snapshots: https://maven.aksw.org/repository/snapshots/org/aksw/commons/aksw-commons-collectors/0.9.3-SNAPSHOT/maven-metadata.xml
[INFO] Downloading from apache-repo-snapshots: https://repository.apache.org/content/repositories/snapshots/org/aksw/commons/aksw-commons-collectors/0.9.3-SNAPSHOT/maven-metadata.xml
[INFO] Downloading from apache-snapshot: https://repository.apache.org/content/repositories/snapshots/org/aksw/commons/aksw-commons-collectors/0.9.3-SNAPSHOT/maven-metadata.xml
[INFO] Downloaded from maven.aksw.snapshots: https://maven.aksw.org/repository/snapshots/org/aksw/commons/aksw-commons-collectors/0.9.3-SNAPSHOT/maven-metadata.xml (0 B at 0 B/s)
[INFO] Downloading from maven.aksw.internal: https://maven.aksw.org/repository/internal/org/aksw/commons/aksw-commons-parent/0.9.3-SNAPSHOT/maven-metadata.xml
[INFO] Downloading from maven.aksw.snapshots: https://maven.aksw.org/repository/snapshots/org/aksw/commons/aksw-commons-parent/0.9.3-SNAPSHOT/maven-metadata.xml
[INFO] Downloading from apache-repo-snapshots: https://repository.apache.org/content/repositories/snapshots/org/aksw/commons/aksw-commons-parent/0.9.3-SNAPSHOT/maven-metadata.xml
[INFO] Downloading from apache-snapshot: https://repository.apache.org/content/repositories/snapshots/org/aksw/commons/aksw-commons-parent/0.9.3-SNAPSHOT/maven-metadata.xml
[INFO] Downloaded from maven.aksw.snapshots: https://maven.aksw.org/repository/snapshots/org/aksw/commons/aksw-commons-parent/0.9.3-SNAPSHOT/maven-metadata.xml (373 B at 37 kB/s)
[INFO] Downloading from maven.aksw.internal: https://maven.aksw.org/repository/internal/org/aksw/commons/aksw-commons-lambdas-serializable/0.9.3-SNAPSHOT/maven-metadata.xml
[INFO] Downloading from maven.aksw.snapshots: https://maven.aksw.org/repository/snapshots/org/aksw/commons/aksw-commons-lambdas-serializable/0.9.3-SNAPSHOT/maven-metadata.xml
[INFO] Downloading from apache-repo-snapshots: https://repository.apache.org/content/repositories/snapshots/org/aksw/commons/aksw-commons-lambdas-serializable/0.9.3-SNAPSHOT/maven-metadata.xml
[INFO] Downloading from apache-snapshot: https://repository.apache.org/content/repositories/snapshots/org/aksw/commons/aksw-commons-lambdas-serializable/0.9.3-SNAPSHOT/maven-metadata.xml
[INFO] Downloaded from maven.aksw.snapshots: https://maven.aksw.org/repository/snapshots/org/aksw/commons/aksw-commons-lambdas-serializable/0.9.3-SNAPSHOT/maven-metadata.xml (0 B at 0 B/s)
[INFO] Downloading from maven.aksw.internal: https://maven.aksw.org/repository/internal/org/aksw/commons/aksw-commons-lambdas-parent/0.9.3-SNAPSHOT/maven-metadata.xml
[INFO] Downloading from maven.aksw.snapshots: https://maven.aksw.org/repository/snapshots/org/aksw/commons/aksw-commons-lambdas-parent/0.9.3-SNAPSHOT/maven-metadata.xml
[INFO] Downloading from apache-repo-snapshots: https://repository.apache.org/content/repositories/snapshots/org/aksw/commons/aksw-commons-lambdas-parent/0.9.3-SNAPSHOT/maven-metadata.xml
[INFO] Downloading from apache-snapshot: https://repository.apache.org/content/repositories/snapshots/org/aksw/commons/aksw-commons-lambdas-parent/0.9.3-SNAPSHOT/maven-metadata.xml
[INFO] Downloaded from maven.aksw.snapshots: https://maven.aksw.org/repository/snapshots/org/aksw/commons/aksw-commons-lambdas-parent/0.9.3-SNAPSHOT/maven-metadata.xml (381 B at 35 kB/s)
[INFO] Downloading from maven.aksw.internal: https://maven.aksw.org/repository/internal/org/apache/jena/jena-tdb2/4.5.0-SNAPSHOT/maven-metadata.xml
[INFO] Downloading from apache-repo-snapshots: https://repository.apache.org/content/repositories/snapshots/org/apache/jena/jena-tdb2/4.5.0-SNAPSHOT/maven-metadata.xml
[INFO] Downloading from maven.aksw.snapshots: https://maven.aksw.org/repository/snapshots/org/apache/jena/jena-tdb2/4.5.0-SNAPSHOT/maven-metadata.xml
[INFO] Downloaded from apache-repo-snapshots: https://repository.apache.org/content/repositories/snapshots/org/apache/jena/jena-tdb2/4.5.0-SNAPSHOT/maven-metadata.xml (1.2 kB at 19 kB/s)
[INFO] Downloading from maven.aksw.internal: https://maven.aksw.org/repository/internal/org/apache/jena/jena-tdb2/4.5.0-SNAPSHOT/jena-tdb2-4.5.0-20220426.052351-49.pom
[INFO] Downloading from maven.aksw.snapshots: https://maven.aksw.org/repository/snapshots/org/apache/jena/jena-tdb2/4.5.0-SNAPSHOT/jena-tdb2-4.5.0-20220426.052351-49.pom
[INFO] Downloading from apache-repo-snapshots: https://repository.apache.org/content/repositories/snapshots/org/apache/jena/jena-tdb2/4.5.0-SNAPSHOT/jena-tdb2-4.5.0-20220426.052351-49.pom
[INFO] Downloaded from apache-repo-snapshots: https://repository.apache.org/content/repositories/snapshots/org/apache/jena/jena-tdb2/4.5.0-SNAPSHOT/jena-tdb2-4.5.0-20220426.052351-49.pom (4.0 kB at 85 kB/s)
[INFO] Downloading from maven.aksw.internal: https://maven.aksw.org/repository/internal/org/aksw/jenax/jenax-rx-ops-syscall/4.5.0-1-SNAPSHOT/maven-metadata.xml
[INFO] Downloading from maven.aksw.snapshots: https://maven.aksw.org/repository/snapshots/org/aksw/jenax/jenax-rx-ops-syscall/4.5.0-1-SNAPSHOT/maven-metadata.xml
[INFO] Downloading from apache-repo-snapshots: https://repository.apache.org/content/repositories/snapshots/org/aksw/jenax/jenax-rx-ops-syscall/4.5.0-1-SNAPSHOT/maven-metadata.xml
[INFO] Downloaded from maven.aksw.snapshots: https://maven.aksw.org/repository/snapshots/org/aksw/jenax/jenax-rx-ops-syscall/4.5.0-1-SNAPSHOT/maven-metadata.xml (0 B at 0 B/s)
[INFO] Downloading from maven.aksw.internal: https://maven.aksw.org/repository/internal/org/aksw/commons/aksw-commons-io-syscalls/0.9.4-SNAPSHOT/maven-metadata.xml
[INFO] Downloading from maven.aksw.snapshots: https://maven.aksw.org/repository/snapshots/org/aksw/commons/aksw-commons-io-syscalls/0.9.4-SNAPSHOT/maven-metadata.xml
[INFO] Downloading from apache-repo-snapshots: https://repository.apache.org/content/repositories/snapshots/org/aksw/commons/aksw-commons-io-syscalls/0.9.4-SNAPSHOT/maven-metadata.xml
[INFO] Downloaded from maven.aksw.snapshots: https://maven.aksw.org/repository/snapshots/org/aksw/commons/aksw-commons-io-syscalls/0.9.4-SNAPSHOT/maven-metadata.xml (377 B at 38 kB/s)
[INFO] Downloading from maven.aksw.internal: https://maven.aksw.org/repository/internal/org/aksw/jenax/jenax-arq-algebra/4.5.0-1-SNAPSHOT/maven-metadata.xml
[INFO] Downloading from maven.aksw.snapshots: https://maven.aksw.org/repository/snapshots/org/aksw/jenax/jenax-arq-algebra/4.5.0-1-SNAPSHOT/maven-metadata.xml
[INFO] Downloading from apache-repo-snapshots: https://repository.apache.org/content/repositories/snapshots/org/aksw/jenax/jenax-arq-algebra/4.5.0-1-SNAPSHOT/maven-metadata.xml
[INFO] Downloaded from maven.aksw.snapshots: https://maven.aksw.org/repository/snapshots/org/aksw/jenax/jenax-arq-algebra/4.5.0-1-SNAPSHOT/maven-metadata.xml (371 B at 41 kB/s)
[INFO] Downloading from maven.aksw.internal: https://maven.aksw.org/repository/internal/org/aksw/jenax/jenax-arq-algebra/4.5.0-1-SNAPSHOT/jenax-arq-algebra-4.5.0-1-20220427.125535-33.pom
[INFO] Downloading from maven.aksw.snapshots: https://maven.aksw.org/repository/snapshots/org/aksw/jenax/jenax-arq-algebra/4.5.0-1-SNAPSHOT/jenax-arq-algebra-4.5.0-1-20220427.125535-33.pom
[INFO] Downloaded from maven.aksw.snapshots: https://maven.aksw.org/repository/snapshots/org/aksw/jenax/jenax-arq-algebra/4.5.0-1-SNAPSHOT/jenax-arq-algebra-4.5.0-1-20220427.125535-33.pom (1.9 kB at 269 kB/s)
[INFO] Downloading from maven.aksw.snapshots: https://maven.aksw.org/repository/snapshots/org/aksw/jenax/jenax-arq-propertypaths/4.5.0-1-SNAPSHOT/maven-metadata.xml
[INFO] Downloading from maven.aksw.internal: https://maven.aksw.org/repository/internal/org/aksw/jenax/jenax-arq-propertypaths/4.5.0-1-SNAPSHOT/maven-metadata.xml
[INFO] Downloading from apache-repo-snapshots: https://repository.apache.org/content/repositories/snapshots/org/aksw/jenax/jenax-arq-propertypaths/4.5.0-1-SNAPSHOT/maven-metadata.xml
[INFO] Downloaded from maven.aksw.snapshots: https://maven.aksw.org/repository/snapshots/org/aksw/jenax/jenax-arq-propertypaths/4.5.0-1-SNAPSHOT/maven-metadata.xml (377 B at 31 kB/s)
[INFO] Downloading from maven.aksw.internal: https://maven.aksw.org/repository/internal/org/aksw/jenax/jenax-arq-propertypaths/4.5.0-1-SNAPSHOT/jenax-arq-propertypaths-4.5.0-1-20220427.125535-33.pom
[INFO] Downloading from maven.aksw.snapshots: https://maven.aksw.org/repository/snapshots/org/aksw/jenax/jenax-arq-propertypaths/4.5.0-1-SNAPSHOT/jenax-arq-propertypaths-4.5.0-1-20220427.125535-33.pom
[INFO] Downloaded from maven.aksw.snapshots: https://maven.aksw.org/repository/snapshots/org/aksw/jenax/jenax-arq-propertypaths/4.5.0-1-SNAPSHOT/jenax-arq-propertypaths-4.5.0-1-20220427.125535-33.pom (949 B at 9.1 kB/s)
[INFO] Downloading from maven.aksw.internal: https://maven.aksw.org/repository/internal/org/aksw/jenax/jenax-arq-udf/4.5.0-1-SNAPSHOT/maven-metadata.xml
[INFO] Downloading from maven.aksw.snapshots: https://maven.aksw.org/repository/snapshots/org/aksw/jenax/jenax-arq-udf/4.5.0-1-SNAPSHOT/maven-metadata.xml
[INFO] Downloading from apache-repo-snapshots: https://repository.apache.org/content/repositories/snapshots/org/aksw/jenax/jenax-arq-udf/4.5.0-1-SNAPSHOT/maven-metadata.xml
[INFO] Downloaded from maven.aksw.snapshots: https://maven.aksw.org/repository/snapshots/org/aksw/jenax/jenax-arq-udf/4.5.0-1-SNAPSHOT/maven-metadata.xml (367 B at 37 kB/s)
[INFO] Downloading from maven.aksw.internal: https://maven.aksw.org/repository/internal/org/aksw/jenax/jenax-arq-udf/4.5.0-1-SNAPSHOT/jenax-arq-udf-4.5.0-1-20220427.125535-32.pom
[INFO] Downloading from maven.aksw.snapshots: https://maven.aksw.org/repository/snapshots/org/aksw/jenax/jenax-arq-udf/4.5.0-1-SNAPSHOT/jenax-arq-udf-4.5.0-1-20220427.125535-32.pom
[INFO] Downloaded from maven.aksw.snapshots: https://maven.aksw.org/repository/snapshots/org/aksw/jenax/jenax-arq-udf/4.5.0-1-SNAPSHOT/jenax-arq-udf-4.5.0-1-20220427.125535-32.pom (1.5 kB at 124 kB/s)
[INFO] Downloading from maven.aksw.internal: https://maven.aksw.org/repository/internal/org/aksw/jenax/jenax-arq-hdt/4.5.0-1-SNAPSHOT/maven-metadata.xml
[INFO] Downloading from maven.aksw.snapshots: https://maven.aksw.org/repository/snapshots/org/aksw/jenax/jenax-arq-hdt/4.5.0-1-SNAPSHOT/maven-metadata.xml
[INFO] Downloading from apache-repo-snapshots: https://repository.apache.org/content/repositories/snapshots/org/aksw/jenax/jenax-arq-hdt/4.5.0-1-SNAPSHOT/maven-metadata.xml
[INFO] Downloaded from maven.aksw.snapshots: https://maven.aksw.org/repository/snapshots/org/aksw/jenax/jenax-arq-hdt/4.5.0-1-SNAPSHOT/maven-metadata.xml (367 B at 37 kB/s)
[INFO] Downloading from maven.aksw.internal: https://maven.aksw.org/repository/internal/org/aksw/jenax/jenax-arq-hdt/4.5.0-1-SNAPSHOT/jenax-arq-hdt-4.5.0-1-20220427.125535-32.pom
[INFO] Downloading from maven.aksw.snapshots: https://maven.aksw.org/repository/snapshots/org/aksw/jenax/jenax-arq-hdt/4.5.0-1-SNAPSHOT/jenax-arq-hdt-4.5.0-1-20220427.125535-32.pom
[INFO] Downloaded from maven.aksw.snapshots: https://maven.aksw.org/repository/snapshots/org/aksw/jenax/jenax-arq-hdt/4.5.0-1-SNAPSHOT/jenax-arq-hdt-4.5.0-1-20220427.125535-32.pom (1.5 kB at 163 kB/s)
[INFO] Downloading from maven.aksw.internal: https://maven.aksw.org/repository/internal/org/aksw/jenax/jenax-arq-plugins-bundle/4.5.0-1-SNAPSHOT/maven-metadata.xml
[INFO] Downloading from maven.aksw.snapshots: https://maven.aksw.org/repository/snapshots/org/aksw/jenax/jenax-arq-plugins-bundle/4.5.0-1-SNAPSHOT/maven-metadata.xml
[INFO] Downloading from apache-repo-snapshots: https://repository.apache.org/content/repositories/snapshots/org/aksw/jenax/jenax-arq-plugins-bundle/4.5.0-1-SNAPSHOT/maven-metadata.xml
[INFO] Downloaded from maven.aksw.snapshots: https://maven.aksw.org/repository/snapshots/org/aksw/jenax/jenax-arq-plugins-bundle/4.5.0-1-SNAPSHOT/maven-metadata.xml (0 B at 0 B/s)
[INFO] Downloading from maven.aksw.internal: https://maven.aksw.org/repository/internal/org/aksw/jenax/jenax-arq-plugins-datatypes/4.5.0-1-SNAPSHOT/maven-metadata.xml
[INFO] Downloading from maven.aksw.snapshots: https://maven.aksw.org/repository/snapshots/org/aksw/jenax/jenax-arq-plugins-datatypes/4.5.0-1-SNAPSHOT/maven-metadata.xml
[INFO] Downloading from apache-repo-snapshots: https://repository.apache.org/content/repositories/snapshots/org/aksw/jenax/jenax-arq-plugins-datatypes/4.5.0-1-SNAPSHOT/maven-metadata.xml
[INFO] Downloaded from maven.aksw.snapshots: https://maven.aksw.org/repository/snapshots/org/aksw/jenax/jenax-arq-plugins-datatypes/4.5.0-1-SNAPSHOT/maven-metadata.xml (381 B at 8.5 kB/s)
[INFO] Downloading from maven.aksw.internal: https://maven.aksw.org/repository/internal/org/aksw/jenax/jenax-arq-plugins-datatypes/4.5.0-1-SNAPSHOT/jenax-arq-plugins-datatypes-4.5.0-1-20220427.205000-34.pom
[INFO] Downloading from maven.aksw.snapshots: https://maven.aksw.org/repository/snapshots/org/aksw/jenax/jenax-arq-plugins-datatypes/4.5.0-1-SNAPSHOT/jenax-arq-plugins-datatypes-4.5.0-1-20220427.205000-34.pom
[INFO] Downloaded from maven.aksw.snapshots: https://maven.aksw.org/repository/snapshots/org/aksw/jenax/jenax-arq-plugins-datatypes/4.5.0-1-SNAPSHOT/jenax-arq-plugins-datatypes-4.5.0-1-20220427.205000-34.pom (1.2 kB at 132 kB/s)
[INFO] Downloading from maven.aksw.internal: https://maven.aksw.org/repository/internal/org/aksw/jenax/jenax-models-dcat-api/4.5.0-1-SNAPSHOT/maven-metadata.xml
[INFO] Downloading from maven.aksw.snapshots: https://maven.aksw.org/repository/snapshots/org/aksw/jenax/jenax-models-dcat-api/4.5.0-1-SNAPSHOT/maven-metadata.xml
[INFO] Downloading from apache-repo-snapshots: https://repository.apache.org/content/repositories/snapshots/org/aksw/jenax/jenax-models-dcat-api/4.5.0-1-SNAPSHOT/maven-metadata.xml
[INFO] Downloaded from maven.aksw.snapshots: https://maven.aksw.org/repository/snapshots/org/aksw/jenax/jenax-models-dcat-api/4.5.0-1-SNAPSHOT/maven-metadata.xml (375 B at 6.1 kB/s)
[INFO] Downloading from maven.aksw.internal: https://maven.aksw.org/repository/internal/org/aksw/jenax/jenax-models-dcat-api/4.5.0-1-SNAPSHOT/jenax-models-dcat-api-4.5.0-1-20220427.125535-32.pom
[INFO] Downloading from maven.aksw.snapshots: https://maven.aksw.org/repository/snapshots/org/aksw/jenax/jenax-models-dcat-api/4.5.0-1-SNAPSHOT/jenax-models-dcat-api-4.5.0-1-20220427.125535-32.pom
[INFO] Downloaded from maven.aksw.snapshots: https://maven.aksw.org/repository/snapshots/org/aksw/jenax/jenax-models-dcat-api/4.5.0-1-SNAPSHOT/jenax-models-dcat-api-4.5.0-1-20220427.125535-32.pom (1.4 kB at 156 kB/s)
[INFO] Downloading from maven.aksw.internal: https://maven.aksw.org/repository/internal/org/aksw/jenax/jenax-functionbinder-core/4.5.0-1-SNAPSHOT/maven-metadata.xml
[INFO] Downloading from maven.aksw.snapshots: https://maven.aksw.org/repository/snapshots/org/aksw/jenax/jenax-functionbinder-core/4.5.0-1-SNAPSHOT/maven-metadata.xml
[INFO] Downloading from apache-repo-snapshots: https://repository.apache.org/content/repositories/snapshots/org/aksw/jenax/jenax-functionbinder-core/4.5.0-1-SNAPSHOT/maven-metadata.xml
[INFO] Downloaded from maven.aksw.snapshots: https://maven.aksw.org/repository/snapshots/org/aksw/jenax/jenax-functionbinder-core/4.5.0-1-SNAPSHOT/maven-metadata.xml (0 B at 0 B/s)
[INFO] Downloading from maven.aksw.internal: https://maven.aksw.org/repository/internal/org/aksw/jenax/jenax-functionbinder-parent/4.5.0-1-SNAPSHOT/maven-metadata.xml
[INFO] Downloading from maven.aksw.snapshots: https://maven.aksw.org/repository/snapshots/org/aksw/jenax/jenax-functionbinder-parent/4.5.0-1-SNAPSHOT/maven-metadata.xml
[INFO] Downloading from apache-repo-snapshots: https://repository.apache.org/content/repositories/snapshots/org/aksw/jenax/jenax-functionbinder-parent/4.5.0-1-SNAPSHOT/maven-metadata.xml
[INFO] Downloaded from maven.aksw.snapshots: https://maven.aksw.org/repository/snapshots/org/aksw/jenax/jenax-functionbinder-parent/4.5.0-1-SNAPSHOT/maven-metadata.xml (381 B at 21 kB/s)
[INFO] Downloading from maven.aksw.snapshots: https://maven.aksw.org/repository/snapshots/org/aksw/jenax/jenax-functionbinder-parent/4.5.0-1-SNAPSHOT/jenax-functionbinder-parent-4.5.0-1-20220427.205356-32.pom
[INFO] Downloaded from maven.aksw.snapshots: https://maven.aksw.org/repository/snapshots/org/aksw/jenax/jenax-functionbinder-parent/4.5.0-1-SNAPSHOT/jenax-functionbinder-parent-4.5.0-1-20220427.205356-32.pom (0 B at 0 B/s)
[INFO] Downloading from maven.aksw.internal: https://maven.aksw.org/repository/internal/org/aksw/jenax/jenax-arq-tika/4.5.0-1-SNAPSHOT/maven-metadata.xml
[INFO] Downloading from apache-repo-snapshots: https://repository.apache.org/content/repositories/snapshots/org/aksw/jenax/jenax-arq-tika/4.5.0-1-SNAPSHOT/maven-metadata.xml
[INFO] Downloading from maven.aksw.snapshots: https://maven.aksw.org/repository/snapshots/org/aksw/jenax/jenax-arq-tika/4.5.0-1-SNAPSHOT/maven-metadata.xml
[INFO] Downloaded from maven.aksw.snapshots: https://maven.aksw.org/repository/snapshots/org/aksw/jenax/jenax-arq-tika/4.5.0-1-SNAPSHOT/maven-metadata.xml (0 B at 0 B/s)
[INFO] Downloading from maven.aksw.internal: https://maven.aksw.org/repository/internal/org/aksw/jenax/jenax-arq-tika/4.5.0-1-SNAPSHOT/jenax-arq-tika-4.5.0-1-20220427.125535-33.pom
[INFO] Downloading from maven.aksw.snapshots: https://maven.aksw.org/repository/snapshots/org/aksw/jenax/jenax-arq-tika/4.5.0-1-SNAPSHOT/jenax-arq-tika-4.5.0-1-20220427.125535-33.pom
[INFO] Downloaded from maven.aksw.snapshots: https://maven.aksw.org/repository/snapshots/org/aksw/jenax/jenax-arq-tika/4.5.0-1-SNAPSHOT/jenax-arq-tika-4.5.0-1-20220427.125535-33.pom (0 B at 0 B/s)
[INFO] Downloading from apache.snapshots: https://repository.apache.org/snapshots/org/apache/jena/jena-dboe-storage/4.5.0-SNAPSHOT/maven-metadata.xml
[INFO] Downloaded from apache.snapshots: https://repository.apache.org/snapshots/org/apache/jena/jena-dboe-storage/4.5.0-SNAPSHOT/maven-metadata.xml (998 B at 7.1 kB/s)
[INFO] Downloading from maven.aksw.snapshots: https://maven.aksw.org/repository/snapshots/org/aksw/jenax/jenax-arq-connection-core/4.5.0-1-SNAPSHOT/jenax-arq-connection-core-4.5.0-1-20220427.125535-33.jar
[INFO] Downloading from maven.aksw.snapshots: https://maven.aksw.org/repository/snapshots/org/aksw/jenax/jenax-arq-plugins-service-vfs/4.5.0-1-SNAPSHOT/jenax-arq-plugins-service-vfs-4.5.0-1-20220427.205000-34.jar
[INFO] Downloading from maven.aksw.snapshots: https://maven.aksw.org/repository/snapshots/org/aksw/jenax/jenax-fsrdfstore-system/4.5.0-1-SNAPSHOT/jenax-fsrdfstore-system-4.5.0-1-20220427.125535-30.jar
[INFO] Downloading from maven.aksw.snapshots: https://maven.aksw.org/repository/snapshots/org/aksw/jenax/jenax-fsrdfstore-facade/4.5.0-1-SNAPSHOT/jenax-fsrdfstore-facade-4.5.0-1-20220427.125535-30.jar
[INFO] Downloading from maven.aksw.snapshots: https://maven.aksw.org/repository/snapshots/org/aksw/jenax/jenax-fsrdfstore-core/4.5.0-1-SNAPSHOT/jenax-fsrdfstore-core-4.5.0-1-20220427.125535-30.jar
[INFO] Downloaded from maven.aksw.snapshots: https://maven.aksw.org/repository/snapshots/org/aksw/jenax/jenax-arq-plugins-service-vfs/4.5.0-1-SNAPSHOT/jenax-arq-plugins-service-vfs-4.5.0-1-20220427.205000-34.jar (15 kB at 538 kB/s)
[INFO] Downloading from maven.aksw.snapshots: https://maven.aksw.org/repository/snapshots/org/aksw/jenax/jenax-jgrapht-bindings/4.5.0-1-SNAPSHOT/jenax-jgrapht-bindings-4.5.0-1-20220427.125535-10.jar
[INFO] Downloaded from maven.aksw.snapshots: https://maven.aksw.org/repository/snapshots/org/aksw/jenax/jenax-fsrdfstore-core/4.5.0-1-SNAPSHOT/jenax-fsrdfstore-core-4.5.0-1-20220427.125535-30.jar (67 kB at 923 kB/s)
[INFO] Downloading from maven.aksw.snapshots: https://maven.aksw.org/repository/snapshots/org/aksw/jenax/jenax-arq-datasets-diff/4.5.0-1-SNAPSHOT/jenax-arq-datasets-diff-4.5.0-1-20220427.125535-32.jar
[INFO] Downloaded from maven.aksw.snapshots: https://maven.aksw.org/repository/snapshots/org/aksw/jenax/jenax-arq-datasets-diff/4.5.0-1-SNAPSHOT/jenax-arq-datasets-diff-4.5.0-1-20220427.125535-32.jar (18 kB at 78 kB/s)
[INFO] Downloading from maven.aksw.snapshots: https://maven.aksw.org/repository/snapshots/org/aksw/jenax/jenax-arq-quadengine/4.5.0-1-SNAPSHOT/jenax-arq-quadengine-4.5.0-1-20220427.125535-32.jar
[INFO] Downloaded from maven.aksw.snapshots: https://maven.aksw.org/repository/snapshots/org/aksw/jenax/jenax-fsrdfstore-system/4.5.0-1-SNAPSHOT/jenax-fsrdfstore-system-4.5.0-1-20220427.125535-30.jar (2.0 kB at 4.5 kB/s)
[INFO] Downloading from maven.aksw.snapshots: https://maven.aksw.org/repository/snapshots/org/aksw/jenax/jenax-rx-ops-syscall/4.5.0-1-SNAPSHOT/jenax-rx-ops-syscall-4.5.0-1-20220427.125535-31.jar
[INFO] Downloaded from maven.aksw.snapshots: https://maven.aksw.org/repository/snapshots/org/aksw/jenax/jenax-arq-quadengine/4.5.0-1-SNAPSHOT/jenax-arq-quadengine-4.5.0-1-20220427.125535-32.jar (17 kB at 38 kB/s)
[INFO] Downloading from maven.aksw.snapshots: https://maven.aksw.org/repository/snapshots/org/aksw/jenax/jenax-arq-rx/4.5.0-1-SNAPSHOT/jenax-arq-rx-4.5.0-1-20220427.125535-32.jar
[INFO] Downloaded from maven.aksw.snapshots: https://maven.aksw.org/repository/snapshots/org/aksw/jenax/jenax-fsrdfstore-facade/4.5.0-1-SNAPSHOT/jenax-fsrdfstore-facade-4.5.0-1-20220427.125535-30.jar (14 kB at 30 kB/s)
[INFO] Downloading from maven.aksw.snapshots: https://maven.aksw.org/repository/snapshots/org/aksw/jenax/jenax-models-entityinfo/4.5.0-1-SNAPSHOT/jenax-models-entityinfo-4.5.0-1-20220427.125535-32.jar
[INFO] Downloaded from maven.aksw.snapshots: https://maven.aksw.org/repository/snapshots/org/aksw/jenax/jenax-jgrapht-bindings/4.5.0-1-SNAPSHOT/jenax-jgrapht-bindings-4.5.0-1-20220427.125535-10.jar (24 kB at 51 kB/s)
[INFO] Downloading from maven.aksw.snapshots: https://maven.aksw.org/repository/snapshots/org/aksw/jenax/jenax-arq-aggregators/4.5.0-1-SNAPSHOT/jenax-arq-aggregators-4.5.0-1-20220427.125535-32.jar
[INFO] Downloaded from maven.aksw.snapshots: https://maven.aksw.org/repository/snapshots/org/aksw/jenax/jenax-models-entityinfo/4.5.0-1-SNAPSHOT/jenax-models-entityinfo-4.5.0-1-20220427.125535-32.jar (9.1 kB at 19 kB/s)
[INFO] Downloading from maven.aksw.snapshots: https://maven.aksw.org/repository/snapshots/org/aksw/jenax/jenax-arq-rdfterm/4.5.0-1-SNAPSHOT/jenax-arq-rdfterm-4.5.0-1-20220427.125535-32.jar
[INFO] Downloaded from maven.aksw.snapshots: https://maven.aksw.org/repository/snapshots/org/aksw/jenax/jenax-arq-rx/4.5.0-1-SNAPSHOT/jenax-arq-rx-4.5.0-1-20220427.125535-32.jar (207 kB at 431 kB/s)
[INFO] Downloading from maven.aksw.snapshots: https://maven.aksw.org/repository/snapshots/org/aksw/jenax/jenax-arq-functions/4.5.0-1-SNAPSHOT/jenax-arq-functions-4.5.0-1-20220427.125535-32.jar
[INFO] Downloaded from maven.aksw.snapshots: https://maven.aksw.org/repository/snapshots/org/aksw/jenax/jenax-rx-ops-syscall/4.5.0-1-SNAPSHOT/jenax-rx-ops-syscall-4.5.0-1-20220427.125535-31.jar (15 kB at 31 kB/s)
[INFO] Downloading from maven.aksw.snapshots: https://maven.aksw.org/repository/snapshots/org/aksw/jenax/jenax-arq-datasets-orderaware/4.5.0-1-SNAPSHOT/jenax-arq-datasets-orderaware-4.5.0-1-20220427.125535-32.jar
[INFO] Downloaded from maven.aksw.snapshots: https://maven.aksw.org/repository/snapshots/org/aksw/jenax/jenax-arq-aggregators/4.5.0-1-SNAPSHOT/jenax-arq-aggregators-4.5.0-1-20220427.125535-32.jar (65 kB at 135 kB/s)
[INFO] Downloading from maven.aksw.snapshots: https://maven.aksw.org/repository/snapshots/org/aksw/jenax/jenax-arq-datasets-oneng/4.5.0-1-SNAPSHOT/jenax-arq-datasets-oneng-4.5.0-1-20220427.125535-32.jar
[INFO] Downloaded from maven.aksw.snapshots: https://maven.aksw.org/repository/snapshots/org/aksw/jenax/jenax-arq-connection-core/4.5.0-1-SNAPSHOT/jenax-arq-connection-core-4.5.0-1-20220427.125535-33.jar (126 kB at 255 kB/s)
[INFO] Downloading from maven.aksw.snapshots: https://maven.aksw.org/repository/snapshots/org/aksw/jenax/jenax-arq-rdfnode-in-dataset/4.5.0-1-SNAPSHOT/jenax-arq-rdfnode-in-dataset-4.5.0-1-20220427.125535-32.jar
[INFO] Downloaded from maven.aksw.snapshots: https://maven.aksw.org/repository/snapshots/org/aksw/jenax/jenax-arq-rdfterm/4.5.0-1-SNAPSHOT/jenax-arq-rdfterm-4.5.0-1-20220427.125535-32.jar (9.5 kB at 19 kB/s)
[INFO] Downloading from maven.aksw.snapshots: https://maven.aksw.org/repository/snapshots/org/aksw/jenax/jenax-arq-relations/4.5.0-1-SNAPSHOT/jenax-arq-relations-4.5.0-1-20220427.125535-33.jar
[INFO] Downloaded from maven.aksw.snapshots: https://maven.aksw.org/repository/snapshots/org/aksw/jenax/jenax-arq-functions/4.5.0-1-SNAPSHOT/jenax-arq-functions-4.5.0-1-20220427.125535-32.jar (3.4 kB at 6.9 kB/s)
[INFO] Downloading from maven.aksw.snapshots: https://maven.aksw.org/repository/snapshots/org/aksw/jenax/jenax-arq-algebra/4.5.0-1-SNAPSHOT/jenax-arq-algebra-4.5.0-1-20220427.125535-33.jar
[INFO] Downloaded from maven.aksw.snapshots: https://maven.aksw.org/repository/snapshots/org/aksw/jenax/jenax-arq-datasets-oneng/4.5.0-1-SNAPSHOT/jenax-arq-datasets-oneng-4.5.0-1-20220427.125535-32.jar (8.1 kB at 16 kB/s)
[INFO] Downloading from maven.aksw.snapshots: https://maven.aksw.org/repository/snapshots/org/aksw/jenax/jenax-arq-propertypaths/4.5.0-1-SNAPSHOT/jenax-arq-propertypaths-4.5.0-1-20220427.125535-33.jar
[INFO] Downloaded from maven.aksw.snapshots: https://maven.aksw.org/repository/snapshots/org/aksw/jenax/jenax-arq-datasets-orderaware/4.5.0-1-SNAPSHOT/jenax-arq-datasets-orderaware-4.5.0-1-20220427.125535-32.jar (32 kB at 65 kB/s)
[INFO] Downloading from maven.aksw.snapshots: https://maven.aksw.org/repository/snapshots/org/aksw/jenax/jenax-arq-utils/4.5.0-1-SNAPSHOT/jenax-arq-utils-4.5.0-1-20220427.125535-36.jar
[INFO] Downloaded from maven.aksw.snapshots: https://maven.aksw.org/repository/snapshots/org/aksw/jenax/jenax-arq-rdfnode-in-dataset/4.5.0-1-SNAPSHOT/jenax-arq-rdfnode-in-dataset-4.5.0-1-20220427.125535-32.jar (14 kB at 28 kB/s)
[INFO] Downloading from maven.aksw.snapshots: https://maven.aksw.org/repository/snapshots/org/aksw/jenax/jenax-arq-udf/4.5.0-1-SNAPSHOT/jenax-arq-udf-4.5.0-1-20220427.125535-32.jar
[INFO] Downloaded from maven.aksw.snapshots: https://maven.aksw.org/repository/snapshots/org/aksw/jenax/jenax-arq-algebra/4.5.0-1-SNAPSHOT/jenax-arq-algebra-4.5.0-1-20220427.125535-33.jar (189 kB at 369 kB/s)
[INFO] Downloading from maven.aksw.snapshots: https://maven.aksw.org/repository/snapshots/org/aksw/jenax/jenax-arq-hdt/4.5.0-1-SNAPSHOT/jenax-arq-hdt-4.5.0-1-20220427.125535-32.jar
[INFO] Downloaded from maven.aksw.snapshots: https://maven.aksw.org/repository/snapshots/org/aksw/jenax/jenax-arq-udf/4.5.0-1-SNAPSHOT/jenax-arq-udf-4.5.0-1-20220427.125535-32.jar (15 kB at 30 kB/s)
[INFO] Downloading from maven.aksw.snapshots: https://maven.aksw.org/repository/snapshots/org/aksw/jenax/jenax-arq-json/4.5.0-1-SNAPSHOT/jenax-arq-json-4.5.0-1-20220427.125535-33.jar
[INFO] Downloaded from maven.aksw.snapshots: https://maven.aksw.org/repository/snapshots/org/aksw/jenax/jenax-arq-hdt/4.5.0-1-SNAPSHOT/jenax-arq-hdt-4.5.0-1-20220427.125535-32.jar (12 kB at 23 kB/s)
[INFO] Downloading from maven.aksw.snapshots: https://maven.aksw.org/repository/snapshots/org/aksw/jenax/jenax-arq-stmt/4.5.0-1-SNAPSHOT/jenax-arq-stmt-4.5.0-1-20220427.125535-33.jar
[INFO] Downloaded from maven.aksw.snapshots: https://maven.aksw.org/repository/snapshots/org/aksw/jenax/jenax-arq-propertypaths/4.5.0-1-SNAPSHOT/jenax-arq-propertypaths-4.5.0-1-20220427.125535-33.jar (30 kB at 53 kB/s)
[INFO] Downloading from maven.aksw.snapshots: https://maven.aksw.org/repository/snapshots/org/aksw/jenax/jenax-resources-prefixes/4.5.0-1-SNAPSHOT/jenax-resources-prefixes-4.5.0-1-20220427.125535-35.jar
[INFO] Downloaded from maven.aksw.snapshots: https://maven.aksw.org/repository/snapshots/org/aksw/jenax/jenax-arq-json/4.5.0-1-SNAPSHOT/jenax-arq-json-4.5.0-1-20220427.125535-33.jar (9.7 kB at 16 kB/s)
[INFO] Downloading from maven.aksw.snapshots: https://maven.aksw.org/repository/snapshots/org/aksw/jenax/jenax-arq-plugins-bundle/4.5.0-1-SNAPSHOT/jenax-arq-plugins-bundle-4.5.0-1-20220427.205000-34.jar
[INFO] Downloaded from maven.aksw.snapshots: https://maven.aksw.org/repository/snapshots/org/aksw/jenax/jenax-arq-relations/4.5.0-1-SNAPSHOT/jenax-arq-relations-4.5.0-1-20220427.125535-33.jar (110 kB at 173 kB/s)
[INFO] Downloading from maven.aksw.snapshots: https://maven.aksw.org/repository/snapshots/org/aksw/jenax/jenax-arq-collections/4.5.0-1-SNAPSHOT/jenax-arq-collections-4.5.0-1-20220427.125535-33.jar
[INFO] Downloaded from maven.aksw.snapshots: https://maven.aksw.org/repository/snapshots/org/aksw/jenax/jenax-arq-plugins-bundle/4.5.0-1-SNAPSHOT/jenax-arq-plugins-bundle-4.5.0-1-20220427.205000-34.jar (155 kB at 243 kB/s)
[INFO] Downloading from maven.aksw.snapshots: https://maven.aksw.org/repository/snapshots/org/aksw/jenax/jenax-annotations-reprogen/4.5.0-1-SNAPSHOT/jenax-annotations-reprogen-4.5.0-1-20220427.125535-32.jar
[INFO] Downloaded from maven.aksw.snapshots: https://maven.aksw.org/repository/snapshots/org/aksw/jenax/jenax-annotations-reprogen/4.5.0-1-SNAPSHOT/jenax-annotations-reprogen-4.5.0-1-20220427.125535-32.jar (14 kB at 20 kB/s)
[INFO] Downloading from maven.aksw.snapshots: https://maven.aksw.org/repository/snapshots/org/aksw/jenax/jenax-arq-plugins-datatypes/4.5.0-1-SNAPSHOT/jenax-arq-plugins-datatypes-4.5.0-1-20220427.205000-34.jar
[INFO] Downloaded from maven.aksw.snapshots: https://maven.aksw.org/repository/snapshots/org/aksw/jenax/jenax-arq-plugins-datatypes/4.5.0-1-SNAPSHOT/jenax-arq-plugins-datatypes-4.5.0-1-20220427.205000-34.jar (8.8 kB at 13 kB/s)
[INFO] Downloading from maven.aksw.snapshots: https://maven.aksw.org/repository/snapshots/org/aksw/jenax/jenax-models-dcat-api/4.5.0-1-SNAPSHOT/jenax-models-dcat-api-4.5.0-1-20220427.125535-32.jar
[INFO] Downloaded from maven.aksw.snapshots: https://maven.aksw.org/repository/snapshots/org/aksw/jenax/jenax-resources-prefixes/4.5.0-1-SNAPSHOT/jenax-resources-prefixes-4.5.0-1-20220427.125535-35.jar (83 kB at 120 kB/s)
[INFO] Downloading from maven.aksw.snapshots: https://maven.aksw.org/repository/snapshots/org/aksw/jenax/jenax-functionbinder-core/4.5.0-1-SNAPSHOT/jenax-functionbinder-core-4.5.0-1-20220427.205356-31.jar
[INFO] Downloaded from maven.aksw.snapshots: https://maven.aksw.org/repository/snapshots/org/aksw/jenax/jenax-models-dcat-api/4.5.0-1-SNAPSHOT/jenax-models-dcat-api-4.5.0-1-20220427.125535-32.jar (27 kB at 38 kB/s)
[INFO] Downloading from maven.aksw.snapshots: https://maven.aksw.org/repository/snapshots/org/aksw/jenax/jenax-reprogen-shared/4.5.0-1-SNAPSHOT/jenax-reprogen-shared-4.5.0-1-20220427.125535-30.jar
[INFO] Downloaded from maven.aksw.snapshots: https://maven.aksw.org/repository/snapshots/org/aksw/jenax/jenax-functionbinder-core/4.5.0-1-SNAPSHOT/jenax-functionbinder-core-4.5.0-1-20220427.205356-31.jar (15 kB at 21 kB/s)
[INFO] Downloading from maven.aksw.snapshots: https://maven.aksw.org/repository/snapshots/org/aksw/jenax/jenax-arq-tika/4.5.0-1-SNAPSHOT/jenax-arq-tika-4.5.0-1-20220427.125535-33.jar
[INFO] Downloaded from maven.aksw.snapshots: https://maven.aksw.org/repository/snapshots/org/aksw/jenax/jenax-arq-utils/4.5.0-1-SNAPSHOT/jenax-arq-utils-4.5.0-1-20220427.125535-36.jar (244 kB at 350 kB/s)
[INFO] Downloading from maven.aksw.snapshots: https://maven.aksw.org/repository/snapshots/org/aksw/jenax/jenax-rx-dataaccess/4.5.0-1-SNAPSHOT/jenax-rx-dataaccess-4.5.0-1-20220427.125535-31.jar
[INFO] Downloaded from maven.aksw.snapshots: https://maven.aksw.org/repository/snapshots/org/aksw/jenax/jenax-arq-stmt/4.5.0-1-SNAPSHOT/jenax-arq-stmt-4.5.0-1-20220427.125535-33.jar (58 kB at 82 kB/s)
[INFO] Downloading from maven.aksw.snapshots: https://maven.aksw.org/repository/snapshots/org/aksw/jenax/jenax-io-kryo/4.5.0-1-SNAPSHOT/jenax-io-kryo-4.5.0-1-20220427.125535-30.jar
[INFO] Downloaded from maven.aksw.snapshots: https://maven.aksw.org/repository/snapshots/org/aksw/jenax/jenax-arq-tika/4.5.0-1-SNAPSHOT/jenax-arq-tika-4.5.0-1-20220427.125535-33.jar (3.4 kB at 4.7 kB/s)
[INFO] Downloading from maven.aksw.snapshots: https://maven.aksw.org/repository/snapshots/org/aksw/jenax/jenax-io-json/4.5.0-1-SNAPSHOT/jenax-io-json-4.5.0-1-20220427.125535-25.jar
[INFO] Downloaded from maven.aksw.snapshots: https://maven.aksw.org/repository/snapshots/org/aksw/jenax/jenax-io-kryo/4.5.0-1-SNAPSHOT/jenax-io-kryo-4.5.0-1-20220427.125535-30.jar (34 kB at 47 kB/s)
[INFO] Downloading from maven.aksw.snapshots: https://maven.aksw.org/repository/snapshots/org/aksw/jenax/jenax-analytics-core/4.5.0-1-SNAPSHOT/jenax-analytics-core-4.5.0-1-20220427.125535-32.jar
[INFO] Downloaded from maven.aksw.snapshots: https://maven.aksw.org/repository/snapshots/org/aksw/jenax/jenax-io-json/4.5.0-1-SNAPSHOT/jenax-io-json-4.5.0-1-20220427.125535-25.jar (8.6 kB at 12 kB/s)
[INFO] Downloading from maven.aksw.snapshots: https://maven.aksw.org/repository/snapshots/org/aksw/jenax/jenax-reprogen-core/4.5.0-1-SNAPSHOT/jenax-reprogen-core-4.5.0-1-20220427.125535-30.jar
[INFO] Downloaded from maven.aksw.snapshots: https://maven.aksw.org/repository/snapshots/org/aksw/jenax/jenax-reprogen-shared/4.5.0-1-SNAPSHOT/jenax-reprogen-shared-4.5.0-1-20220427.125535-30.jar (5.3 kB at 7.0 kB/s)
[INFO] Downloading from maven.aksw.snapshots: https://maven.aksw.org/repository/snapshots/org/aksw/jenax/jenax-arq-entityquery/4.5.0-1-SNAPSHOT/jenax-arq-entityquery-4.5.0-1-20220427.125535-32.jar
[INFO] Downloaded from maven.aksw.snapshots: https://maven.aksw.org/repository/snapshots/org/aksw/jenax/jenax-reprogen-core/4.5.0-1-SNAPSHOT/jenax-reprogen-core-4.5.0-1-20220427.125535-30.jar (67 kB at 89 kB/s)
[INFO] Downloading from maven.aksw.snapshots: https://maven.aksw.org/repository/snapshots/org/aksw/jenax/jenax-io-core/4.5.0-1-SNAPSHOT/jenax-io-core-4.5.0-1-20220427.125535-30.jar
[INFO] Downloaded from maven.aksw.snapshots: https://maven.aksw.org/repository/snapshots/org/aksw/jenax/jenax-arq-collections/4.5.0-1-SNAPSHOT/jenax-arq-collections-4.5.0-1-20220427.125535-33.jar (92 kB at 122 kB/s)
[INFO] Downloading from maven.aksw.snapshots: https://maven.aksw.org/repository/snapshots/org/aksw/jenax/jenax-server-standalone/4.5.0-1-SNAPSHOT/jenax-server-standalone-4.5.0-1-20220427.125535-32.jar
[INFO] Downloaded from maven.aksw.snapshots: https://maven.aksw.org/repository/snapshots/org/aksw/jenax/jenax-io-core/4.5.0-1-SNAPSHOT/jenax-io-core-4.5.0-1-20220427.125535-30.jar (221 kB at 285 kB/s)
[INFO] Downloading from maven.aksw.snapshots: https://maven.aksw.org/repository/snapshots/org/aksw/jenax/jenax-server-frontends/4.5.0-1-SNAPSHOT/jenax-server-frontends-4.5.0-1-20220427.125535-32.jar
[INFO] Downloaded from maven.aksw.snapshots: https://maven.aksw.org/repository/snapshots/org/aksw/jenax/jenax-server-standalone/4.5.0-1-SNAPSHOT/jenax-server-standalone-4.5.0-1-20220427.125535-32.jar (5.2 kB at 6.4 kB/s)
[INFO] Downloading from maven.aksw.snapshots: https://maven.aksw.org/repository/snapshots/org/aksw/jenax/jenax-server-core/4.5.0-1-SNAPSHOT/jenax-server-core-4.5.0-1-20220427.125535-32.jar
[INFO] Downloaded from maven.aksw.snapshots: https://maven.aksw.org/repository/snapshots/org/aksw/jenax/jenax-server-frontends/4.5.0-1-SNAPSHOT/jenax-server-frontends-4.5.0-1-20220427.125535-32.jar (9.9 kB at 12 kB/s)
[INFO] Downloaded from maven.aksw.snapshots: https://maven.aksw.org/repository/snapshots/org/aksw/jenax/jenax-rx-dataaccess/4.5.0-1-SNAPSHOT/jenax-rx-dataaccess-4.5.0-1-20220427.125535-31.jar (368 kB at 447 kB/s)
[INFO] Downloaded from maven.aksw.snapshots: https://maven.aksw.org/repository/snapshots/org/aksw/jenax/jenax-analytics-core/4.5.0-1-SNAPSHOT/jenax-analytics-core-4.5.0-1-20220427.125535-32.jar (66 kB at 81 kB/s)
[INFO] Downloaded from maven.aksw.snapshots: https://maven.aksw.org/repository/snapshots/org/aksw/jenax/jenax-arq-entityquery/4.5.0-1-SNAPSHOT/jenax-arq-entityquery-4.5.0-1-20220427.125535-32.jar (44 kB at 54 kB/s)
[INFO] Downloaded from maven.aksw.snapshots: https://maven.aksw.org/repository/snapshots/org/aksw/jenax/jenax-server-core/4.5.0-1-SNAPSHOT/jenax-server-core-4.5.0-1-20220427.125535-32.jar (404 kB at 428 kB/s)
[INFO] Downloading from apache-repo-snapshots: https://repository.apache.org/content/repositories/snapshots/org/apache/jena/jena-tdb2/4.5.0-SNAPSHOT/jena-tdb2-4.5.0-20220426.052351-49.jar
[INFO] Downloading from apache-repo-snapshots: https://repository.apache.org/content/repositories/snapshots/org/apache/jena/jena-dboe-trans-data/4.5.0-SNAPSHOT/jena-dboe-trans-data-4.5.0-20220426.052351-49.jar
[INFO] Downloading from apache-repo-snapshots: https://repository.apache.org/content/repositories/snapshots/org/apache/jena/jena-dboe-storage/4.5.0-SNAPSHOT/jena-dboe-storage-4.5.0-20220426.052351-49.jar
[INFO] Downloading from apache-repo-snapshots: https://repository.apache.org/content/repositories/snapshots/org/apache/jena/jena-dboe-transaction/4.5.0-SNAPSHOT/jena-dboe-transaction-4.5.0-20220426.052351-49.jar
[INFO] Downloading from apache-repo-snapshots: https://repository.apache.org/content/repositories/snapshots/org/apache/jena/jena-dboe-base/4.5.0-SNAPSHOT/jena-dboe-base-4.5.0-20220426.052351-49.jar
[INFO] Downloaded from apache-repo-snapshots: https://repository.apache.org/content/repositories/snapshots/org/apache/jena/jena-dboe-storage/4.5.0-SNAPSHOT/jena-dboe-storage-4.5.0-20220426.052351-49.jar (0 B at 0 B/s)
[INFO] Downloading from apache-repo-snapshots: https://repository.apache.org/content/repositories/snapshots/org/apache/jena/jena-dboe-index/4.5.0-SNAPSHOT/jena-dboe-index-4.5.0-20220426.052351-49.jar
[INFO] Downloaded from apache-repo-snapshots: https://repository.apache.org/content/repositories/snapshots/org/apache/jena/jena-tdb2/4.5.0-SNAPSHOT/jena-tdb2-4.5.0-20220426.052351-49.jar (297 kB at 2.0 MB/s)
[INFO] Downloading from apache-repo-snapshots: https://repository.apache.org/content/repositories/snapshots/org/apache/jena/jena-base/4.5.0-SNAPSHOT/jena-base-4.5.0-20220426.052351-50.jar
[INFO] Downloaded from apache-repo-snapshots: https://repository.apache.org/content/repositories/snapshots/org/apache/jena/jena-dboe-trans-data/4.5.0-SNAPSHOT/jena-dboe-trans-data-4.5.0-20220426.052351-49.jar (97 kB at 641 kB/s)
[INFO] Downloading from apache-repo-snapshots: https://repository.apache.org/content/repositories/snapshots/org/apache/jena/jena-shaded-guava/4.5.0-SNAPSHOT/jena-shaded-guava-4.5.0-20220426.052351-50.jar
[INFO] Downloaded from apache-repo-snapshots: https://repository.apache.org/content/repositories/snapshots/org/apache/jena/jena-dboe-transaction/4.5.0-SNAPSHOT/jena-dboe-transaction-4.5.0-20220426.052351-49.jar (0 B at 0 B/s)
[INFO] Downloading from apache-repo-snapshots: https://repository.apache.org/content/repositories/snapshots/org/apache/jena/jena-geosparql/4.5.0-SNAPSHOT/jena-geosparql-4.5.0-20220426.052351-49.jar
[INFO] Downloaded from apache-repo-snapshots: https://repository.apache.org/content/repositories/snapshots/org/apache/jena/jena-dboe-base/4.5.0-SNAPSHOT/jena-dboe-base-4.5.0-20220426.052351-49.jar (0 B at 0 B/s)
[INFO] Downloading from apache-repo-snapshots: https://repository.apache.org/content/repositories/snapshots/org/apache/jena/jena-rdfconnection/4.5.0-SNAPSHOT/jena-rdfconnection-4.5.0-20220426.052351-49.jar
[INFO] Downloaded from apache-repo-snapshots: https://repository.apache.org/content/repositories/snapshots/org/apache/jena/jena-dboe-index/4.5.0-SNAPSHOT/jena-dboe-index-4.5.0-20220426.052351-49.jar (19 kB at 95 kB/s)
[INFO] Downloading from apache-repo-snapshots: https://repository.apache.org/content/repositories/snapshots/org/apache/jena/jena-core/4.5.0-SNAPSHOT/jena-core-4.5.0-20220426.052351-50.jar
[INFO] Downloaded from apache-repo-snapshots: https://repository.apache.org/content/repositories/snapshots/org/apache/jena/jena-rdfconnection/4.5.0-SNAPSHOT/jena-rdfconnection-4.5.0-20220426.052351-49.jar (70 kB at 286 kB/s)
[INFO] Downloading from apache-repo-snapshots: https://repository.apache.org/content/repositories/snapshots/org/apache/jena/jena-arq/4.5.0-SNAPSHOT/jena-arq-4.5.0-20220426.052351-50.jar
[INFO] Downloaded from apache-repo-snapshots: https://repository.apache.org/content/repositories/snapshots/org/apache/jena/jena-base/4.5.0-SNAPSHOT/jena-base-4.5.0-20220426.052351-50.jar (0 B at 0 B/s)
[INFO] Downloading from apache-repo-snapshots: https://repository.apache.org/content/repositories/snapshots/org/apache/jena/jena-iri/4.5.0-SNAPSHOT/jena-iri-4.5.0-20220426.052351-50.jar
[INFO] Downloaded from apache-repo-snapshots: https://repository.apache.org/content/repositories/snapshots/org/apache/jena/jena-iri/4.5.0-SNAPSHOT/jena-iri-4.5.0-20220426.052351-50.jar (138 kB at 435 kB/s)
[INFO] Downloaded from apache-repo-snapshots: https://repository.apache.org/content/repositories/snapshots/org/apache/jena/jena-shaded-guava/4.5.0-SNAPSHOT/jena-shaded-guava-4.5.0-20220426.052351-50.jar (0 B at 0 B/s)
[INFO] Downloaded from apache-repo-snapshots: https://repository.apache.org/content/repositories/snapshots/org/apache/jena/jena-core/4.5.0-SNAPSHOT/jena-core-4.5.0-20220426.052351-50.jar (1.8 MB at 4.9 MB/s)
[INFO] Downloaded from apache-repo-snapshots: https://repository.apache.org/content/repositories/snapshots/org/apache/jena/jena-arq/4.5.0-SNAPSHOT/jena-arq-4.5.0-20220426.052351-50.jar (0 B at 0 B/s)
[INFO] Downloaded from apache-repo-snapshots: https://repository.apache.org/content/repositories/snapshots/org/apache/jena/jena-geosparql/4.5.0-SNAPSHOT/jena-geosparql-4.5.0-20220426.052351-49.jar (0 B at 0 B/s)
[INFO] 
[INFO] --- maven-clean-plugin:2.5:clean (default-clean) @ rdf-processing-toolkit-cli ---
[INFO] Deleting /usr/share/tomcat8/.jenkins/jobs/sparql-integrate/workspace/rdf-processing-toolkit-cli/target
[INFO] 
[INFO] --- maven-resources-plugin:2.6:resources (default-resources) @ rdf-processing-toolkit-cli ---
[INFO] Using 'UTF-8' encoding to copy filtered resources.
[INFO] Copying 10 resources
[INFO] Copying 1 resource
[INFO] 
[INFO] --- maven-compiler-plugin:3.6.0:compile (default-compile) @ rdf-processing-toolkit-cli ---
[INFO] Changes detected - recompiling the module!
[INFO] Compiling 56 source files to /usr/share/tomcat8/.jenkins/jobs/sparql-integrate/workspace/rdf-processing-toolkit-cli/target/classes
[INFO] /usr/share/tomcat8/.jenkins/jobs/sparql-integrate/workspace/rdf-processing-toolkit-cli/src/main/java/org/aksw/sparql_integrate/cli/MainCliSparqlLoad.java: Some input files use or override a deprecated API.
[INFO] /usr/share/tomcat8/.jenkins/jobs/sparql-integrate/workspace/rdf-processing-toolkit-cli/src/main/java/org/aksw/sparql_integrate/cli/MainCliSparqlLoad.java: Recompile with -Xlint:deprecation for details.
[INFO] 
[INFO] --- maven-resources-plugin:2.6:testResources (default-testResources) @ rdf-processing-toolkit-cli ---
[INFO] Using 'UTF-8' encoding to copy filtered resources.
[INFO] Copying 11 resources
[INFO] 
[INFO] --- maven-compiler-plugin:3.6.0:testCompile (default-testCompile) @ rdf-processing-toolkit-cli ---
[INFO] Changes detected - recompiling the module!
[INFO] Compiling 2 source files to /usr/share/tomcat8/.jenkins/jobs/sparql-integrate/workspace/rdf-processing-toolkit-cli/target/test-classes
[INFO] 
[INFO] --- maven-surefire-plugin:2.19:test (default-test) @ rdf-processing-toolkit-cli ---

-------------------------------------------------------
 T E S T S
-------------------------------------------------------
NOTE: Picked up JDK_JAVA_OPTIONS:  --add-opens=java.base/java.lang=ALL-UNNAMED --add-opens=java.base/java.io=ALL-UNNAMED --add-opens=java.rmi/sun.rmi.transport=ALL-UNNAMED
Running org.aksw.sparql_integrate.ngs.cli.main.TestCliNgs
Tests run: 1, Failures: 0, Errors: 0, Skipped: 0, Time elapsed: 0.018 sec - in org.aksw.sparql_integrate.ngs.cli.main.TestCliNgs
Running org.aksw.sparql_integrate.ngs.cli.main.TestSparqlBindingStreamOperators
java.lang.RuntimeException: java.lang.RuntimeException: No lang found for label txt
	at org.aksw.commons.util.exception.ExceptionUtilsAksw.rethrowUnless(ExceptionUtilsAksw.java:40)
	at org.aksw.commons.util.exception.ExceptionUtilsAksw.rethrowIfNotBrokenPipe(ExceptionUtilsAksw.java:81)
	at org.aksw.rdf_processing_toolkit.cli.cmd.CmdUtils.lambda$callCmd$0(CmdUtils.java:69)
	at picocli.CommandLine.execute(CommandLine.java:2088)
	at org.aksw.rdf_processing_toolkit.cli.cmd.CmdUtils.callCmd(CmdUtils.java:75)
	at org.aksw.rdf_processing_toolkit.cli.cmd.CmdUtils.callCmd(CmdUtils.java:39)
	at org.aksw.sparql_integrate.ngs.cli.main.TestSparqlBindingStreamOperators.test1(TestSparqlBindingStreamOperators.java:15)
	at java.base/jdk.internal.reflect.NativeMethodAccessorImpl.invoke0(Native Method)
	at java.base/jdk.internal.reflect.NativeMethodAccessorImpl.invoke(NativeMethodAccessorImpl.java:62)
	at java.base/jdk.internal.reflect.DelegatingMethodAccessorImpl.invoke(DelegatingMethodAccessorImpl.java:43)
	at java.base/java.lang.reflect.Method.invoke(Method.java:566)
	at org.junit.runners.model.FrameworkMethod$1.runReflectiveCall(FrameworkMethod.java:50)
	at org.junit.internal.runners.model.ReflectiveCallable.run(ReflectiveCallable.java:12)
	at org.junit.runners.model.FrameworkMethod.invokeExplosively(FrameworkMethod.java:47)
	at org.junit.internal.runners.statements.InvokeMethod.evaluate(InvokeMethod.java:17)
	at org.junit.runners.ParentRunner.runLeaf(ParentRunner.java:325)
	at org.junit.runners.BlockJUnit4ClassRunner.runChild(BlockJUnit4ClassRunner.java:78)
	at org.junit.runners.BlockJUnit4ClassRunner.runChild(BlockJUnit4ClassRunner.java:57)
	at org.junit.runners.ParentRunner$3.run(ParentRunner.java:290)
	at org.junit.runners.ParentRunner$1.schedule(ParentRunner.java:71)
	at org.junit.runners.ParentRunner.runChildren(ParentRunner.java:288)
	at org.junit.runners.ParentRunner.access$000(ParentRunner.java:58)
	at org.junit.runners.ParentRunner$2.evaluate(ParentRunner.java:268)
	at org.junit.runners.ParentRunner.run(ParentRunner.java:363)
	at org.apache.maven.surefire.junit4.JUnit4Provider.execute(JUnit4Provider.java:344)
	at org.apache.maven.surefire.junit4.JUnit4Provider.executeWithRerun(JUnit4Provider.java:269)
	at org.apache.maven.surefire.junit4.JUnit4Provider.executeTestSet(JUnit4Provider.java:240)
	at org.apache.maven.surefire.junit4.JUnit4Provider.invoke(JUnit4Provider.java:184)
	at org.apache.maven.surefire.booter.ForkedBooter.invokeProviderInSameClassLoader(ForkedBooter.java:286)
	at org.apache.maven.surefire.booter.ForkedBooter.runSuitesInProcess(ForkedBooter.java:240)
	at org.apache.maven.surefire.booter.ForkedBooter.main(ForkedBooter.java:121)
Caused by: java.lang.RuntimeException: No lang found for label txt
	at org.aksw.jena_sparql_api.rx.RDFLanguagesEx.lambda$findLang$6(RDFLanguagesEx.java:209)
	at java.base/java.util.Optional.orElseThrow(Optional.java:408)
	at org.aksw.jena_sparql_api.rx.RDFLanguagesEx.findLang(RDFLanguagesEx.java:209)
	at org.aksw.sparql_binding_stream.cli.main.SbsCmdImpls.query(SbsCmdImpls.java:201)
	at org.aksw.sparql_binding_stream.cli.cmd.CmdSbsMap.call(CmdSbsMap.java:37)
	at org.aksw.sparql_binding_stream.cli.cmd.CmdSbsMap.call(CmdSbsMap.java:13)
	at picocli.CommandLine.executeUserObject(CommandLine.java:1953)
	at picocli.CommandLine.access$1300(CommandLine.java:145)
	at picocli.CommandLine$RunLast.executeUserObjectOfLastSubcommandWithSameParent(CommandLine.java:2358)
	at picocli.CommandLine$RunLast.handle(CommandLine.java:2352)
	at picocli.CommandLine$RunLast.handle(CommandLine.java:2314)
	at picocli.CommandLine$AbstractParseResultHandler.execute(CommandLine.java:2179)
	at picocli.CommandLine$RunLast.execute(CommandLine.java:2316)
	at picocli.CommandLine.execute(CommandLine.java:2078)
	... 27 more
java.lang.RuntimeException: java.lang.RuntimeException: No lang found for label txt
	at org.aksw.commons.util.exception.ExceptionUtilsAksw.rethrowUnless(ExceptionUtilsAksw.java:40)
	at org.aksw.commons.util.exception.ExceptionUtilsAksw.rethrowIfNotBrokenPipe(ExceptionUtilsAksw.java:81)
	at org.aksw.rdf_processing_toolkit.cli.cmd.CmdUtils.lambda$callCmd$0(CmdUtils.java:69)
	at picocli.CommandLine.execute(CommandLine.java:2088)
	at org.aksw.rdf_processing_toolkit.cli.cmd.CmdUtils.callCmd(CmdUtils.java:75)
	at org.aksw.rdf_processing_toolkit.cli.cmd.CmdUtils.callCmd(CmdUtils.java:39)
	at org.aksw.sparql_integrate.ngs.cli.main.TestSparqlBindingStreamOperators.test1(TestSparqlBindingStreamOperators.java:16)
	at java.base/jdk.internal.reflect.NativeMethodAccessorImpl.invoke0(Native Method)
	at java.base/jdk.internal.reflect.NativeMethodAccessorImpl.invoke(NativeMethodAccessorImpl.java:62)
	at java.base/jdk.internal.reflect.DelegatingMethodAccessorImpl.invoke(DelegatingMethodAccessorImpl.java:43)
	at java.base/java.lang.reflect.Method.invoke(Method.java:566)
	at org.junit.runners.model.FrameworkMethod$1.runReflectiveCall(FrameworkMethod.java:50)
	at org.junit.internal.runners.model.ReflectiveCallable.run(ReflectiveCallable.java:12)
	at org.junit.runners.model.FrameworkMethod.invokeExplosively(FrameworkMethod.java:47)
	at org.junit.internal.runners.statements.InvokeMethod.evaluate(InvokeMethod.java:17)
	at org.junit.runners.ParentRunner.runLeaf(ParentRunner.java:325)
	at org.junit.runners.BlockJUnit4ClassRunner.runChild(BlockJUnit4ClassRunner.java:78)
	at org.junit.runners.BlockJUnit4ClassRunner.runChild(BlockJUnit4ClassRunner.java:57)
	at org.junit.runners.ParentRunner$3.run(ParentRunner.java:290)
	at org.junit.runners.ParentRunner$1.schedule(ParentRunner.java:71)
	at org.junit.runners.ParentRunner.runChildren(ParentRunner.java:288)
	at org.junit.runners.ParentRunner.access$000(ParentRunner.java:58)
	at org.junit.runners.ParentRunner$2.evaluate(ParentRunner.java:268)
	at org.junit.runners.ParentRunner.run(ParentRunner.java:363)
	at org.apache.maven.surefire.junit4.JUnit4Provider.execute(JUnit4Provider.java:344)
	at org.apache.maven.surefire.junit4.JUnit4Provider.executeWithRerun(JUnit4Provider.java:269)
	at org.apache.maven.surefire.junit4.JUnit4Provider.executeTestSet(JUnit4Provider.java:240)
	at org.apache.maven.surefire.junit4.JUnit4Provider.invoke(JUnit4Provider.java:184)
	at org.apache.maven.surefire.booter.ForkedBooter.invokeProviderInSameClassLoader(ForkedBooter.java:286)
	at org.apache.maven.surefire.booter.ForkedBooter.runSuitesInProcess(ForkedBooter.java:240)
	at org.apache.maven.surefire.booter.ForkedBooter.main(ForkedBooter.java:121)
Caused by: java.lang.RuntimeException: No lang found for label txt
	at org.aksw.jena_sparql_api.rx.RDFLanguagesEx.lambda$findLang$6(RDFLanguagesEx.java:209)
	at java.base/java.util.Optional.orElseThrow(Optional.java:408)
	at org.aksw.jena_sparql_api.rx.RDFLanguagesEx.findLang(RDFLanguagesEx.java:209)
	at org.aksw.sparql_binding_stream.cli.main.SbsCmdImpls.query(SbsCmdImpls.java:201)
	at org.aksw.sparql_binding_stream.cli.cmd.CmdSbsMap.call(CmdSbsMap.java:37)
	at org.aksw.sparql_binding_stream.cli.cmd.CmdSbsMap.call(CmdSbsMap.java:13)
	at picocli.CommandLine.executeUserObject(CommandLine.java:1953)
	at picocli.CommandLine.access$1300(CommandLine.java:145)
	at picocli.CommandLine$RunLast.executeUserObjectOfLastSubcommandWithSameParent(CommandLine.java:2358)
	at picocli.CommandLine$RunLast.handle(CommandLine.java:2352)
	at picocli.CommandLine$RunLast.handle(CommandLine.java:2314)
	at picocli.CommandLine$AbstractParseResultHandler.execute(CommandLine.java:2179)
	at picocli.CommandLine$RunLast.execute(CommandLine.java:2316)
	at picocli.CommandLine.execute(CommandLine.java:2078)
	... 27 more
java.lang.RuntimeException: java.lang.RuntimeException: No lang found for label txt
	at org.aksw.commons.util.exception.ExceptionUtilsAksw.rethrowUnless(ExceptionUtilsAksw.java:40)
	at org.aksw.commons.util.exception.ExceptionUtilsAksw.rethrowIfNotBrokenPipe(ExceptionUtilsAksw.java:81)
	at org.aksw.rdf_processing_toolkit.cli.cmd.CmdUtils.lambda$callCmd$0(CmdUtils.java:69)
	at picocli.CommandLine.execute(CommandLine.java:2088)
	at org.aksw.rdf_processing_toolkit.cli.cmd.CmdUtils.callCmd(CmdUtils.java:75)
	at org.aksw.rdf_processing_toolkit.cli.cmd.CmdUtils.callCmd(CmdUtils.java:39)
	at org.aksw.sparql_integrate.ngs.cli.main.TestSparqlBindingStreamOperators.test1(TestSparqlBindingStreamOperators.java:17)
	at java.base/jdk.internal.reflect.NativeMethodAccessorImpl.invoke0(Native Method)
	at java.base/jdk.internal.reflect.NativeMethodAccessorImpl.invoke(NativeMethodAccessorImpl.java:62)
	at java.base/jdk.internal.reflect.DelegatingMethodAccessorImpl.invoke(DelegatingMethodAccessorImpl.java:43)
	at java.base/java.lang.reflect.Method.invoke(Method.java:566)
	at org.junit.runners.model.FrameworkMethod$1.runReflectiveCall(FrameworkMethod.java:50)
	at org.junit.internal.runners.model.ReflectiveCallable.run(ReflectiveCallable.java:12)
	at org.junit.runners.model.FrameworkMethod.invokeExplosively(FrameworkMethod.java:47)
	at org.junit.internal.runners.statements.InvokeMethod.evaluate(InvokeMethod.java:17)
	at org.junit.runners.ParentRunner.runLeaf(ParentRunner.java:325)
	at org.junit.runners.BlockJUnit4ClassRunner.runChild(BlockJUnit4ClassRunner.java:78)
	at org.junit.runners.BlockJUnit4ClassRunner.runChild(BlockJUnit4ClassRunner.java:57)
	at org.junit.runners.ParentRunner$3.run(ParentRunner.java:290)
	at org.junit.runners.ParentRunner$1.schedule(ParentRunner.java:71)
	at org.junit.runners.ParentRunner.runChildren(ParentRunner.java:288)
	at org.junit.runners.ParentRunner.access$000(ParentRunner.java:58)
	at org.junit.runners.ParentRunner$2.evaluate(ParentRunner.java:268)
	at org.junit.runners.ParentRunner.run(ParentRunner.java:363)
	at org.apache.maven.surefire.junit4.JUnit4Provider.execute(JUnit4Provider.java:344)
	at org.apache.maven.surefire.junit4.JUnit4Provider.executeWithRerun(JUnit4Provider.java:269)
	at org.apache.maven.surefire.junit4.JUnit4Provider.executeTestSet(JUnit4Provider.java:240)
	at org.apache.maven.surefire.junit4.JUnit4Provider.invoke(JUnit4Provider.java:184)
	at org.apache.maven.surefire.booter.ForkedBooter.invokeProviderInSameClassLoader(ForkedBooter.java:286)
	at org.apache.maven.surefire.booter.ForkedBooter.runSuitesInProcess(ForkedBooter.java:240)
	at org.apache.maven.surefire.booter.ForkedBooter.main(ForkedBooter.java:121)
Caused by: java.lang.RuntimeException: No lang found for label txt
	at org.aksw.jena_sparql_api.rx.RDFLanguagesEx.lambda$findLang$6(RDFLanguagesEx.java:209)
	at java.base/java.util.Optional.orElseThrow(Optional.java:408)
	at org.aksw.jena_sparql_api.rx.RDFLanguagesEx.findLang(RDFLanguagesEx.java:209)
	at org.aksw.sparql_binding_stream.cli.main.SbsCmdImpls.query(SbsCmdImpls.java:201)
	at org.aksw.sparql_binding_stream.cli.cmd.CmdSbsMap.call(CmdSbsMap.java:37)
	at org.aksw.sparql_binding_stream.cli.cmd.CmdSbsMap.call(CmdSbsMap.java:13)
	at picocli.CommandLine.executeUserObject(CommandLine.java:1953)
	at picocli.CommandLine.access$1300(CommandLine.java:145)
	at picocli.CommandLine$RunLast.executeUserObjectOfLastSubcommandWithSameParent(CommandLine.java:2358)
	at picocli.CommandLine$RunLast.handle(CommandLine.java:2352)
	at picocli.CommandLine$RunLast.handle(CommandLine.java:2314)
	at picocli.CommandLine$AbstractParseResultHandler.execute(CommandLine.java:2179)
	at picocli.CommandLine$RunLast.execute(CommandLine.java:2316)
	at picocli.CommandLine.execute(CommandLine.java:2078)
	... 27 more
java.lang.RuntimeException: java.lang.RuntimeException: No lang found for label txt
	at org.aksw.commons.util.exception.ExceptionUtilsAksw.rethrowUnless(ExceptionUtilsAksw.java:40)
	at org.aksw.commons.util.exception.ExceptionUtilsAksw.rethrowIfNotBrokenPipe(ExceptionUtilsAksw.java:81)
	at org.aksw.rdf_processing_toolkit.cli.cmd.CmdUtils.lambda$callCmd$0(CmdUtils.java:69)
	at picocli.CommandLine.execute(CommandLine.java:2088)
	at org.aksw.rdf_processing_toolkit.cli.cmd.CmdUtils.callCmd(CmdUtils.java:75)
	at org.aksw.rdf_processing_toolkit.cli.cmd.CmdUtils.callCmd(CmdUtils.java:39)
	at org.aksw.sparql_integrate.ngs.cli.main.TestSparqlBindingStreamOperators.test1(TestSparqlBindingStreamOperators.java:18)
	at java.base/jdk.internal.reflect.NativeMethodAccessorImpl.invoke0(Native Method)
	at java.base/jdk.internal.reflect.NativeMethodAccessorImpl.invoke(NativeMethodAccessorImpl.java:62)
	at java.base/jdk.internal.reflect.DelegatingMethodAccessorImpl.invoke(DelegatingMethodAccessorImpl.java:43)
	at java.base/java.lang.reflect.Method.invoke(Method.java:566)
	at org.junit.runners.model.FrameworkMethod$1.runReflectiveCall(FrameworkMethod.java:50)
	at org.junit.internal.runners.model.ReflectiveCallable.run(ReflectiveCallable.java:12)
	at org.junit.runners.model.FrameworkMethod.invokeExplosively(FrameworkMethod.java:47)
	at org.junit.internal.runners.statements.InvokeMethod.evaluate(InvokeMethod.java:17)
	at org.junit.runners.ParentRunner.runLeaf(ParentRunner.java:325)
	at org.junit.runners.BlockJUnit4ClassRunner.runChild(BlockJUnit4ClassRunner.java:78)
	at org.junit.runners.BlockJUnit4ClassRunner.runChild(BlockJUnit4ClassRunner.java:57)
	at org.junit.runners.ParentRunner$3.run(ParentRunner.java:290)
	at org.junit.runners.ParentRunner$1.schedule(ParentRunner.java:71)
	at org.junit.runners.ParentRunner.runChildren(ParentRunner.java:288)
	at org.junit.runners.ParentRunner.access$000(ParentRunner.java:58)
	at org.junit.runners.ParentRunner$2.evaluate(ParentRunner.java:268)
	at org.junit.runners.ParentRunner.run(ParentRunner.java:363)
	at org.apache.maven.surefire.junit4.JUnit4Provider.execute(JUnit4Provider.java:344)
	at org.apache.maven.surefire.junit4.JUnit4Provider.executeWithRerun(JUnit4Provider.java:269)
	at org.apache.maven.surefire.junit4.JUnit4Provider.executeTestSet(JUnit4Provider.java:240)
	at org.apache.maven.surefire.junit4.JUnit4Provider.invoke(JUnit4Provider.java:184)
	at org.apache.maven.surefire.booter.ForkedBooter.invokeProviderInSameClassLoader(ForkedBooter.java:286)
	at org.apache.maven.surefire.booter.ForkedBooter.runSuitesInProcess(ForkedBooter.java:240)
	at org.apache.maven.surefire.booter.ForkedBooter.main(ForkedBooter.java:121)
Caused by: java.lang.RuntimeException: No lang found for label txt
	at org.aksw.jena_sparql_api.rx.RDFLanguagesEx.lambda$findLang$6(RDFLanguagesEx.java:209)
	at java.base/java.util.Optional.orElseThrow(Optional.java:408)
	at org.aksw.jena_sparql_api.rx.RDFLanguagesEx.findLang(RDFLanguagesEx.java:209)
	at org.aksw.sparql_binding_stream.cli.main.SbsCmdImpls.query(SbsCmdImpls.java:201)
	at org.aksw.sparql_binding_stream.cli.cmd.CmdSbsMap.call(CmdSbsMap.java:37)
	at org.aksw.sparql_binding_stream.cli.cmd.CmdSbsMap.call(CmdSbsMap.java:13)
	at picocli.CommandLine.executeUserObject(CommandLine.java:1953)
	at picocli.CommandLine.access$1300(CommandLine.java:145)
	at picocli.CommandLine$RunLast.executeUserObjectOfLastSubcommandWithSameParent(CommandLine.java:2358)
	at picocli.CommandLine$RunLast.handle(CommandLine.java:2352)
	at picocli.CommandLine$RunLast.handle(CommandLine.java:2314)
	at picocli.CommandLine$AbstractParseResultHandler.execute(CommandLine.java:2179)
	at picocli.CommandLine$RunLast.execute(CommandLine.java:2316)
	at picocli.CommandLine.execute(CommandLine.java:2078)
	... 27 more
java.lang.RuntimeException: java.lang.RuntimeException: No lang found for label txt
	at org.aksw.commons.util.exception.ExceptionUtilsAksw.rethrowUnless(ExceptionUtilsAksw.java:40)
	at org.aksw.commons.util.exception.ExceptionUtilsAksw.rethrowIfNotBrokenPipe(ExceptionUtilsAksw.java:81)
	at org.aksw.rdf_processing_toolkit.cli.cmd.CmdUtils.lambda$callCmd$0(CmdUtils.java:69)
	at picocli.CommandLine.execute(CommandLine.java:2088)
	at org.aksw.rdf_processing_toolkit.cli.cmd.CmdUtils.callCmd(CmdUtils.java:75)
	at org.aksw.rdf_processing_toolkit.cli.cmd.CmdUtils.callCmd(CmdUtils.java:39)
	at org.aksw.sparql_integrate.ngs.cli.main.TestSparqlBindingStreamOperators.test1(TestSparqlBindingStreamOperators.java:20)
	at java.base/jdk.internal.reflect.NativeMethodAccessorImpl.invoke0(Native Method)
	at java.base/jdk.internal.reflect.NativeMethodAccessorImpl.invoke(NativeMethodAccessorImpl.java:62)
	at java.base/jdk.internal.reflect.DelegatingMethodAccessorImpl.invoke(DelegatingMethodAccessorImpl.java:43)
	at java.base/java.lang.reflect.Method.invoke(Method.java:566)
	at org.junit.runners.model.FrameworkMethod$1.runReflectiveCall(FrameworkMethod.java:50)
	at org.junit.internal.runners.model.ReflectiveCallable.run(ReflectiveCallable.java:12)
	at org.junit.runners.model.FrameworkMethod.invokeExplosively(FrameworkMethod.java:47)
	at org.junit.internal.runners.statements.InvokeMethod.evaluate(InvokeMethod.java:17)
	at org.junit.runners.ParentRunner.runLeaf(ParentRunner.java:325)
	at org.junit.runners.BlockJUnit4ClassRunner.runChild(BlockJUnit4ClassRunner.java:78)
	at org.junit.runners.BlockJUnit4ClassRunner.runChild(BlockJUnit4ClassRunner.java:57)
	at org.junit.runners.ParentRunner$3.run(ParentRunner.java:290)
	at org.junit.runners.ParentRunner$1.schedule(ParentRunner.java:71)
	at org.junit.runners.ParentRunner.runChildren(ParentRunner.java:288)
	at org.junit.runners.ParentRunner.access$000(ParentRunner.java:58)
	at org.junit.runners.ParentRunner$2.evaluate(ParentRunner.java:268)
	at org.junit.runners.ParentRunner.run(ParentRunner.java:363)
	at org.apache.maven.surefire.junit4.JUnit4Provider.execute(JUnit4Provider.java:344)
	at org.apache.maven.surefire.junit4.JUnit4Provider.executeWithRerun(JUnit4Provider.java:269)
	at org.apache.maven.surefire.junit4.JUnit4Provider.executeTestSet(JUnit4Provider.java:240)
	at org.apache.maven.surefire.junit4.JUnit4Provider.invoke(JUnit4Provider.java:184)
	at org.apache.maven.surefire.booter.ForkedBooter.invokeProviderInSameClassLoader(ForkedBooter.java:286)
	at org.apache.maven.surefire.booter.ForkedBooter.runSuitesInProcess(ForkedBooter.java:240)
	at org.apache.maven.surefire.booter.ForkedBooter.main(ForkedBooter.java:121)
Caused by: java.lang.RuntimeException: No lang found for label txt
	at org.aksw.jena_sparql_api.rx.RDFLanguagesEx.lambda$findLang$6(RDFLanguagesEx.java:209)
	at java.base/java.util.Optional.orElseThrow(Optional.java:408)
	at org.aksw.jena_sparql_api.rx.RDFLanguagesEx.findLang(RDFLanguagesEx.java:209)
	at org.aksw.sparql_binding_stream.cli.main.SbsCmdImpls.query(SbsCmdImpls.java:201)
	at org.aksw.sparql_binding_stream.cli.cmd.CmdSbsMap.call(CmdSbsMap.java:37)
	at org.aksw.sparql_binding_stream.cli.cmd.CmdSbsMap.call(CmdSbsMap.java:13)
	at picocli.CommandLine.executeUserObject(CommandLine.java:1953)
	at picocli.CommandLine.access$1300(CommandLine.java:145)
	at picocli.CommandLine$RunLast.executeUserObjectOfLastSubcommandWithSameParent(CommandLine.java:2358)
	at picocli.CommandLine$RunLast.handle(CommandLine.java:2352)
	at picocli.CommandLine$RunLast.handle(CommandLine.java:2314)
	at picocli.CommandLine$AbstractParseResultHandler.execute(CommandLine.java:2179)
	at picocli.CommandLine$RunLast.execute(CommandLine.java:2316)
	at picocli.CommandLine.execute(CommandLine.java:2078)
	... 27 more
Tests run: 1, Failures: 0, Errors: 0, Skipped: 0, Time elapsed: 5.745 sec - in org.aksw.sparql_integrate.ngs.cli.main.TestSparqlBindingStreamOperators

Results :

Tests run: 2, Failures: 0, Errors: 0, Skipped: 0

[JENKINS] Recording test results
[INFO] 
[INFO] --- maven-jar-plugin:2.4:jar (default-jar) @ rdf-processing-toolkit-cli ---
[INFO] Building jar: /usr/share/tomcat8/.jenkins/jobs/sparql-integrate/workspace/rdf-processing-toolkit-cli/target/rdf-processing-toolkit-cli-1.9.1-SNAPSHOT.jar
[INFO] 
[INFO] --- maven-javadoc-plugin:2.9.1:jar (attach-javadocs) @ rdf-processing-toolkit-cli ---
[INFO] 
Loading source file /usr/share/tomcat8/.jenkins/jobs/sparql-integrate/workspace/rdf-processing-toolkit-cli/src/main/java/sbs.java...
Loading source file /usr/share/tomcat8/.jenkins/jobs/sparql-integrate/workspace/rdf-processing-toolkit-cli/src/main/java/rpt.java...
Loading source file /usr/share/tomcat8/.jenkins/jobs/sparql-integrate/workspace/rdf-processing-toolkit-cli/src/main/java/ngs.java...
Loading source file /usr/share/tomcat8/.jenkins/jobs/sparql-integrate/workspace/rdf-processing-toolkit-cli/src/main/java/integrate.java...
Loading source files for package org.aksw.named_graph_stream.cli.main...
Loading source files for package org.aksw.named_graph_stream.cli.cmd...
Loading source files for package org.aksw.sparql_integrate.cli...
Loading source files for package org.aksw.sparql_integrate.cli.main...
Loading source files for package org.aksw.sparql_integrate.cli.cmd...
Loading source files for package org.aksw.rdf_processing_toolkit.cli.main...
Loading source files for package org.aksw.rdf_processing_toolkit.cli.cmd...
Loading source files for package org.aksw.jena_sparql_api.rx.op.api...
Loading source files for package org.aksw.sparql_binding_stream.cli.main...
Loading source files for package org.aksw.sparql_binding_stream.cli.cmd...
Constructing Javadoc information...
Standard Doclet version 11.0.13
Building tree for all the packages and classes...
Generating /usr/share/tomcat8/.jenkins/jobs/sparql-integrate/workspace/rdf-processing-toolkit-cli/target/apidocs/integrate.html...
Generating /usr/share/tomcat8/.jenkins/jobs/sparql-integrate/workspace/rdf-processing-toolkit-cli/target/apidocs/ngs.html...
Generating /usr/share/tomcat8/.jenkins/jobs/sparql-integrate/workspace/rdf-processing-toolkit-cli/target/apidocs/rpt.html...
Generating /usr/share/tomcat8/.jenkins/jobs/sparql-integrate/workspace/rdf-processing-toolkit-cli/target/apidocs/sbs.html...
Generating /usr/share/tomcat8/.jenkins/jobs/sparql-integrate/workspace/rdf-processing-toolkit-cli/target/apidocs/org/aksw/jena_sparql_api/rx/op/api/OpConfigSort.html...
Generating /usr/share/tomcat8/.jenkins/jobs/sparql-integrate/workspace/rdf-processing-toolkit-cli/target/apidocs/org/aksw/named_graph_stream/cli/cmd/CmdNgJoin.html...
Generating /usr/share/tomcat8/.jenkins/jobs/sparql-integrate/workspace/rdf-processing-toolkit-cli/target/apidocs/org/aksw/named_graph_stream/cli/cmd/CmdNgsCat.html...
Generating /usr/share/tomcat8/.jenkins/jobs/sparql-integrate/workspace/rdf-processing-toolkit-cli/target/apidocs/org/aksw/named_graph_stream/cli/cmd/CmdNgsFilter.html...
Generating /usr/share/tomcat8/.jenkins/jobs/sparql-integrate/workspace/rdf-processing-toolkit-cli/target/apidocs/org/aksw/named_graph_stream/cli/cmd/CmdNgsGit.html...
Generating /usr/share/tomcat8/.jenkins/jobs/sparql-integrate/workspace/rdf-processing-toolkit-cli/target/apidocs/org/aksw/named_graph_stream/cli/cmd/CmdNgsHead.html...
Generating /usr/share/tomcat8/.jenkins/jobs/sparql-integrate/workspace/rdf-processing-toolkit-cli/target/apidocs/org/aksw/named_graph_stream/cli/cmd/CmdNgsMain.html...
Generating /usr/share/tomcat8/.jenkins/jobs/sparql-integrate/workspace/rdf-processing-toolkit-cli/target/apidocs/org/aksw/named_graph_stream/cli/cmd/CmdNgsMap.html...
Generating /usr/share/tomcat8/.jenkins/jobs/sparql-integrate/workspace/rdf-processing-toolkit-cli/target/apidocs/org/aksw/named_graph_stream/cli/cmd/CmdNgsMap.MapSpec.html...
Generating /usr/share/tomcat8/.jenkins/jobs/sparql-integrate/workspace/rdf-processing-toolkit-cli/target/apidocs/org/aksw/named_graph_stream/cli/cmd/CmdNgsMerge.html...
Generating /usr/share/tomcat8/.jenkins/jobs/sparql-integrate/workspace/rdf-processing-toolkit-cli/target/apidocs/org/aksw/named_graph_stream/cli/cmd/CmdNgsProbe.html...
Generating /usr/share/tomcat8/.jenkins/jobs/sparql-integrate/workspace/rdf-processing-toolkit-cli/target/apidocs/org/aksw/named_graph_stream/cli/cmd/CmdNgsSort.html...
Generating /usr/share/tomcat8/.jenkins/jobs/sparql-integrate/workspace/rdf-processing-toolkit-cli/target/apidocs/org/aksw/named_graph_stream/cli/cmd/CmdNgsSubjects.html...
Generating /usr/share/tomcat8/.jenkins/jobs/sparql-integrate/workspace/rdf-processing-toolkit-cli/target/apidocs/org/aksw/named_graph_stream/cli/cmd/CmdNgsTail.html...
Generating /usr/share/tomcat8/.jenkins/jobs/sparql-integrate/workspace/rdf-processing-toolkit-cli/target/apidocs/org/aksw/named_graph_stream/cli/cmd/CmdNgsUntil.html...
Generating /usr/share/tomcat8/.jenkins/jobs/sparql-integrate/workspace/rdf-processing-toolkit-cli/target/apidocs/org/aksw/named_graph_stream/cli/cmd/CmdNgsWc.html...
Generating /usr/share/tomcat8/.jenkins/jobs/sparql-integrate/workspace/rdf-processing-toolkit-cli/target/apidocs/org/aksw/named_graph_stream/cli/cmd/CmdNgsWhile.html...
Generating /usr/share/tomcat8/.jenkins/jobs/sparql-integrate/workspace/rdf-processing-toolkit-cli/target/apidocs/org/aksw/named_graph_stream/cli/cmd/IParameterConsumerFlaggedLong.html...
Generating /usr/share/tomcat8/.jenkins/jobs/sparql-integrate/workspace/rdf-processing-toolkit-cli/target/apidocs/org/aksw/named_graph_stream/cli/main/DatasetFlowOps.html...
Generating /usr/share/tomcat8/.jenkins/jobs/sparql-integrate/workspace/rdf-processing-toolkit-cli/target/apidocs/org/aksw/named_graph_stream/cli/main/MainCliNamedGraphStream.html...
Generating /usr/share/tomcat8/.jenkins/jobs/sparql-integrate/workspace/rdf-processing-toolkit-cli/target/apidocs/org/aksw/named_graph_stream/cli/main/MainPlaygroundScanTrig.html...
Generating /usr/share/tomcat8/.jenkins/jobs/sparql-integrate/workspace/rdf-processing-toolkit-cli/target/apidocs/org/aksw/named_graph_stream/cli/main/NamedGraphFluent.html...
Generating /usr/share/tomcat8/.jenkins/jobs/sparql-integrate/workspace/rdf-processing-toolkit-cli/target/apidocs/org/aksw/named_graph_stream/cli/main/NamedGraphStreamOps.html...
Generating /usr/share/tomcat8/.jenkins/jobs/sparql-integrate/workspace/rdf-processing-toolkit-cli/target/apidocs/org/aksw/named_graph_stream/cli/main/NgsCmdImpls.html...
Generating /usr/share/tomcat8/.jenkins/jobs/sparql-integrate/workspace/rdf-processing-toolkit-cli/target/apidocs/org/aksw/named_graph_stream/cli/main/NgsGitCmdImpls.html...
Generating /usr/share/tomcat8/.jenkins/jobs/sparql-integrate/workspace/rdf-processing-toolkit-cli/target/apidocs/org/aksw/named_graph_stream/cli/main/QueryEvaluatorForTuple.html...
Generating /usr/share/tomcat8/.jenkins/jobs/sparql-integrate/workspace/rdf-processing-toolkit-cli/target/apidocs/org/aksw/rdf_processing_toolkit/cli/cmd/CliUtils.html...
Generating /usr/share/tomcat8/.jenkins/jobs/sparql-integrate/workspace/rdf-processing-toolkit-cli/target/apidocs/org/aksw/rdf_processing_toolkit/cli/cmd/CmdCommonBase.html...
Generating /usr/share/tomcat8/.jenkins/jobs/sparql-integrate/workspace/rdf-processing-toolkit-cli/target/apidocs/org/aksw/rdf_processing_toolkit/cli/cmd/CmdRptMain.html...
Generating /usr/share/tomcat8/.jenkins/jobs/sparql-integrate/workspace/rdf-processing-toolkit-cli/target/apidocs/org/aksw/rdf_processing_toolkit/cli/cmd/CmdUtils.html...
Generating /usr/share/tomcat8/.jenkins/jobs/sparql-integrate/workspace/rdf-processing-toolkit-cli/target/apidocs/org/aksw/rdf_processing_toolkit/cli/cmd/HasDebugMode.html...
Generating /usr/share/tomcat8/.jenkins/jobs/sparql-integrate/workspace/rdf-processing-toolkit-cli/target/apidocs/org/aksw/rdf_processing_toolkit/cli/cmd/VersionProviderFromClasspathProperties.html...
Generating /usr/share/tomcat8/.jenkins/jobs/sparql-integrate/workspace/rdf-processing-toolkit-cli/target/apidocs/org/aksw/rdf_processing_toolkit/cli/cmd/VersionProviderRdfProcessingToolkit.html...
Generating /usr/share/tomcat8/.jenkins/jobs/sparql-integrate/workspace/rdf-processing-toolkit-cli/target/apidocs/org/aksw/rdf_processing_toolkit/cli/main/MainCliRdfProcessingToolkit.html...
Generating /usr/share/tomcat8/.jenkins/jobs/sparql-integrate/workspace/rdf-processing-toolkit-cli/target/apidocs/org/aksw/sparql_binding_stream/cli/cmd/CmdSbsFilter.html...
Generating /usr/share/tomcat8/.jenkins/jobs/sparql-integrate/workspace/rdf-processing-toolkit-cli/target/apidocs/org/aksw/sparql_binding_stream/cli/cmd/CmdSbsMain.html...
Generating /usr/share/tomcat8/.jenkins/jobs/sparql-integrate/workspace/rdf-processing-toolkit-cli/target/apidocs/org/aksw/sparql_binding_stream/cli/cmd/CmdSbsMap.html...
Generating /usr/share/tomcat8/.jenkins/jobs/sparql-integrate/workspace/rdf-processing-toolkit-cli/target/apidocs/org/aksw/sparql_binding_stream/cli/cmd/CmdSbsSplit.html...
Generating /usr/share/tomcat8/.jenkins/jobs/sparql-integrate/workspace/rdf-processing-toolkit-cli/target/apidocs/org/aksw/sparql_binding_stream/cli/main/MainCliSparqlBindingStream.html...
Generating /usr/share/tomcat8/.jenkins/jobs/sparql-integrate/workspace/rdf-processing-toolkit-cli/target/apidocs/org/aksw/sparql_binding_stream/cli/main/SbsCmdImpls.html...
Generating /usr/share/tomcat8/.jenkins/jobs/sparql-integrate/workspace/rdf-processing-toolkit-cli/target/apidocs/org/aksw/sparql_integrate/cli/CommandMain.html...
Generating /usr/share/tomcat8/.jenkins/jobs/sparql-integrate/workspace/rdf-processing-toolkit-cli/target/apidocs/org/aksw/sparql_integrate/cli/DerbyUtil.html...
Generating /usr/share/tomcat8/.jenkins/jobs/sparql-integrate/workspace/rdf-processing-toolkit-cli/target/apidocs/org/aksw/sparql_integrate/cli/MainCliSparqlIntegrateOld.html...
Generating /usr/share/tomcat8/.jenkins/jobs/sparql-integrate/workspace/rdf-processing-toolkit-cli/target/apidocs/org/aksw/sparql_integrate/cli/MainCliSparqlLoad.html...
Generating /usr/share/tomcat8/.jenkins/jobs/sparql-integrate/workspace/rdf-processing-toolkit-cli/target/apidocs/org/aksw/sparql_integrate/cli/SparqlStmtProcessor.html...
Generating /usr/share/tomcat8/.jenkins/jobs/sparql-integrate/workspace/rdf-processing-toolkit-cli/target/apidocs/org/aksw/sparql_integrate/cli/cmd/CmdSparqlIntegrateMain.html...
Generating /usr/share/tomcat8/.jenkins/jobs/sparql-integrate/workspace/rdf-processing-toolkit-cli/target/apidocs/org/aksw/sparql_integrate/cli/cmd/CmdSparqlIntegrateMain.OutputSpec.html...
Generating /usr/share/tomcat8/.jenkins/jobs/sparql-integrate/workspace/rdf-processing-toolkit-cli/target/apidocs/org/aksw/sparql_integrate/cli/main/MainCliSparqlIntegrate.html...
Generating /usr/share/tomcat8/.jenkins/jobs/sparql-integrate/workspace/rdf-processing-toolkit-cli/target/apidocs/org/aksw/sparql_integrate/cli/main/SparqlIntegrateCmdImpls.html...
Generating /usr/share/tomcat8/.jenkins/jobs/sparql-integrate/workspace/rdf-processing-toolkit-cli/target/apidocs/org/aksw/sparql_integrate/cli/main/SparqlIntegrateLegacyDataSources.html...
Generating /usr/share/tomcat8/.jenkins/jobs/sparql-integrate/workspace/rdf-processing-toolkit-cli/target/apidocs/package-summary.html...
Generating /usr/share/tomcat8/.jenkins/jobs/sparql-integrate/workspace/rdf-processing-toolkit-cli/target/apidocs/package-tree.html...
Generating /usr/share/tomcat8/.jenkins/jobs/sparql-integrate/workspace/rdf-processing-toolkit-cli/target/apidocs/org/aksw/jena_sparql_api/rx/op/api/package-summary.html...
Generating /usr/share/tomcat8/.jenkins/jobs/sparql-integrate/workspace/rdf-processing-toolkit-cli/target/apidocs/org/aksw/jena_sparql_api/rx/op/api/package-tree.html...
Generating /usr/share/tomcat8/.jenkins/jobs/sparql-integrate/workspace/rdf-processing-toolkit-cli/target/apidocs/org/aksw/named_graph_stream/cli/cmd/package-summary.html...
Generating /usr/share/tomcat8/.jenkins/jobs/sparql-integrate/workspace/rdf-processing-toolkit-cli/target/apidocs/org/aksw/named_graph_stream/cli/cmd/package-tree.html...
Generating /usr/share/tomcat8/.jenkins/jobs/sparql-integrate/workspace/rdf-processing-toolkit-cli/target/apidocs/org/aksw/named_graph_stream/cli/main/package-summary.html...
Generating /usr/share/tomcat8/.jenkins/jobs/sparql-integrate/workspace/rdf-processing-toolkit-cli/target/apidocs/org/aksw/named_graph_stream/cli/main/package-tree.html...
Generating /usr/share/tomcat8/.jenkins/jobs/sparql-integrate/workspace/rdf-processing-toolkit-cli/target/apidocs/org/aksw/rdf_processing_toolkit/cli/cmd/package-summary.html...
Generating /usr/share/tomcat8/.jenkins/jobs/sparql-integrate/workspace/rdf-processing-toolkit-cli/target/apidocs/org/aksw/rdf_processing_toolkit/cli/cmd/package-tree.html...
Generating /usr/share/tomcat8/.jenkins/jobs/sparql-integrate/workspace/rdf-processing-toolkit-cli/target/apidocs/org/aksw/rdf_processing_toolkit/cli/main/package-summary.html...
Generating /usr/share/tomcat8/.jenkins/jobs/sparql-integrate/workspace/rdf-processing-toolkit-cli/target/apidocs/org/aksw/rdf_processing_toolkit/cli/main/package-tree.html...
Generating /usr/share/tomcat8/.jenkins/jobs/sparql-integrate/workspace/rdf-processing-toolkit-cli/target/apidocs/org/aksw/sparql_binding_stream/cli/cmd/package-summary.html...
Generating /usr/share/tomcat8/.jenkins/jobs/sparql-integrate/workspace/rdf-processing-toolkit-cli/target/apidocs/org/aksw/sparql_binding_stream/cli/cmd/package-tree.html...
Generating /usr/share/tomcat8/.jenkins/jobs/sparql-integrate/workspace/rdf-processing-toolkit-cli/target/apidocs/org/aksw/sparql_binding_stream/cli/main/package-summary.html...
Generating /usr/share/tomcat8/.jenkins/jobs/sparql-integrate/workspace/rdf-processing-toolkit-cli/target/apidocs/org/aksw/sparql_binding_stream/cli/main/package-tree.html...
Generating /usr/share/tomcat8/.jenkins/jobs/sparql-integrate/workspace/rdf-processing-toolkit-cli/target/apidocs/org/aksw/sparql_integrate/cli/package-summary.html...
Generating /usr/share/tomcat8/.jenkins/jobs/sparql-integrate/workspace/rdf-processing-toolkit-cli/target/apidocs/org/aksw/sparql_integrate/cli/package-tree.html...
Generating /usr/share/tomcat8/.jenkins/jobs/sparql-integrate/workspace/rdf-processing-toolkit-cli/target/apidocs/org/aksw/sparql_integrate/cli/cmd/package-summary.html...
Generating /usr/share/tomcat8/.jenkins/jobs/sparql-integrate/workspace/rdf-processing-toolkit-cli/target/apidocs/org/aksw/sparql_integrate/cli/cmd/package-tree.html...
Generating /usr/share/tomcat8/.jenkins/jobs/sparql-integrate/workspace/rdf-processing-toolkit-cli/target/apidocs/org/aksw/sparql_integrate/cli/main/package-summary.html...
Generating /usr/share/tomcat8/.jenkins/jobs/sparql-integrate/workspace/rdf-processing-toolkit-cli/target/apidocs/org/aksw/sparql_integrate/cli/main/package-tree.html...
Generating /usr/share/tomcat8/.jenkins/jobs/sparql-integrate/workspace/rdf-processing-toolkit-cli/target/apidocs/constant-values.html...
Generating /usr/share/tomcat8/.jenkins/jobs/sparql-integrate/workspace/rdf-processing-toolkit-cli/target/apidocs/org/aksw/named_graph_stream/cli/main/class-use/NgsGitCmdImpls.html...
Generating /usr/share/tomcat8/.jenkins/jobs/sparql-integrate/workspace/rdf-processing-toolkit-cli/target/apidocs/org/aksw/named_graph_stream/cli/main/class-use/QueryEvaluatorForTuple.html...
Generating /usr/share/tomcat8/.jenkins/jobs/sparql-integrate/workspace/rdf-processing-toolkit-cli/target/apidocs/org/aksw/named_graph_stream/cli/main/class-use/NamedGraphStreamOps.html...
Generating /usr/share/tomcat8/.jenkins/jobs/sparql-integrate/workspace/rdf-processing-toolkit-cli/target/apidocs/org/aksw/named_graph_stream/cli/main/class-use/NamedGraphFluent.html...
Generating /usr/share/tomcat8/.jenkins/jobs/sparql-integrate/workspace/rdf-processing-toolkit-cli/target/apidocs/org/aksw/named_graph_stream/cli/main/class-use/MainPlaygroundScanTrig.html...
Generating /usr/share/tomcat8/.jenkins/jobs/sparql-integrate/workspace/rdf-processing-toolkit-cli/target/apidocs/org/aksw/named_graph_stream/cli/main/class-use/NgsCmdImpls.html...
Generating /usr/share/tomcat8/.jenkins/jobs/sparql-integrate/workspace/rdf-processing-toolkit-cli/target/apidocs/org/aksw/named_graph_stream/cli/main/class-use/DatasetFlowOps.html...
Generating /usr/share/tomcat8/.jenkins/jobs/sparql-integrate/workspace/rdf-processing-toolkit-cli/target/apidocs/org/aksw/named_graph_stream/cli/main/class-use/MainCliNamedGraphStream.html...
Generating /usr/share/tomcat8/.jenkins/jobs/sparql-integrate/workspace/rdf-processing-toolkit-cli/target/apidocs/org/aksw/named_graph_stream/cli/cmd/class-use/CmdNgsWhile.html...
Generating /usr/share/tomcat8/.jenkins/jobs/sparql-integrate/workspace/rdf-processing-toolkit-cli/target/apidocs/org/aksw/named_graph_stream/cli/cmd/class-use/CmdNgJoin.html...
Generating /usr/share/tomcat8/.jenkins/jobs/sparql-integrate/workspace/rdf-processing-toolkit-cli/target/apidocs/org/aksw/named_graph_stream/cli/cmd/class-use/CmdNgsMain.html...
Generating /usr/share/tomcat8/.jenkins/jobs/sparql-integrate/workspace/rdf-processing-toolkit-cli/target/apidocs/org/aksw/named_graph_stream/cli/cmd/class-use/CmdNgsMerge.html...
Generating /usr/share/tomcat8/.jenkins/jobs/sparql-integrate/workspace/rdf-processing-toolkit-cli/target/apidocs/org/aksw/named_graph_stream/cli/cmd/class-use/CmdNgsMap.html...
Generating /usr/share/tomcat8/.jenkins/jobs/sparql-integrate/workspace/rdf-processing-toolkit-cli/target/apidocs/org/aksw/named_graph_stream/cli/cmd/class-use/CmdNgsMap.MapSpec.html...
Generating /usr/share/tomcat8/.jenkins/jobs/sparql-integrate/workspace/rdf-processing-toolkit-cli/target/apidocs/org/aksw/named_graph_stream/cli/cmd/class-use/IParameterConsumerFlaggedLong.html...
Generating /usr/share/tomcat8/.jenkins/jobs/sparql-integrate/workspace/rdf-processing-toolkit-cli/target/apidocs/org/aksw/named_graph_stream/cli/cmd/class-use/CmdNgsSubjects.html...
Generating /usr/share/tomcat8/.jenkins/jobs/sparql-integrate/workspace/rdf-processing-toolkit-cli/target/apidocs/org/aksw/named_graph_stream/cli/cmd/class-use/CmdNgsUntil.html...
Generating /usr/share/tomcat8/.jenkins/jobs/sparql-integrate/workspace/rdf-processing-toolkit-cli/target/apidocs/org/aksw/named_graph_stream/cli/cmd/class-use/CmdNgsTail.html...
Generating /usr/share/tomcat8/.jenkins/jobs/sparql-integrate/workspace/rdf-processing-toolkit-cli/target/apidocs/org/aksw/named_graph_stream/cli/cmd/class-use/CmdNgsCat.html...
Generating /usr/share/tomcat8/.jenkins/jobs/sparql-integrate/workspace/rdf-processing-toolkit-cli/target/apidocs/org/aksw/named_graph_stream/cli/cmd/class-use/CmdNgsWc.html...
Generating /usr/share/tomcat8/.jenkins/jobs/sparql-integrate/workspace/rdf-processing-toolkit-cli/target/apidocs/org/aksw/named_graph_stream/cli/cmd/class-use/CmdNgsProbe.html...
Generating /usr/share/tomcat8/.jenkins/jobs/sparql-integrate/workspace/rdf-processing-toolkit-cli/target/apidocs/org/aksw/named_graph_stream/cli/cmd/class-use/CmdNgsGit.html...
Generating /usr/share/tomcat8/.jenkins/jobs/sparql-integrate/workspace/rdf-processing-toolkit-cli/target/apidocs/org/aksw/named_graph_stream/cli/cmd/class-use/CmdNgsHead.html...
Generating /usr/share/tomcat8/.jenkins/jobs/sparql-integrate/workspace/rdf-processing-toolkit-cli/target/apidocs/org/aksw/named_graph_stream/cli/cmd/class-use/CmdNgsFilter.html...
Generating /usr/share/tomcat8/.jenkins/jobs/sparql-integrate/workspace/rdf-processing-toolkit-cli/target/apidocs/org/aksw/named_graph_stream/cli/cmd/class-use/CmdNgsSort.html...
Generating /usr/share/tomcat8/.jenkins/jobs/sparql-integrate/workspace/rdf-processing-toolkit-cli/target/apidocs/org/aksw/sparql_integrate/cli/class-use/DerbyUtil.html...
Generating /usr/share/tomcat8/.jenkins/jobs/sparql-integrate/workspace/rdf-processing-toolkit-cli/target/apidocs/org/aksw/sparql_integrate/cli/class-use/MainCliSparqlIntegrateOld.html...
Generating /usr/share/tomcat8/.jenkins/jobs/sparql-integrate/workspace/rdf-processing-toolkit-cli/target/apidocs/org/aksw/sparql_integrate/cli/class-use/SparqlStmtProcessor.html...
Generating /usr/share/tomcat8/.jenkins/jobs/sparql-integrate/workspace/rdf-processing-toolkit-cli/target/apidocs/org/aksw/sparql_integrate/cli/class-use/MainCliSparqlLoad.html...
Generating /usr/share/tomcat8/.jenkins/jobs/sparql-integrate/workspace/rdf-processing-toolkit-cli/target/apidocs/org/aksw/sparql_integrate/cli/class-use/CommandMain.html...
Generating /usr/share/tomcat8/.jenkins/jobs/sparql-integrate/workspace/rdf-processing-toolkit-cli/target/apidocs/org/aksw/sparql_integrate/cli/main/class-use/SparqlIntegrateLegacyDataSources.html...
Generating /usr/share/tomcat8/.jenkins/jobs/sparql-integrate/workspace/rdf-processing-toolkit-cli/target/apidocs/org/aksw/sparql_integrate/cli/main/class-use/MainCliSparqlIntegrate.html...
Generating /usr/share/tomcat8/.jenkins/jobs/sparql-integrate/workspace/rdf-processing-toolkit-cli/target/apidocs/org/aksw/sparql_integrate/cli/main/class-use/SparqlIntegrateCmdImpls.html...
Generating /usr/share/tomcat8/.jenkins/jobs/sparql-integrate/workspace/rdf-processing-toolkit-cli/target/apidocs/org/aksw/sparql_integrate/cli/cmd/class-use/CmdSparqlIntegrateMain.html...
Generating /usr/share/tomcat8/.jenkins/jobs/sparql-integrate/workspace/rdf-processing-toolkit-cli/target/apidocs/org/aksw/sparql_integrate/cli/cmd/class-use/CmdSparqlIntegrateMain.OutputSpec.html...
Generating /usr/share/tomcat8/.jenkins/jobs/sparql-integrate/workspace/rdf-processing-toolkit-cli/target/apidocs/org/aksw/rdf_processing_toolkit/cli/main/class-use/MainCliRdfProcessingToolkit.html...
Generating /usr/share/tomcat8/.jenkins/jobs/sparql-integrate/workspace/rdf-processing-toolkit-cli/target/apidocs/org/aksw/rdf_processing_toolkit/cli/cmd/class-use/HasDebugMode.html...
Generating /usr/share/tomcat8/.jenkins/jobs/sparql-integrate/workspace/rdf-processing-toolkit-cli/target/apidocs/org/aksw/rdf_processing_toolkit/cli/cmd/class-use/CmdCommonBase.html...
Generating /usr/share/tomcat8/.jenkins/jobs/sparql-integrate/workspace/rdf-processing-toolkit-cli/target/apidocs/org/aksw/rdf_processing_toolkit/cli/cmd/class-use/VersionProviderRdfProcessingToolkit.html...
Generating /usr/share/tomcat8/.jenkins/jobs/sparql-integrate/workspace/rdf-processing-toolkit-cli/target/apidocs/org/aksw/rdf_processing_toolkit/cli/cmd/class-use/CliUtils.html...
Generating /usr/share/tomcat8/.jenkins/jobs/sparql-integrate/workspace/rdf-processing-toolkit-cli/target/apidocs/org/aksw/rdf_processing_toolkit/cli/cmd/class-use/CmdUtils.html...
Generating /usr/share/tomcat8/.jenkins/jobs/sparql-integrate/workspace/rdf-processing-toolkit-cli/target/apidocs/org/aksw/rdf_processing_toolkit/cli/cmd/class-use/CmdRptMain.html...
Generating /usr/share/tomcat8/.jenkins/jobs/sparql-integrate/workspace/rdf-processing-toolkit-cli/target/apidocs/org/aksw/rdf_processing_toolkit/cli/cmd/class-use/VersionProviderFromClasspathProperties.html...
Generating /usr/share/tomcat8/.jenkins/jobs/sparql-integrate/workspace/rdf-processing-toolkit-cli/target/apidocs/org/aksw/jena_sparql_api/rx/op/api/class-use/OpConfigSort.html...
Generating /usr/share/tomcat8/.jenkins/jobs/sparql-integrate/workspace/rdf-processing-toolkit-cli/target/apidocs/org/aksw/sparql_binding_stream/cli/main/class-use/SbsCmdImpls.html...
Generating /usr/share/tomcat8/.jenkins/jobs/sparql-integrate/workspace/rdf-processing-toolkit-cli/target/apidocs/org/aksw/sparql_binding_stream/cli/main/class-use/MainCliSparqlBindingStream.html...
Generating /usr/share/tomcat8/.jenkins/jobs/sparql-integrate/workspace/rdf-processing-toolkit-cli/target/apidocs/org/aksw/sparql_binding_stream/cli/cmd/class-use/CmdSbsMain.html...
Generating /usr/share/tomcat8/.jenkins/jobs/sparql-integrate/workspace/rdf-processing-toolkit-cli/target/apidocs/org/aksw/sparql_binding_stream/cli/cmd/class-use/CmdSbsMap.html...
Generating /usr/share/tomcat8/.jenkins/jobs/sparql-integrate/workspace/rdf-processing-toolkit-cli/target/apidocs/org/aksw/sparql_binding_stream/cli/cmd/class-use/CmdSbsSplit.html...
Generating /usr/share/tomcat8/.jenkins/jobs/sparql-integrate/workspace/rdf-processing-toolkit-cli/target/apidocs/org/aksw/sparql_binding_stream/cli/cmd/class-use/CmdSbsFilter.html...
Generating /usr/share/tomcat8/.jenkins/jobs/sparql-integrate/workspace/rdf-processing-toolkit-cli/target/apidocs/class-use/sbs.html...
Generating /usr/share/tomcat8/.jenkins/jobs/sparql-integrate/workspace/rdf-processing-toolkit-cli/target/apidocs/class-use/rpt.html...
Generating /usr/share/tomcat8/.jenkins/jobs/sparql-integrate/workspace/rdf-processing-toolkit-cli/target/apidocs/class-use/ngs.html...
Generating /usr/share/tomcat8/.jenkins/jobs/sparql-integrate/workspace/rdf-processing-toolkit-cli/target/apidocs/class-use/integrate.html...
Generating /usr/share/tomcat8/.jenkins/jobs/sparql-integrate/workspace/rdf-processing-toolkit-cli/target/apidocs/package-use.html...
Generating /usr/share/tomcat8/.jenkins/jobs/sparql-integrate/workspace/rdf-processing-toolkit-cli/target/apidocs/org/aksw/jena_sparql_api/rx/op/api/package-use.html...
Generating /usr/share/tomcat8/.jenkins/jobs/sparql-integrate/workspace/rdf-processing-toolkit-cli/target/apidocs/org/aksw/named_graph_stream/cli/cmd/package-use.html...
Generating /usr/share/tomcat8/.jenkins/jobs/sparql-integrate/workspace/rdf-processing-toolkit-cli/target/apidocs/org/aksw/named_graph_stream/cli/main/package-use.html...
Generating /usr/share/tomcat8/.jenkins/jobs/sparql-integrate/workspace/rdf-processing-toolkit-cli/target/apidocs/org/aksw/rdf_processing_toolkit/cli/cmd/package-use.html...
Generating /usr/share/tomcat8/.jenkins/jobs/sparql-integrate/workspace/rdf-processing-toolkit-cli/target/apidocs/org/aksw/rdf_processing_toolkit/cli/main/package-use.html...
Generating /usr/share/tomcat8/.jenkins/jobs/sparql-integrate/workspace/rdf-processing-toolkit-cli/target/apidocs/org/aksw/sparql_binding_stream/cli/cmd/package-use.html...
Generating /usr/share/tomcat8/.jenkins/jobs/sparql-integrate/workspace/rdf-processing-toolkit-cli/target/apidocs/org/aksw/sparql_binding_stream/cli/main/package-use.html...
Generating /usr/share/tomcat8/.jenkins/jobs/sparql-integrate/workspace/rdf-processing-toolkit-cli/target/apidocs/org/aksw/sparql_integrate/cli/package-use.html...
Generating /usr/share/tomcat8/.jenkins/jobs/sparql-integrate/workspace/rdf-processing-toolkit-cli/target/apidocs/org/aksw/sparql_integrate/cli/cmd/package-use.html...
Generating /usr/share/tomcat8/.jenkins/jobs/sparql-integrate/workspace/rdf-processing-toolkit-cli/target/apidocs/org/aksw/sparql_integrate/cli/main/package-use.html...
Building index for all the packages and classes...
Generating /usr/share/tomcat8/.jenkins/jobs/sparql-integrate/workspace/rdf-processing-toolkit-cli/target/apidocs/overview-tree.html...
Generating /usr/share/tomcat8/.jenkins/jobs/sparql-integrate/workspace/rdf-processing-toolkit-cli/target/apidocs/index-all.html...
Building index for all classes...
Generating /usr/share/tomcat8/.jenkins/jobs/sparql-integrate/workspace/rdf-processing-toolkit-cli/target/apidocs/allclasses-index.html...
Generating /usr/share/tomcat8/.jenkins/jobs/sparql-integrate/workspace/rdf-processing-toolkit-cli/target/apidocs/allpackages-index.html...
Generating /usr/share/tomcat8/.jenkins/jobs/sparql-integrate/workspace/rdf-processing-toolkit-cli/target/apidocs/deprecated-list.html...
Building index for all classes...
Generating /usr/share/tomcat8/.jenkins/jobs/sparql-integrate/workspace/rdf-processing-toolkit-cli/target/apidocs/allclasses.html...
Generating /usr/share/tomcat8/.jenkins/jobs/sparql-integrate/workspace/rdf-processing-toolkit-cli/target/apidocs/allclasses.html...
Generating /usr/share/tomcat8/.jenkins/jobs/sparql-integrate/workspace/rdf-processing-toolkit-cli/target/apidocs/index.html...
Generating /usr/share/tomcat8/.jenkins/jobs/sparql-integrate/workspace/rdf-processing-toolkit-cli/target/apidocs/overview-summary.html...
Generating /usr/share/tomcat8/.jenkins/jobs/sparql-integrate/workspace/rdf-processing-toolkit-cli/target/apidocs/help-doc.html...
100 warnings
[WARNING] Javadoc Warnings
[WARNING] javadoc: warning - The code being documented uses modules but the packages defined in http://docs.oracle.com/javase/7/docs/api/ are in the unnamed module.
[WARNING] javadoc: warning - The code being documented uses modules but the packages defined in http://docs.oracle.com/javase/7/docs/api/ are in the unnamed module.
[WARNING] javadoc: warning - The code being documented uses modules but the packages defined in http://docs.oracle.com/javase/7/docs/api/ are in the unnamed module.
[WARNING] javadoc: warning - The code being documented uses modules but the packages defined in http://docs.oracle.com/javase/7/docs/api/ are in the unnamed module.
[WARNING] javadoc: warning - The code being documented uses modules but the packages defined in http://docs.oracle.com/javase/7/docs/api/ are in the unnamed module.
[WARNING] javadoc: warning - The code being documented uses modules but the packages defined in http://docs.oracle.com/javase/7/docs/api/ are in the unnamed module.
[WARNING] javadoc: warning - The code being documented uses modules but the packages defined in http://docs.oracle.com/javase/7/docs/api/ are in the unnamed module.
[WARNING] javadoc: warning - The code being documented uses modules but the packages defined in http://docs.oracle.com/javase/7/docs/api/ are in the unnamed module.
[WARNING] javadoc: warning - The code being documented uses modules but the packages defined in http://docs.oracle.com/javase/7/docs/api/ are in the unnamed module.
[WARNING] javadoc: warning - The code being documented uses modules but the packages defined in http://docs.oracle.com/javase/7/docs/api/ are in the unnamed module.
[WARNING] javadoc: warning - The code being documented uses modules but the packages defined in http://docs.oracle.com/javase/7/docs/api/ are in the unnamed module.
[WARNING] javadoc: warning - The code being documented uses modules but the packages defined in http://docs.oracle.com/javase/7/docs/api/ are in the unnamed module.
[WARNING] javadoc: warning - The code being documented uses modules but the packages defined in http://docs.oracle.com/javase/7/docs/api/ are in the unnamed module.
[WARNING] javadoc: warning - The code being documented uses modules but the packages defined in http://docs.oracle.com/javase/7/docs/api/ are in the unnamed module.
[WARNING] javadoc: warning - The code being documented uses modules but the packages defined in http://docs.oracle.com/javase/7/docs/api/ are in the unnamed module.
[WARNING] javadoc: warning - The code being documented uses modules but the packages defined in http://docs.oracle.com/javase/7/docs/api/ are in the unnamed module.
[WARNING] javadoc: warning - The code being documented uses modules but the packages defined in http://docs.oracle.com/javase/7/docs/api/ are in the unnamed module.
[WARNING] javadoc: warning - The code being documented uses modules but the packages defined in http://docs.oracle.com/javase/7/docs/api/ are in the unnamed module.
[WARNING] javadoc: warning - The code being documented uses modules but the packages defined in http://docs.oracle.com/javase/7/docs/api/ are in the unnamed module.
[WARNING] javadoc: warning - The code being documented uses modules but the packages defined in http://docs.oracle.com/javase/7/docs/api/ are in the unnamed module.
[WARNING] javadoc: warning - The code being documented uses modules but the packages defined in http://docs.oracle.com/javase/7/docs/api/ are in the unnamed module.
[WARNING] javadoc: warning - The code being documented uses modules but the packages defined in http://docs.oracle.com/javase/7/docs/api/ are in the unnamed module.
[WARNING] javadoc: warning - The code being documented uses modules but the packages defined in http://docs.oracle.com/javase/7/docs/api/ are in the unnamed module.
[WARNING] javadoc: warning - The code being documented uses modules but the packages defined in http://docs.oracle.com/javase/7/docs/api/ are in the unnamed module.
[WARNING] javadoc: warning - The code being documented uses modules but the packages defined in http://docs.oracle.com/javase/7/docs/api/ are in the unnamed module.
[WARNING] javadoc: warning - The code being documented uses modules but the packages defined in http://docs.oracle.com/javase/7/docs/api/ are in the unnamed module.
[WARNING] javadoc: warning - The code being documented uses modules but the packages defined in http://docs.oracle.com/javase/7/docs/api/ are in the unnamed module.
[WARNING] javadoc: warning - The code being documented uses modules but the packages defined in http://docs.oracle.com/javase/7/docs/api/ are in the unnamed module.
[WARNING] javadoc: warning - The code being documented uses modules but the packages defined in http://docs.oracle.com/javase/7/docs/api/ are in the unnamed module.
[WARNING] javadoc: warning - The code being documented uses modules but the packages defined in http://docs.oracle.com/javase/7/docs/api/ are in the unnamed module.
[WARNING] javadoc: warning - The code being documented uses modules but the packages defined in http://docs.oracle.com/javase/7/docs/api/ are in the unnamed module.
[WARNING] javadoc: warning - The code being documented uses modules but the packages defined in http://docs.oracle.com/javase/7/docs/api/ are in the unnamed module.
[WARNING] javadoc: warning - The code being documented uses modules but the packages defined in http://docs.oracle.com/javase/7/docs/api/ are in the unnamed module.
[WARNING] javadoc: warning - The code being documented uses modules but the packages defined in http://docs.oracle.com/javase/7/docs/api/ are in the unnamed module.
[WARNING] javadoc: warning - The code being documented uses modules but the packages defined in http://docs.oracle.com/javase/7/docs/api/ are in the unnamed module.
[WARNING] javadoc: warning - The code being documented uses modules but the packages defined in http://docs.oracle.com/javase/7/docs/api/ are in the unnamed module.
[WARNING] javadoc: warning - The code being documented uses modules but the packages defined in http://docs.oracle.com/javase/7/docs/api/ are in the unnamed module.
[WARNING] javadoc: warning - The code being documented uses modules but the packages defined in http://docs.oracle.com/javase/7/docs/api/ are in the unnamed module.
[WARNING] javadoc: warning - The code being documented uses modules but the packages defined in http://docs.oracle.com/javase/7/docs/api/ are in the unnamed module.
[WARNING] javadoc: warning - The code being documented uses modules but the packages defined in http://docs.oracle.com/javase/7/docs/api/ are in the unnamed module.
[WARNING] javadoc: warning - The code being documented uses modules but the packages defined in http://docs.oracle.com/javase/7/docs/api/ are in the unnamed module.
[WARNING] javadoc: warning - The code being documented uses modules but the packages defined in http://docs.oracle.com/javase/7/docs/api/ are in the unnamed module.
[WARNING] javadoc: warning - The code being documented uses modules but the packages defined in http://docs.oracle.com/javase/7/docs/api/ are in the unnamed module.
[WARNING] javadoc: warning - The code being documented uses modules but the packages defined in http://docs.oracle.com/javase/7/docs/api/ are in the unnamed module.
[WARNING] javadoc: warning - The code being documented uses modules but the packages defined in http://docs.oracle.com/javase/7/docs/api/ are in the unnamed module.
[WARNING] javadoc: warning - The code being documented uses modules but the packages defined in http://docs.oracle.com/javase/7/docs/api/ are in the unnamed module.
[WARNING] javadoc: warning - The code being documented uses modules but the packages defined in http://docs.oracle.com/javase/7/docs/api/ are in the unnamed module.
[WARNING] javadoc: warning - The code being documented uses modules but the packages defined in http://docs.oracle.com/javase/7/docs/api/ are in the unnamed module.
[WARNING] javadoc: warning - The code being documented uses modules but the packages defined in http://docs.oracle.com/javase/7/docs/api/ are in the unnamed module.
[WARNING] javadoc: warning - The code being documented uses modules but the packages defined in http://docs.oracle.com/javase/7/docs/api/ are in the unnamed module.
[WARNING] javadoc: warning - The code being documented uses modules but the packages defined in http://docs.oracle.com/javase/7/docs/api/ are in the unnamed module.
[WARNING] javadoc: warning - The code being documented uses modules but the packages defined in http://docs.oracle.com/javase/7/docs/api/ are in the unnamed module.
[WARNING] javadoc: warning - The code being documented uses modules but the packages defined in http://docs.oracle.com/javase/7/docs/api/ are in the unnamed module.
[WARNING] javadoc: warning - The code being documented uses modules but the packages defined in http://docs.oracle.com/javase/7/docs/api/ are in the unnamed module.
[WARNING] javadoc: warning - The code being documented uses modules but the packages defined in http://docs.oracle.com/javase/7/docs/api/ are in the unnamed module.
[WARNING] javadoc: warning - The code being documented uses modules but the packages defined in http://docs.oracle.com/javase/7/docs/api/ are in the unnamed module.
[WARNING] javadoc: warning - The code being documented uses modules but the packages defined in http://docs.oracle.com/javase/7/docs/api/ are in the unnamed module.
[WARNING] javadoc: warning - The code being documented uses modules but the packages defined in http://docs.oracle.com/javase/7/docs/api/ are in the unnamed module.
[WARNING] javadoc: warning - The code being documented uses modules but the packages defined in http://docs.oracle.com/javase/7/docs/api/ are in the unnamed module.
[WARNING] javadoc: warning - The code being documented uses modules but the packages defined in http://docs.oracle.com/javase/7/docs/api/ are in the unnamed module.
[WARNING] javadoc: warning - The code being documented uses modules but the packages defined in http://docs.oracle.com/javase/7/docs/api/ are in the unnamed module.
[WARNING] javadoc: warning - The code being documented uses modules but the packages defined in http://docs.oracle.com/javase/7/docs/api/ are in the unnamed module.
[WARNING] javadoc: warning - The code being documented uses modules but the packages defined in http://docs.oracle.com/javase/7/docs/api/ are in the unnamed module.
[WARNING] javadoc: warning - The code being documented uses modules but the packages defined in http://docs.oracle.com/javase/7/docs/api/ are in the unnamed module.
[WARNING] javadoc: warning - The code being documented uses modules but the packages defined in http://docs.oracle.com/javase/7/docs/api/ are in the unnamed module.
[WARNING] javadoc: warning - The code being documented uses modules but the packages defined in http://docs.oracle.com/javase/7/docs/api/ are in the unnamed module.
[WARNING] javadoc: warning - The code being documented uses modules but the packages defined in http://docs.oracle.com/javase/7/docs/api/ are in the unnamed module.
[WARNING] javadoc: warning - The code being documented uses modules but the packages defined in http://docs.oracle.com/javase/7/docs/api/ are in the unnamed module.
[WARNING] javadoc: warning - The code being documented uses modules but the packages defined in http://docs.oracle.com/javase/7/docs/api/ are in the unnamed module.
[WARNING] javadoc: warning - The code being documented uses modules but the packages defined in http://docs.oracle.com/javase/7/docs/api/ are in the unnamed module.
[WARNING] javadoc: warning - The code being documented uses modules but the packages defined in http://docs.oracle.com/javase/7/docs/api/ are in the unnamed module.
[WARNING] javadoc: warning - The code being documented uses modules but the packages defined in http://docs.oracle.com/javase/7/docs/api/ are in the unnamed module.
[WARNING] javadoc: warning - The code being documented uses modules but the packages defined in http://docs.oracle.com/javase/7/docs/api/ are in the unnamed module.
[WARNING] javadoc: warning - The code being documented uses modules but the packages defined in http://docs.oracle.com/javase/7/docs/api/ are in the unnamed module.
[WARNING] javadoc: warning - The code being documented uses modules but the packages defined in http://docs.oracle.com/javase/7/docs/api/ are in the unnamed module.
[WARNING] javadoc: warning - The code being documented uses modules but the packages defined in http://docs.oracle.com/javase/7/docs/api/ are in the unnamed module.
[WARNING] javadoc: warning - The code being documented uses modules but the packages defined in http://docs.oracle.com/javase/7/docs/api/ are in the unnamed module.
[WARNING] javadoc: warning - The code being documented uses modules but the packages defined in http://docs.oracle.com/javase/7/docs/api/ are in the unnamed module.
[WARNING] javadoc: warning - The code being documented uses modules but the packages defined in http://docs.oracle.com/javase/7/docs/api/ are in the unnamed module.
[WARNING] javadoc: warning - The code being documented uses modules but the packages defined in http://docs.oracle.com/javase/7/docs/api/ are in the unnamed module.
[WARNING] javadoc: warning - The code being documented uses modules but the packages defined in http://docs.oracle.com/javase/7/docs/api/ are in the unnamed module.
[WARNING] javadoc: warning - The code being documented uses modules but the packages defined in http://docs.oracle.com/javase/7/docs/api/ are in the unnamed module.
[WARNING] javadoc: warning - The code being documented uses modules but the packages defined in http://docs.oracle.com/javase/7/docs/api/ are in the unnamed module.
[WARNING] javadoc: warning - The code being documented uses modules but the packages defined in http://docs.oracle.com/javase/7/docs/api/ are in the unnamed module.
[WARNING] javadoc: warning - The code being documented uses modules but the packages defined in http://docs.oracle.com/javase/7/docs/api/ are in the unnamed module.
[WARNING] javadoc: warning - The code being documented uses modules but the packages defined in http://docs.oracle.com/javase/7/docs/api/ are in the unnamed module.
[WARNING] javadoc: warning - The code being documented uses modules but the packages defined in http://docs.oracle.com/javase/7/docs/api/ are in the unnamed module.
[WARNING] javadoc: warning - The code being documented uses modules but the packages defined in http://docs.oracle.com/javase/7/docs/api/ are in the unnamed module.
[WARNING] javadoc: warning - The code being documented uses modules but the packages defined in http://docs.oracle.com/javase/7/docs/api/ are in the unnamed module.
[WARNING] javadoc: warning - The code being documented uses modules but the packages defined in http://docs.oracle.com/javase/7/docs/api/ are in the unnamed module.
[WARNING] javadoc: warning - The code being documented uses modules but the packages defined in http://docs.oracle.com/javase/7/docs/api/ are in the unnamed module.
[WARNING] javadoc: warning - The code being documented uses modules but the packages defined in http://docs.oracle.com/javase/7/docs/api/ are in the unnamed module.
[WARNING] javadoc: warning - The code being documented uses modules but the packages defined in http://docs.oracle.com/javase/7/docs/api/ are in the unnamed module.
[WARNING] javadoc: warning - The code being documented uses modules but the packages defined in http://docs.oracle.com/javase/7/docs/api/ are in the unnamed module.
[WARNING] javadoc: warning - The code being documented uses modules but the packages defined in http://docs.oracle.com/javase/7/docs/api/ are in the unnamed module.
[WARNING] javadoc: warning - The code being documented uses modules but the packages defined in http://docs.oracle.com/javase/7/docs/api/ are in the unnamed module.
[WARNING] javadoc: warning - The code being documented uses modules but the packages defined in http://docs.oracle.com/javase/7/docs/api/ are in the unnamed module.
[WARNING] javadoc: warning - The code being documented uses modules but the packages defined in http://docs.oracle.com/javase/7/docs/api/ are in the unnamed module.
[WARNING] javadoc: warning - The code being documented uses modules but the packages defined in http://docs.oracle.com/javase/7/docs/api/ are in the unnamed module.
[WARNING] javadoc: warning - The code being documented uses modules but the packages defined in http://docs.oracle.com/javase/7/docs/api/ are in the unnamed module.
[INFO] Building jar: /usr/share/tomcat8/.jenkins/jobs/sparql-integrate/workspace/rdf-processing-toolkit-cli/target/rdf-processing-toolkit-cli-1.9.1-SNAPSHOT-javadoc.jar
[INFO] 
[INFO] --- maven-source-plugin:3.0.1:jar-no-fork (attach-sources) @ rdf-processing-toolkit-cli ---
[INFO] Building jar: /usr/share/tomcat8/.jenkins/jobs/sparql-integrate/workspace/rdf-processing-toolkit-cli/target/rdf-processing-toolkit-cli-1.9.1-SNAPSHOT-sources.jar
[INFO] 
[INFO] --- maven-install-plugin:2.4:install (default-install) @ rdf-processing-toolkit-cli ---
[INFO] Installing /usr/share/tomcat8/.jenkins/jobs/sparql-integrate/workspace/rdf-processing-toolkit-cli/target/rdf-processing-toolkit-cli-1.9.1-SNAPSHOT.jar to /usr/share/tomcat8/.m2/repository/org/aksw/rdf-processing-toolkit/rdf-processing-toolkit-cli/1.9.1-SNAPSHOT/rdf-processing-toolkit-cli-1.9.1-SNAPSHOT.jar
[INFO] Installing /usr/share/tomcat8/.jenkins/jobs/sparql-integrate/workspace/rdf-processing-toolkit-cli/pom.xml to /usr/share/tomcat8/.m2/repository/org/aksw/rdf-processing-toolkit/rdf-processing-toolkit-cli/1.9.1-SNAPSHOT/rdf-processing-toolkit-cli-1.9.1-SNAPSHOT.pom
[INFO] Installing /usr/share/tomcat8/.jenkins/jobs/sparql-integrate/workspace/rdf-processing-toolkit-cli/target/rdf-processing-toolkit-cli-1.9.1-SNAPSHOT-javadoc.jar to /usr/share/tomcat8/.m2/repository/org/aksw/rdf-processing-toolkit/rdf-processing-toolkit-cli/1.9.1-SNAPSHOT/rdf-processing-toolkit-cli-1.9.1-SNAPSHOT-javadoc.jar
[INFO] Installing /usr/share/tomcat8/.jenkins/jobs/sparql-integrate/workspace/rdf-processing-toolkit-cli/target/rdf-processing-toolkit-cli-1.9.1-SNAPSHOT-sources.jar to /usr/share/tomcat8/.m2/repository/org/aksw/rdf-processing-toolkit/rdf-processing-toolkit-cli/1.9.1-SNAPSHOT/rdf-processing-toolkit-cli-1.9.1-SNAPSHOT-sources.jar