SuccessConsole Output

Skipping 66 KB.. Full Log
apache.org/content/repositories/snapshots/org/apache/jena/jena-db/4.6.0-SNAPSHOT/maven-metadata.xml (0 B at 0 B/s)
[INFO] Downloading from maven.aksw.snapshots: https://maven.aksw.org/repository/snapshots/org/apache/jena/jena-dboe-trans-data/4.6.0-SNAPSHOT/maven-metadata.xml
[INFO] Downloading from apache-repo-snapshots: https://repository.apache.org/content/repositories/snapshots/org/apache/jena/jena-dboe-trans-data/4.6.0-SNAPSHOT/maven-metadata.xml
[INFO] Downloading from maven.aksw.internal: https://maven.aksw.org/repository/internal/org/apache/jena/jena-dboe-trans-data/4.6.0-SNAPSHOT/maven-metadata.xml
[INFO] Downloading from apache.snapshots: https://repository.apache.org/snapshots/org/apache/jena/jena-dboe-trans-data/4.6.0-SNAPSHOT/maven-metadata.xml
[INFO] Downloaded from apache-repo-snapshots: https://repository.apache.org/content/repositories/snapshots/org/apache/jena/jena-dboe-trans-data/4.6.0-SNAPSHOT/maven-metadata.xml (1.0 kB at 11 kB/s)
[INFO] Downloaded from apache.snapshots: https://repository.apache.org/snapshots/org/apache/jena/jena-dboe-trans-data/4.6.0-SNAPSHOT/maven-metadata.xml (1.0 kB at 7.6 kB/s)
[INFO] Downloading from maven.aksw.internal: https://maven.aksw.org/repository/internal/org/apache/jena/jena-dboe-transaction/4.6.0-SNAPSHOT/maven-metadata.xml
[INFO] Downloading from maven.aksw.snapshots: https://maven.aksw.org/repository/snapshots/org/apache/jena/jena-dboe-transaction/4.6.0-SNAPSHOT/maven-metadata.xml
[INFO] Downloading from apache-repo-snapshots: https://repository.apache.org/content/repositories/snapshots/org/apache/jena/jena-dboe-transaction/4.6.0-SNAPSHOT/maven-metadata.xml
[INFO] Downloading from apache.snapshots: https://repository.apache.org/snapshots/org/apache/jena/jena-dboe-transaction/4.6.0-SNAPSHOT/maven-metadata.xml
[INFO] Downloaded from apache-repo-snapshots: https://repository.apache.org/content/repositories/snapshots/org/apache/jena/jena-dboe-transaction/4.6.0-SNAPSHOT/maven-metadata.xml (1.0 kB at 18 kB/s)
[INFO] Downloaded from apache.snapshots: https://repository.apache.org/snapshots/org/apache/jena/jena-dboe-transaction/4.6.0-SNAPSHOT/maven-metadata.xml (1.0 kB at 17 kB/s)
[INFO] Downloading from maven.aksw.internal: https://maven.aksw.org/repository/internal/org/apache/jena/jena-dboe-base/4.6.0-SNAPSHOT/maven-metadata.xml
[INFO] Downloading from apache-repo-snapshots: https://repository.apache.org/content/repositories/snapshots/org/apache/jena/jena-dboe-base/4.6.0-SNAPSHOT/maven-metadata.xml
[INFO] Downloading from maven.aksw.snapshots: https://maven.aksw.org/repository/snapshots/org/apache/jena/jena-dboe-base/4.6.0-SNAPSHOT/maven-metadata.xml
[INFO] Downloading from apache.snapshots: https://repository.apache.org/snapshots/org/apache/jena/jena-dboe-base/4.6.0-SNAPSHOT/maven-metadata.xml
[INFO] Downloaded from apache.snapshots: https://repository.apache.org/snapshots/org/apache/jena/jena-dboe-base/4.6.0-SNAPSHOT/maven-metadata.xml (995 B at 15 kB/s)
[INFO] Downloaded from apache-repo-snapshots: https://repository.apache.org/content/repositories/snapshots/org/apache/jena/jena-dboe-base/4.6.0-SNAPSHOT/maven-metadata.xml (995 B at 11 kB/s)
[INFO] Downloading from maven.aksw.internal: https://maven.aksw.org/repository/internal/org/apache/jena/jena-dboe-index/4.6.0-SNAPSHOT/maven-metadata.xml
[INFO] Downloading from maven.aksw.snapshots: https://maven.aksw.org/repository/snapshots/org/apache/jena/jena-dboe-index/4.6.0-SNAPSHOT/maven-metadata.xml
[INFO] Downloading from apache-repo-snapshots: https://repository.apache.org/content/repositories/snapshots/org/apache/jena/jena-dboe-index/4.6.0-SNAPSHOT/maven-metadata.xml
[INFO] Downloading from apache.snapshots: https://repository.apache.org/snapshots/org/apache/jena/jena-dboe-index/4.6.0-SNAPSHOT/maven-metadata.xml
[INFO] Downloaded from apache-repo-snapshots: https://repository.apache.org/content/repositories/snapshots/org/apache/jena/jena-dboe-index/4.6.0-SNAPSHOT/maven-metadata.xml (996 B at 14 kB/s)
[INFO] Downloaded from apache.snapshots: https://repository.apache.org/snapshots/org/apache/jena/jena-dboe-index/4.6.0-SNAPSHOT/maven-metadata.xml (996 B at 12 kB/s)
[INFO] Downloading from maven.aksw.internal: https://maven.aksw.org/repository/internal/org/aksw/jenax/jenax-arq-datasets-oneng/4.6.0-1-SNAPSHOT/maven-metadata.xml
[INFO] Downloading from maven.aksw.snapshots: https://maven.aksw.org/repository/snapshots/org/aksw/jenax/jenax-arq-datasets-oneng/4.6.0-1-SNAPSHOT/maven-metadata.xml
[INFO] Downloading from apache-repo-snapshots: https://repository.apache.org/content/repositories/snapshots/org/aksw/jenax/jenax-arq-datasets-oneng/4.6.0-1-SNAPSHOT/maven-metadata.xml
[INFO] Downloaded from maven.aksw.snapshots: https://maven.aksw.org/repository/snapshots/org/aksw/jenax/jenax-arq-datasets-oneng/4.6.0-1-SNAPSHOT/maven-metadata.xml (377 B at 54 kB/s)
[INFO] Downloading from maven.aksw.internal: https://maven.aksw.org/repository/internal/org/aksw/jenax/jenax-arq-datasets-oneng/4.6.0-1-SNAPSHOT/jenax-arq-datasets-oneng-4.6.0-1-20220525.233410-4.pom
[INFO] Downloading from maven.aksw.snapshots: https://maven.aksw.org/repository/snapshots/org/aksw/jenax/jenax-arq-datasets-oneng/4.6.0-1-SNAPSHOT/jenax-arq-datasets-oneng-4.6.0-1-20220525.233410-4.pom
[INFO] Downloaded from maven.aksw.snapshots: https://maven.aksw.org/repository/snapshots/org/aksw/jenax/jenax-arq-datasets-oneng/4.6.0-1-SNAPSHOT/jenax-arq-datasets-oneng-4.6.0-1-20220525.233410-4.pom (1.1 kB at 180 kB/s)
[INFO] Downloading from maven.aksw.internal: https://maven.aksw.org/repository/internal/org/aksw/jenax/jenax-arq-rdfnode-in-dataset/4.6.0-1-SNAPSHOT/maven-metadata.xml
[INFO] Downloading from apache-repo-snapshots: https://repository.apache.org/content/repositories/snapshots/org/aksw/jenax/jenax-arq-rdfnode-in-dataset/4.6.0-1-SNAPSHOT/maven-metadata.xml
[INFO] Downloading from maven.aksw.snapshots: https://maven.aksw.org/repository/snapshots/org/aksw/jenax/jenax-arq-rdfnode-in-dataset/4.6.0-1-SNAPSHOT/maven-metadata.xml
[INFO] Downloaded from maven.aksw.snapshots: https://maven.aksw.org/repository/snapshots/org/aksw/jenax/jenax-arq-rdfnode-in-dataset/4.6.0-1-SNAPSHOT/maven-metadata.xml (381 B at 54 kB/s)
[INFO] Downloading from maven.aksw.internal: https://maven.aksw.org/repository/internal/org/aksw/jenax/jenax-arq-rdfnode-in-dataset/4.6.0-1-SNAPSHOT/jenax-arq-rdfnode-in-dataset-4.6.0-1-20220525.233420-4.pom
[INFO] Downloading from maven.aksw.snapshots: https://maven.aksw.org/repository/snapshots/org/aksw/jenax/jenax-arq-rdfnode-in-dataset/4.6.0-1-SNAPSHOT/jenax-arq-rdfnode-in-dataset-4.6.0-1-20220525.233420-4.pom
[INFO] Downloaded from maven.aksw.snapshots: https://maven.aksw.org/repository/snapshots/org/aksw/jenax/jenax-arq-rdfnode-in-dataset/4.6.0-1-SNAPSHOT/jenax-arq-rdfnode-in-dataset-4.6.0-1-20220525.233420-4.pom (1.1 kB at 180 kB/s)
[INFO] Downloading from maven.aksw.internal: https://maven.aksw.org/repository/internal/org/aksw/jenax/jenax-arq-relations/4.6.0-1-SNAPSHOT/maven-metadata.xml
[INFO] Downloading from maven.aksw.snapshots: https://maven.aksw.org/repository/snapshots/org/aksw/jenax/jenax-arq-relations/4.6.0-1-SNAPSHOT/maven-metadata.xml
[INFO] Downloading from apache-repo-snapshots: https://repository.apache.org/content/repositories/snapshots/org/aksw/jenax/jenax-arq-relations/4.6.0-1-SNAPSHOT/maven-metadata.xml
[INFO] Downloaded from maven.aksw.snapshots: https://maven.aksw.org/repository/snapshots/org/aksw/jenax/jenax-arq-relations/4.6.0-1-SNAPSHOT/maven-metadata.xml (372 B at 62 kB/s)
[INFO] Downloading from maven.aksw.internal: https://maven.aksw.org/repository/internal/org/aksw/jenax/jenax-arq-relations/4.6.0-1-SNAPSHOT/jenax-arq-relations-4.6.0-1-20220525.233053-5.pom
[INFO] Downloading from maven.aksw.snapshots: https://maven.aksw.org/repository/snapshots/org/aksw/jenax/jenax-arq-relations/4.6.0-1-SNAPSHOT/jenax-arq-relations-4.6.0-1-20220525.233053-5.pom
[INFO] Downloaded from maven.aksw.snapshots: https://maven.aksw.org/repository/snapshots/org/aksw/jenax/jenax-arq-relations/4.6.0-1-SNAPSHOT/jenax-arq-relations-4.6.0-1-20220525.233053-5.pom (916 B at 131 kB/s)
[INFO] Downloading from maven.aksw.internal: https://maven.aksw.org/repository/internal/org/aksw/jenax/jenax-fsrdfstore-system/4.6.0-1-SNAPSHOT/maven-metadata.xml
[INFO] Downloading from maven.aksw.snapshots: https://maven.aksw.org/repository/snapshots/org/aksw/jenax/jenax-fsrdfstore-system/4.6.0-1-SNAPSHOT/maven-metadata.xml
[INFO] Downloading from apache-repo-snapshots: https://repository.apache.org/content/repositories/snapshots/org/aksw/jenax/jenax-fsrdfstore-system/4.6.0-1-SNAPSHOT/maven-metadata.xml
[INFO] Downloaded from maven.aksw.snapshots: https://maven.aksw.org/repository/snapshots/org/aksw/jenax/jenax-fsrdfstore-system/4.6.0-1-SNAPSHOT/maven-metadata.xml (376 B at 54 kB/s)
[INFO] Downloading from maven.aksw.internal: https://maven.aksw.org/repository/internal/org/aksw/jenax/jenax-fsrdfstore-system/4.6.0-1-SNAPSHOT/jenax-fsrdfstore-system-4.6.0-1-20220525.234232-4.pom
[INFO] Downloading from maven.aksw.snapshots: https://maven.aksw.org/repository/snapshots/org/aksw/jenax/jenax-fsrdfstore-system/4.6.0-1-SNAPSHOT/jenax-fsrdfstore-system-4.6.0-1-20220525.234232-4.pom
[INFO] Downloaded from maven.aksw.snapshots: https://maven.aksw.org/repository/snapshots/org/aksw/jenax/jenax-fsrdfstore-system/4.6.0-1-SNAPSHOT/jenax-fsrdfstore-system-4.6.0-1-20220525.234232-4.pom (2.8 kB at 471 kB/s)
[INFO] Downloading from maven.aksw.internal: https://maven.aksw.org/repository/internal/org/aksw/jenax/jenax-fsrdfstore-parent/4.6.0-1-SNAPSHOT/maven-metadata.xml
[INFO] Downloading from apache-repo-snapshots: https://repository.apache.org/content/repositories/snapshots/org/aksw/jenax/jenax-fsrdfstore-parent/4.6.0-1-SNAPSHOT/maven-metadata.xml
[INFO] Downloading from maven.aksw.snapshots: https://maven.aksw.org/repository/snapshots/org/aksw/jenax/jenax-fsrdfstore-parent/4.6.0-1-SNAPSHOT/maven-metadata.xml
[INFO] Downloaded from maven.aksw.snapshots: https://maven.aksw.org/repository/snapshots/org/aksw/jenax/jenax-fsrdfstore-parent/4.6.0-1-SNAPSHOT/maven-metadata.xml (376 B at 54 kB/s)
[INFO] Downloading from maven.aksw.snapshots: https://maven.aksw.org/repository/snapshots/org/aksw/jenax/jenax-fsrdfstore-parent/4.6.0-1-SNAPSHOT/jenax-fsrdfstore-parent-4.6.0-1-20220525.234128-4.pom
[INFO] Downloaded from maven.aksw.snapshots: https://maven.aksw.org/repository/snapshots/org/aksw/jenax/jenax-fsrdfstore-parent/4.6.0-1-SNAPSHOT/jenax-fsrdfstore-parent-4.6.0-1-20220525.234128-4.pom (659 B at 110 kB/s)
[INFO] Downloading from maven.aksw.snapshots: https://maven.aksw.org/repository/snapshots/org/aksw/jenax/jenax-server-standalone/4.5.0-1-SNAPSHOT/maven-metadata.xml
[INFO] Downloading from maven.aksw.internal: https://maven.aksw.org/repository/internal/org/aksw/jenax/jenax-server-standalone/4.5.0-1-SNAPSHOT/maven-metadata.xml
[INFO] Downloading from apache-repo-snapshots: https://repository.apache.org/content/repositories/snapshots/org/aksw/jenax/jenax-server-standalone/4.5.0-1-SNAPSHOT/maven-metadata.xml
[INFO] Downloaded from maven.aksw.snapshots: https://maven.aksw.org/repository/snapshots/org/aksw/jenax/jenax-server-standalone/4.5.0-1-SNAPSHOT/maven-metadata.xml (377 B at 63 kB/s)
[INFO] Downloading from maven.aksw.internal: https://maven.aksw.org/repository/internal/org/aksw/jenax/jenax-server-standalone/4.5.0-1-SNAPSHOT/jenax-server-standalone-4.5.0-1-20220526.000449-43.pom
[INFO] Downloading from maven.aksw.snapshots: https://maven.aksw.org/repository/snapshots/org/aksw/jenax/jenax-server-standalone/4.5.0-1-SNAPSHOT/jenax-server-standalone-4.5.0-1-20220526.000449-43.pom
[INFO] Downloaded from maven.aksw.snapshots: https://maven.aksw.org/repository/snapshots/org/aksw/jenax/jenax-server-standalone/4.5.0-1-SNAPSHOT/jenax-server-standalone-4.5.0-1-20220526.000449-43.pom (1.8 kB at 296 kB/s)
[INFO] Downloading from maven.aksw.snapshots: https://maven.aksw.org/repository/snapshots/org/aksw/jenax/jenax-server-parent/4.5.0-1-SNAPSHOT/maven-metadata.xml
[INFO] Downloading from maven.aksw.internal: https://maven.aksw.org/repository/internal/org/aksw/jenax/jenax-server-parent/4.5.0-1-SNAPSHOT/maven-metadata.xml
[INFO] Downloading from apache-repo-snapshots: https://repository.apache.org/content/repositories/snapshots/org/aksw/jenax/jenax-server-parent/4.5.0-1-SNAPSHOT/maven-metadata.xml
[INFO] Downloaded from maven.aksw.snapshots: https://maven.aksw.org/repository/snapshots/org/aksw/jenax/jenax-server-parent/4.5.0-1-SNAPSHOT/maven-metadata.xml (373 B at 62 kB/s)
[INFO] Downloading from maven.aksw.snapshots: https://maven.aksw.org/repository/snapshots/org/aksw/jenax/jenax-server-parent/4.5.0-1-SNAPSHOT/jenax-server-parent-4.5.0-1-20220526.000433-43.pom
[INFO] Downloaded from maven.aksw.snapshots: https://maven.aksw.org/repository/snapshots/org/aksw/jenax/jenax-server-parent/4.5.0-1-SNAPSHOT/jenax-server-parent-4.5.0-1-20220526.000433-43.pom (650 B at 130 kB/s)
[INFO] Downloading from maven.aksw.internal: https://maven.aksw.org/repository/internal/org/aksw/jenax/jenax-server-frontends/4.5.0-1-SNAPSHOT/maven-metadata.xml
[INFO] Downloading from maven.aksw.snapshots: https://maven.aksw.org/repository/snapshots/org/aksw/jenax/jenax-server-frontends/4.5.0-1-SNAPSHOT/maven-metadata.xml
[INFO] Downloading from apache-repo-snapshots: https://repository.apache.org/content/repositories/snapshots/org/aksw/jenax/jenax-server-frontends/4.5.0-1-SNAPSHOT/maven-metadata.xml
[INFO] Downloaded from maven.aksw.snapshots: https://maven.aksw.org/repository/snapshots/org/aksw/jenax/jenax-server-frontends/4.5.0-1-SNAPSHOT/maven-metadata.xml (0 B at 0 B/s)
[INFO] Downloading from maven.aksw.snapshots: https://maven.aksw.org/repository/snapshots/org/aksw/jenax/jenax-server-core/4.5.0-1-SNAPSHOT/maven-metadata.xml
[INFO] Downloading from maven.aksw.internal: https://maven.aksw.org/repository/internal/org/aksw/jenax/jenax-server-core/4.5.0-1-SNAPSHOT/maven-metadata.xml
[INFO] Downloading from apache-repo-snapshots: https://repository.apache.org/content/repositories/snapshots/org/aksw/jenax/jenax-server-core/4.5.0-1-SNAPSHOT/maven-metadata.xml
[INFO] Downloaded from maven.aksw.snapshots: https://maven.aksw.org/repository/snapshots/org/aksw/jenax/jenax-server-core/4.5.0-1-SNAPSHOT/maven-metadata.xml (0 B at 0 B/s)
[INFO] Downloading from maven.aksw.internal: https://maven.aksw.org/repository/internal/org/aksw/jenax/jenax-fsrdfstore-facade/4.6.0-1-SNAPSHOT/maven-metadata.xml
[INFO] Downloading from maven.aksw.snapshots: https://maven.aksw.org/repository/snapshots/org/aksw/jenax/jenax-fsrdfstore-facade/4.6.0-1-SNAPSHOT/maven-metadata.xml
[INFO] Downloading from apache-repo-snapshots: https://repository.apache.org/content/repositories/snapshots/org/aksw/jenax/jenax-fsrdfstore-facade/4.6.0-1-SNAPSHOT/maven-metadata.xml
[INFO] Downloaded from maven.aksw.snapshots: https://maven.aksw.org/repository/snapshots/org/aksw/jenax/jenax-fsrdfstore-facade/4.6.0-1-SNAPSHOT/maven-metadata.xml (376 B at 3.8 kB/s)
[INFO] Downloading from maven.aksw.internal: https://maven.aksw.org/repository/internal/org/aksw/jenax/jenax-fsrdfstore-facade/4.6.0-1-SNAPSHOT/jenax-fsrdfstore-facade-4.6.0-1-20220525.234147-4.pom
[INFO] Downloading from maven.aksw.snapshots: https://maven.aksw.org/repository/snapshots/org/aksw/jenax/jenax-fsrdfstore-facade/4.6.0-1-SNAPSHOT/jenax-fsrdfstore-facade-4.6.0-1-20220525.234147-4.pom
[INFO] Downloaded from maven.aksw.snapshots: https://maven.aksw.org/repository/snapshots/org/aksw/jenax/jenax-fsrdfstore-facade/4.6.0-1-SNAPSHOT/jenax-fsrdfstore-facade-4.6.0-1-20220525.234147-4.pom (1.5 kB at 217 kB/s)
[INFO] Downloading from maven.aksw.internal: https://maven.aksw.org/repository/internal/org/aksw/jenax/jenax-fsrdfstore-core/4.6.0-1-SNAPSHOT/maven-metadata.xml
[INFO] Downloading from maven.aksw.snapshots: https://maven.aksw.org/repository/snapshots/org/aksw/jenax/jenax-fsrdfstore-core/4.6.0-1-SNAPSHOT/maven-metadata.xml
[INFO] Downloading from apache-repo-snapshots: https://repository.apache.org/content/repositories/snapshots/org/aksw/jenax/jenax-fsrdfstore-core/4.6.0-1-SNAPSHOT/maven-metadata.xml
[INFO] Downloaded from maven.aksw.snapshots: https://maven.aksw.org/repository/snapshots/org/aksw/jenax/jenax-fsrdfstore-core/4.6.0-1-SNAPSHOT/maven-metadata.xml (374 B at 7.8 kB/s)
[INFO] Downloading from maven.aksw.internal: https://maven.aksw.org/repository/internal/org/aksw/jenax/jenax-fsrdfstore-core/4.6.0-1-SNAPSHOT/jenax-fsrdfstore-core-4.6.0-1-20220525.234134-4.pom
[INFO] Downloading from maven.aksw.snapshots: https://maven.aksw.org/repository/snapshots/org/aksw/jenax/jenax-fsrdfstore-core/4.6.0-1-SNAPSHOT/jenax-fsrdfstore-core-4.6.0-1-20220525.234134-4.pom
[INFO] Downloaded from maven.aksw.snapshots: https://maven.aksw.org/repository/snapshots/org/aksw/jenax/jenax-fsrdfstore-core/4.6.0-1-SNAPSHOT/jenax-fsrdfstore-core-4.6.0-1-20220525.234134-4.pom (2.6 kB at 426 kB/s)
[INFO] Downloading from maven.aksw.internal: https://maven.aksw.org/repository/internal/org/aksw/jenax/jenax-jgrapht-bindings/4.6.0-1-SNAPSHOT/maven-metadata.xml
[INFO] Downloading from maven.aksw.snapshots: https://maven.aksw.org/repository/snapshots/org/aksw/jenax/jenax-jgrapht-bindings/4.6.0-1-SNAPSHOT/maven-metadata.xml
[INFO] Downloading from apache-repo-snapshots: https://repository.apache.org/content/repositories/snapshots/org/aksw/jenax/jenax-jgrapht-bindings/4.6.0-1-SNAPSHOT/maven-metadata.xml
[INFO] Downloaded from maven.aksw.snapshots: https://maven.aksw.org/repository/snapshots/org/aksw/jenax/jenax-jgrapht-bindings/4.6.0-1-SNAPSHOT/maven-metadata.xml (375 B at 62 kB/s)
[INFO] Downloading from maven.aksw.internal: https://maven.aksw.org/repository/internal/org/aksw/jenax/jenax-jgrapht-parent/4.6.0-1-SNAPSHOT/maven-metadata.xml
[INFO] Downloading from maven.aksw.snapshots: https://maven.aksw.org/repository/snapshots/org/aksw/jenax/jenax-jgrapht-parent/4.6.0-1-SNAPSHOT/maven-metadata.xml
[INFO] Downloading from apache-repo-snapshots: https://repository.apache.org/content/repositories/snapshots/org/aksw/jenax/jenax-jgrapht-parent/4.6.0-1-SNAPSHOT/maven-metadata.xml
[INFO] Downloaded from maven.aksw.snapshots: https://maven.aksw.org/repository/snapshots/org/aksw/jenax/jenax-jgrapht-parent/4.6.0-1-SNAPSHOT/maven-metadata.xml (373 B at 62 kB/s)
[INFO] Downloading from maven.aksw.internal: https://maven.aksw.org/repository/internal/org/aksw/jenax/jenax-arq-datasets-diff/4.6.0-1-SNAPSHOT/maven-metadata.xml
[INFO] Downloading from maven.aksw.snapshots: https://maven.aksw.org/repository/snapshots/org/aksw/jenax/jenax-arq-datasets-diff/4.6.0-1-SNAPSHOT/maven-metadata.xml
[INFO] Downloading from apache-repo-snapshots: https://repository.apache.org/content/repositories/snapshots/org/aksw/jenax/jenax-arq-datasets-diff/4.6.0-1-SNAPSHOT/maven-metadata.xml
[INFO] Downloaded from maven.aksw.snapshots: https://maven.aksw.org/repository/snapshots/org/aksw/jenax/jenax-arq-datasets-diff/4.6.0-1-SNAPSHOT/maven-metadata.xml (376 B at 47 kB/s)
[INFO] Downloading from maven.aksw.internal: https://maven.aksw.org/repository/internal/org/aksw/jenax/jenax-arq-datasets-diff/4.6.0-1-SNAPSHOT/jenax-arq-datasets-diff-4.6.0-1-20220525.233904-4.pom
[INFO] Downloading from maven.aksw.snapshots: https://maven.aksw.org/repository/snapshots/org/aksw/jenax/jenax-arq-datasets-diff/4.6.0-1-SNAPSHOT/jenax-arq-datasets-diff-4.6.0-1-20220525.233904-4.pom
[INFO] Downloaded from maven.aksw.snapshots: https://maven.aksw.org/repository/snapshots/org/aksw/jenax/jenax-arq-datasets-diff/4.6.0-1-SNAPSHOT/jenax-arq-datasets-diff-4.6.0-1-20220525.233904-4.pom (1.1 kB at 180 kB/s)
[INFO] Downloading from maven.aksw.internal: https://maven.aksw.org/repository/internal/org/aksw/jenax/jenax-rx-dataaccess/4.5.0-1-SNAPSHOT/maven-metadata.xml
[INFO] Downloading from maven.aksw.snapshots: https://maven.aksw.org/repository/snapshots/org/aksw/jenax/jenax-rx-dataaccess/4.5.0-1-SNAPSHOT/maven-metadata.xml
[INFO] Downloading from apache-repo-snapshots: https://repository.apache.org/content/repositories/snapshots/org/aksw/jenax/jenax-rx-dataaccess/4.5.0-1-SNAPSHOT/maven-metadata.xml
[INFO] Downloaded from maven.aksw.snapshots: https://maven.aksw.org/repository/snapshots/org/aksw/jenax/jenax-rx-dataaccess/4.5.0-1-SNAPSHOT/maven-metadata.xml (373 B at 53 kB/s)
[INFO] Downloading from maven.aksw.internal: https://maven.aksw.org/repository/internal/org/aksw/jenax/jenax-rx-dataaccess/4.5.0-1-SNAPSHOT/jenax-rx-dataaccess-4.5.0-1-20220526.000058-42.pom
[INFO] Downloading from maven.aksw.snapshots: https://maven.aksw.org/repository/snapshots/org/aksw/jenax/jenax-rx-dataaccess/4.5.0-1-SNAPSHOT/jenax-rx-dataaccess-4.5.0-1-20220526.000058-42.pom
[INFO] Downloaded from maven.aksw.snapshots: https://maven.aksw.org/repository/snapshots/org/aksw/jenax/jenax-rx-dataaccess/4.5.0-1-SNAPSHOT/jenax-rx-dataaccess-4.5.0-1-20220526.000058-42.pom (4.8 kB at 690 kB/s)
[INFO] Downloading from maven.aksw.internal: https://maven.aksw.org/repository/internal/org/aksw/jenax/jenax-rx-parent/4.5.0-1-SNAPSHOT/maven-metadata.xml
[INFO] Downloading from maven.aksw.snapshots: https://maven.aksw.org/repository/snapshots/org/aksw/jenax/jenax-rx-parent/4.5.0-1-SNAPSHOT/maven-metadata.xml
[INFO] Downloading from apache-repo-snapshots: https://repository.apache.org/content/repositories/snapshots/org/aksw/jenax/jenax-rx-parent/4.5.0-1-SNAPSHOT/maven-metadata.xml
[INFO] Downloaded from maven.aksw.snapshots: https://maven.aksw.org/repository/snapshots/org/aksw/jenax/jenax-rx-parent/4.5.0-1-SNAPSHOT/maven-metadata.xml (369 B at 2.1 kB/s)
[INFO] Downloading from maven.aksw.snapshots: https://maven.aksw.org/repository/snapshots/org/aksw/jenax/jenax-rx-parent/4.5.0-1-SNAPSHOT/jenax-rx-parent-4.5.0-1-20220526.000035-42.pom
[INFO] Downloaded from maven.aksw.snapshots: https://maven.aksw.org/repository/snapshots/org/aksw/jenax/jenax-rx-parent/4.5.0-1-SNAPSHOT/jenax-rx-parent-4.5.0-1-20220526.000035-42.pom (603 B at 100 kB/s)
[INFO] Downloading from maven.aksw.internal: https://maven.aksw.org/repository/internal/org/aksw/jenax/jenax-analytics-core/4.5.0-1-SNAPSHOT/maven-metadata.xml
[INFO] Downloading from maven.aksw.snapshots: https://maven.aksw.org/repository/snapshots/org/aksw/jenax/jenax-analytics-core/4.5.0-1-SNAPSHOT/maven-metadata.xml
[INFO] Downloading from apache-repo-snapshots: https://repository.apache.org/content/repositories/snapshots/org/aksw/jenax/jenax-analytics-core/4.5.0-1-SNAPSHOT/maven-metadata.xml
[INFO] Downloaded from maven.aksw.snapshots: https://maven.aksw.org/repository/snapshots/org/aksw/jenax/jenax-analytics-core/4.5.0-1-SNAPSHOT/maven-metadata.xml (374 B at 31 kB/s)
[INFO] Downloading from maven.aksw.internal: https://maven.aksw.org/repository/internal/org/aksw/jenax/jenax-analytics-core/4.5.0-1-SNAPSHOT/jenax-analytics-core-4.5.0-1-20220526.000024-43.pom
[INFO] Downloading from maven.aksw.snapshots: https://maven.aksw.org/repository/snapshots/org/aksw/jenax/jenax-analytics-core/4.5.0-1-SNAPSHOT/jenax-analytics-core-4.5.0-1-20220526.000024-43.pom
[INFO] Downloaded from maven.aksw.snapshots: https://maven.aksw.org/repository/snapshots/org/aksw/jenax/jenax-analytics-core/4.5.0-1-SNAPSHOT/jenax-analytics-core-4.5.0-1-20220526.000024-43.pom (1.7 kB at 244 kB/s)
[INFO] Downloading from maven.aksw.snapshots: https://maven.aksw.org/repository/snapshots/org/aksw/jenax/jenax-analytics-parent/4.5.0-1-SNAPSHOT/maven-metadata.xml
[INFO] Downloading from maven.aksw.internal: https://maven.aksw.org/repository/internal/org/aksw/jenax/jenax-analytics-parent/4.5.0-1-SNAPSHOT/maven-metadata.xml
[INFO] Downloading from apache-repo-snapshots: https://repository.apache.org/content/repositories/snapshots/org/aksw/jenax/jenax-analytics-parent/4.5.0-1-SNAPSHOT/maven-metadata.xml
[INFO] Downloaded from maven.aksw.snapshots: https://maven.aksw.org/repository/snapshots/org/aksw/jenax/jenax-analytics-parent/4.5.0-1-SNAPSHOT/maven-metadata.xml (0 B at 0 B/s)
[INFO] Downloading from maven.aksw.internal: https://maven.aksw.org/repository/internal/org/aksw/jenax/jenax-arq-entityquery/4.5.0-1-SNAPSHOT/maven-metadata.xml
[INFO] Downloading from maven.aksw.snapshots: https://maven.aksw.org/repository/snapshots/org/aksw/jenax/jenax-arq-entityquery/4.5.0-1-SNAPSHOT/maven-metadata.xml
[INFO] Downloading from apache-repo-snapshots: https://repository.apache.org/content/repositories/snapshots/org/aksw/jenax/jenax-arq-entityquery/4.5.0-1-SNAPSHOT/maven-metadata.xml
[INFO] Downloaded from maven.aksw.snapshots: https://maven.aksw.org/repository/snapshots/org/aksw/jenax/jenax-arq-entityquery/4.5.0-1-SNAPSHOT/maven-metadata.xml (375 B at 47 kB/s)
[INFO] Downloading from maven.aksw.snapshots: https://maven.aksw.org/repository/snapshots/org/aksw/jenax/jenax-arq-quadengine/4.6.0-1-SNAPSHOT/maven-metadata.xml
[INFO] Downloading from maven.aksw.internal: https://maven.aksw.org/repository/internal/org/aksw/jenax/jenax-arq-quadengine/4.6.0-1-SNAPSHOT/maven-metadata.xml
[INFO] Downloading from apache-repo-snapshots: https://repository.apache.org/content/repositories/snapshots/org/aksw/jenax/jenax-arq-quadengine/4.6.0-1-SNAPSHOT/maven-metadata.xml
[INFO] Downloaded from maven.aksw.snapshots: https://maven.aksw.org/repository/snapshots/org/aksw/jenax/jenax-arq-quadengine/4.6.0-1-SNAPSHOT/maven-metadata.xml (373 B at 53 kB/s)
[INFO] Downloading from maven.aksw.internal: https://maven.aksw.org/repository/internal/net/sansa-stack/sansa-spark-jena-java_2.12/0.8.0-RC3-SNAPSHOT/maven-metadata.xml
[INFO] Downloading from apache-repo-snapshots: https://repository.apache.org/content/repositories/snapshots/net/sansa-stack/sansa-spark-jena-java_2.12/0.8.0-RC3-SNAPSHOT/maven-metadata.xml
[INFO] Downloading from maven.aksw.snapshots: https://maven.aksw.org/repository/snapshots/net/sansa-stack/sansa-spark-jena-java_2.12/0.8.0-RC3-SNAPSHOT/maven-metadata.xml
[INFO] Downloaded from maven.aksw.snapshots: https://maven.aksw.org/repository/snapshots/net/sansa-stack/sansa-spark-jena-java_2.12/0.8.0-RC3-SNAPSHOT/maven-metadata.xml (0 B at 0 B/s)
[INFO] Downloading from maven.aksw.internal: https://maven.aksw.org/repository/internal/net/sansa-stack/sansa-parent_2.12/0.8.0-RC3-SNAPSHOT/maven-metadata.xml
[INFO] Downloading from apache-repo-snapshots: https://repository.apache.org/content/repositories/snapshots/net/sansa-stack/sansa-parent_2.12/0.8.0-RC3-SNAPSHOT/maven-metadata.xml
[INFO] Downloading from maven.aksw.snapshots: https://maven.aksw.org/repository/snapshots/net/sansa-stack/sansa-parent_2.12/0.8.0-RC3-SNAPSHOT/maven-metadata.xml
[INFO] Downloaded from maven.aksw.snapshots: https://maven.aksw.org/repository/snapshots/net/sansa-stack/sansa-parent_2.12/0.8.0-RC3-SNAPSHOT/maven-metadata.xml (373 B at 31 kB/s)
[INFO] Downloading from maven.aksw.internal: https://maven.aksw.org/repository/internal/net/sansa-stack/sansa-hadoop-jena/0.8.0-RC3-SNAPSHOT/maven-metadata.xml
[INFO] Downloading from maven.aksw.snapshots: https://maven.aksw.org/repository/snapshots/net/sansa-stack/sansa-hadoop-jena/0.8.0-RC3-SNAPSHOT/maven-metadata.xml
[INFO] Downloading from apache-repo-snapshots: https://repository.apache.org/content/repositories/snapshots/net/sansa-stack/sansa-hadoop-jena/0.8.0-RC3-SNAPSHOT/maven-metadata.xml
[INFO] Downloading from apache-snapshot: https://repository.apache.org/content/repositories/snapshots/net/sansa-stack/sansa-hadoop-jena/0.8.0-RC3-SNAPSHOT/maven-metadata.xml
[INFO] Downloaded from maven.aksw.snapshots: https://maven.aksw.org/repository/snapshots/net/sansa-stack/sansa-hadoop-jena/0.8.0-RC3-SNAPSHOT/maven-metadata.xml (373 B at 47 kB/s)
[INFO] Downloading from maven.aksw.internal: https://maven.aksw.org/repository/internal/net/minidev/json-smart/maven-metadata.xml
[INFO] Downloading from maven.aksw.snapshots: https://maven.aksw.org/repository/snapshots/net/minidev/json-smart/maven-metadata.xml
[INFO] Downloading from apache-repo-snapshots: https://repository.apache.org/content/repositories/snapshots/net/minidev/json-smart/maven-metadata.xml
[INFO] Downloading from central: https://repo.maven.apache.org/maven2/net/minidev/json-smart/maven-metadata.xml
[INFO] Downloading from oss-sonatype-releases: https://oss.sonatype.org/content/repositories/releases/net/minidev/json-smart/maven-metadata.xml
[INFO] Downloading from apache-snapshot: https://repository.apache.org/content/repositories/snapshots/net/minidev/json-smart/maven-metadata.xml
[INFO] Downloading from apache.snapshots.https: https://repository.apache.org/content/repositories/snapshots/net/minidev/json-smart/maven-metadata.xml
[INFO] Downloading from repository.jboss.org: http://repository.jboss.org/nexus/content/groups/public/net/minidev/json-smart/maven-metadata.xml
[INFO] Downloaded from maven.aksw.internal: https://maven.aksw.org/repository/internal/net/minidev/json-smart/maven-metadata.xml (0 B at 0 B/s)
[INFO] Downloaded from central: https://repo.maven.apache.org/maven2/net/minidev/json-smart/maven-metadata.xml (0 B at 0 B/s)
[INFO] Downloaded from oss-sonatype-releases: https://oss.sonatype.org/content/repositories/releases/net/minidev/json-smart/maven-metadata.xml (1.2 kB at 1.4 kB/s)
[INFO] Downloading from maven.aksw.internal: https://maven.aksw.org/repository/internal/org/aksw/commons/aksw-commons-collectors/0.9.3-SNAPSHOT/maven-metadata.xml
[INFO] Downloading from maven.aksw.snapshots: https://maven.aksw.org/repository/snapshots/org/aksw/commons/aksw-commons-collectors/0.9.3-SNAPSHOT/maven-metadata.xml
[INFO] Downloading from apache-snapshot: https://repository.apache.org/content/repositories/snapshots/org/aksw/commons/aksw-commons-collectors/0.9.3-SNAPSHOT/maven-metadata.xml
[INFO] Downloading from apache-repo-snapshots: https://repository.apache.org/content/repositories/snapshots/org/aksw/commons/aksw-commons-collectors/0.9.3-SNAPSHOT/maven-metadata.xml
[INFO] Downloaded from maven.aksw.snapshots: https://maven.aksw.org/repository/snapshots/org/aksw/commons/aksw-commons-collectors/0.9.3-SNAPSHOT/maven-metadata.xml (377 B at 42 kB/s)
[INFO] Downloading from maven.aksw.internal: https://maven.aksw.org/repository/internal/org/aksw/commons/aksw-commons-parent/0.9.3-SNAPSHOT/maven-metadata.xml
[INFO] Downloading from maven.aksw.snapshots: https://maven.aksw.org/repository/snapshots/org/aksw/commons/aksw-commons-parent/0.9.3-SNAPSHOT/maven-metadata.xml
[INFO] Downloading from apache-repo-snapshots: https://repository.apache.org/content/repositories/snapshots/org/aksw/commons/aksw-commons-parent/0.9.3-SNAPSHOT/maven-metadata.xml
[INFO] Downloading from apache-snapshot: https://repository.apache.org/content/repositories/snapshots/org/aksw/commons/aksw-commons-parent/0.9.3-SNAPSHOT/maven-metadata.xml
[INFO] Downloaded from maven.aksw.snapshots: https://maven.aksw.org/repository/snapshots/org/aksw/commons/aksw-commons-parent/0.9.3-SNAPSHOT/maven-metadata.xml (373 B at 53 kB/s)
[INFO] Downloading from maven.aksw.internal: https://maven.aksw.org/repository/internal/org/aksw/commons/aksw-commons-lambdas-serializable/0.9.3-SNAPSHOT/maven-metadata.xml
[INFO] Downloading from apache-repo-snapshots: https://repository.apache.org/content/repositories/snapshots/org/aksw/commons/aksw-commons-lambdas-serializable/0.9.3-SNAPSHOT/maven-metadata.xml
[INFO] Downloading from maven.aksw.snapshots: https://maven.aksw.org/repository/snapshots/org/aksw/commons/aksw-commons-lambdas-serializable/0.9.3-SNAPSHOT/maven-metadata.xml
[INFO] Downloading from apache-snapshot: https://repository.apache.org/content/repositories/snapshots/org/aksw/commons/aksw-commons-lambdas-serializable/0.9.3-SNAPSHOT/maven-metadata.xml
[INFO] Downloaded from maven.aksw.snapshots: https://maven.aksw.org/repository/snapshots/org/aksw/commons/aksw-commons-lambdas-serializable/0.9.3-SNAPSHOT/maven-metadata.xml (387 B at 55 kB/s)
[INFO] Downloading from maven.aksw.internal: https://maven.aksw.org/repository/internal/org/aksw/commons/aksw-commons-lambdas-parent/0.9.3-SNAPSHOT/maven-metadata.xml
[INFO] Downloading from maven.aksw.snapshots: https://maven.aksw.org/repository/snapshots/org/aksw/commons/aksw-commons-lambdas-parent/0.9.3-SNAPSHOT/maven-metadata.xml
[INFO] Downloading from apache-repo-snapshots: https://repository.apache.org/content/repositories/snapshots/org/aksw/commons/aksw-commons-lambdas-parent/0.9.3-SNAPSHOT/maven-metadata.xml
[INFO] Downloading from apache-snapshot: https://repository.apache.org/content/repositories/snapshots/org/aksw/commons/aksw-commons-lambdas-parent/0.9.3-SNAPSHOT/maven-metadata.xml
[INFO] Downloaded from maven.aksw.snapshots: https://maven.aksw.org/repository/snapshots/org/aksw/commons/aksw-commons-lambdas-parent/0.9.3-SNAPSHOT/maven-metadata.xml (381 B at 54 kB/s)
[INFO] Downloading from maven.aksw.internal: https://maven.aksw.org/repository/internal/org/aksw/jenax/jenax-rx-ops-syscall/4.5.0-1-SNAPSHOT/maven-metadata.xml
[INFO] Downloading from apache-repo-snapshots: https://repository.apache.org/content/repositories/snapshots/org/aksw/jenax/jenax-rx-ops-syscall/4.5.0-1-SNAPSHOT/maven-metadata.xml
[INFO] Downloading from maven.aksw.snapshots: https://maven.aksw.org/repository/snapshots/org/aksw/jenax/jenax-rx-ops-syscall/4.5.0-1-SNAPSHOT/maven-metadata.xml
[INFO] Downloaded from maven.aksw.snapshots: https://maven.aksw.org/repository/snapshots/org/aksw/jenax/jenax-rx-ops-syscall/4.5.0-1-SNAPSHOT/maven-metadata.xml (374 B at 12 kB/s)
[INFO] Downloading from maven.aksw.internal: https://maven.aksw.org/repository/internal/org/aksw/jenax/jenax-rx-ops-syscall/4.5.0-1-SNAPSHOT/jenax-rx-ops-syscall-4.5.0-1-20220526.000355-42.pom
[INFO] Downloading from maven.aksw.snapshots: https://maven.aksw.org/repository/snapshots/org/aksw/jenax/jenax-rx-ops-syscall/4.5.0-1-SNAPSHOT/jenax-rx-ops-syscall-4.5.0-1-20220526.000355-42.pom
[INFO] Downloaded from maven.aksw.snapshots: https://maven.aksw.org/repository/snapshots/org/aksw/jenax/jenax-rx-ops-syscall/4.5.0-1-SNAPSHOT/jenax-rx-ops-syscall-4.5.0-1-20220526.000355-42.pom (2.1 kB at 342 kB/s)
[INFO] Downloading from maven.aksw.internal: https://maven.aksw.org/repository/internal/org/aksw/commons/aksw-commons-io-syscalls/0.9.4-SNAPSHOT/maven-metadata.xml
[INFO] Downloading from maven.aksw.snapshots: https://maven.aksw.org/repository/snapshots/org/aksw/commons/aksw-commons-io-syscalls/0.9.4-SNAPSHOT/maven-metadata.xml
[INFO] Downloading from apache-repo-snapshots: https://repository.apache.org/content/repositories/snapshots/org/aksw/commons/aksw-commons-io-syscalls/0.9.4-SNAPSHOT/maven-metadata.xml
[INFO] Downloaded from maven.aksw.snapshots: https://maven.aksw.org/repository/snapshots/org/aksw/commons/aksw-commons-io-syscalls/0.9.4-SNAPSHOT/maven-metadata.xml (377 B at 54 kB/s)
[INFO] Downloading from maven.aksw.internal: https://maven.aksw.org/repository/internal/org/aksw/jenax/jenax-arq-algebra/4.5.0-1-SNAPSHOT/maven-metadata.xml
[INFO] Downloading from maven.aksw.snapshots: https://maven.aksw.org/repository/snapshots/org/aksw/jenax/jenax-arq-algebra/4.5.0-1-SNAPSHOT/maven-metadata.xml
[INFO] Downloading from apache-repo-snapshots: https://repository.apache.org/content/repositories/snapshots/org/aksw/jenax/jenax-arq-algebra/4.5.0-1-SNAPSHOT/maven-metadata.xml
[INFO] Downloaded from maven.aksw.snapshots: https://maven.aksw.org/repository/snapshots/org/aksw/jenax/jenax-arq-algebra/4.5.0-1-SNAPSHOT/maven-metadata.xml (371 B at 53 kB/s)
[INFO] Downloading from maven.aksw.internal: https://maven.aksw.org/repository/internal/org/aksw/jenax/jenax-arq-algebra/4.5.0-1-SNAPSHOT/jenax-arq-algebra-4.5.0-1-20220526.000230-47.pom
[INFO] Downloading from maven.aksw.snapshots: https://maven.aksw.org/repository/snapshots/org/aksw/jenax/jenax-arq-algebra/4.5.0-1-SNAPSHOT/jenax-arq-algebra-4.5.0-1-20220526.000230-47.pom
[INFO] Downloaded from maven.aksw.snapshots: https://maven.aksw.org/repository/snapshots/org/aksw/jenax/jenax-arq-algebra/4.5.0-1-SNAPSHOT/jenax-arq-algebra-4.5.0-1-20220526.000230-47.pom (1.9 kB at 118 kB/s)
[INFO] Downloading from maven.aksw.internal: https://maven.aksw.org/repository/internal/org/aksw/jenax/jenax-arq-propertypaths/4.5.0-1-SNAPSHOT/maven-metadata.xml
[INFO] Downloading from maven.aksw.snapshots: https://maven.aksw.org/repository/snapshots/org/aksw/jenax/jenax-arq-propertypaths/4.5.0-1-SNAPSHOT/maven-metadata.xml
[INFO] Downloading from apache-repo-snapshots: https://repository.apache.org/content/repositories/snapshots/org/aksw/jenax/jenax-arq-propertypaths/4.5.0-1-SNAPSHOT/maven-metadata.xml
[INFO] Downloaded from maven.aksw.snapshots: https://maven.aksw.org/repository/snapshots/org/aksw/jenax/jenax-arq-propertypaths/4.5.0-1-SNAPSHOT/maven-metadata.xml (0 B at 0 B/s)
[INFO] Downloading from maven.aksw.internal: https://maven.aksw.org/repository/internal/org/aksw/jenax/jenax-arq-udf/4.5.0-1-SNAPSHOT/maven-metadata.xml
[INFO] Downloading from apache-repo-snapshots: https://repository.apache.org/content/repositories/snapshots/org/aksw/jenax/jenax-arq-udf/4.5.0-1-SNAPSHOT/maven-metadata.xml
[INFO] Downloading from maven.aksw.snapshots: https://maven.aksw.org/repository/snapshots/org/aksw/jenax/jenax-arq-udf/4.5.0-1-SNAPSHOT/maven-metadata.xml
[INFO] Downloaded from maven.aksw.snapshots: https://maven.aksw.org/repository/snapshots/org/aksw/jenax/jenax-arq-udf/4.5.0-1-SNAPSHOT/maven-metadata.xml (367 B at 52 kB/s)
[INFO] Downloading from maven.aksw.snapshots: https://maven.aksw.org/repository/snapshots/org/aksw/jenax/jenax-arq-hdt/4.5.0-1-SNAPSHOT/maven-metadata.xml
[INFO] Downloading from apache-repo-snapshots: https://repository.apache.org/content/repositories/snapshots/org/aksw/jenax/jenax-arq-hdt/4.5.0-1-SNAPSHOT/maven-metadata.xml
[INFO] Downloading from maven.aksw.internal: https://maven.aksw.org/repository/internal/org/aksw/jenax/jenax-arq-hdt/4.5.0-1-SNAPSHOT/maven-metadata.xml
[INFO] Downloaded from maven.aksw.snapshots: https://maven.aksw.org/repository/snapshots/org/aksw/jenax/jenax-arq-hdt/4.5.0-1-SNAPSHOT/maven-metadata.xml (1.2 kB at 174 kB/s)
[INFO] Downloading from maven.aksw.snapshots: https://maven.aksw.org/repository/snapshots/org/aksw/jenax/jenax-arq-plugins-bundle/4.5.0-1-SNAPSHOT/maven-metadata.xml
[INFO] Downloading from maven.aksw.internal: https://maven.aksw.org/repository/internal/org/aksw/jenax/jenax-arq-plugins-bundle/4.5.0-1-SNAPSHOT/maven-metadata.xml
[INFO] Downloading from apache-repo-snapshots: https://repository.apache.org/content/repositories/snapshots/org/aksw/jenax/jenax-arq-plugins-bundle/4.5.0-1-SNAPSHOT/maven-metadata.xml
[INFO] Downloaded from maven.aksw.snapshots: https://maven.aksw.org/repository/snapshots/org/aksw/jenax/jenax-arq-plugins-bundle/4.5.0-1-SNAPSHOT/maven-metadata.xml (0 B at 0 B/s)
[INFO] Downloading from maven.aksw.internal: https://maven.aksw.org/repository/internal/org/aksw/jenax/jenax-arq-plugins-parent/4.5.0-1-SNAPSHOT/maven-metadata.xml
[INFO] Downloading from maven.aksw.snapshots: https://maven.aksw.org/repository/snapshots/org/aksw/jenax/jenax-arq-plugins-parent/4.5.0-1-SNAPSHOT/maven-metadata.xml
[INFO] Downloading from apache-repo-snapshots: https://repository.apache.org/content/repositories/snapshots/org/aksw/jenax/jenax-arq-plugins-parent/4.5.0-1-SNAPSHOT/maven-metadata.xml
[INFO] Downloaded from maven.aksw.snapshots: https://maven.aksw.org/repository/snapshots/org/aksw/jenax/jenax-arq-plugins-parent/4.5.0-1-SNAPSHOT/maven-metadata.xml (378 B at 54 kB/s)
[INFO] Downloading from maven.aksw.internal: https://maven.aksw.org/repository/internal/org/aksw/jenax/jenax-arq-plugins-datatypes/4.5.0-1-SNAPSHOT/maven-metadata.xml
[INFO] Downloading from maven.aksw.snapshots: https://maven.aksw.org/repository/snapshots/org/aksw/jenax/jenax-arq-plugins-datatypes/4.5.0-1-SNAPSHOT/maven-metadata.xml
[INFO] Downloading from apache-repo-snapshots: https://repository.apache.org/content/repositories/snapshots/org/aksw/jenax/jenax-arq-plugins-datatypes/4.5.0-1-SNAPSHOT/maven-metadata.xml
[INFO] Downloaded from maven.aksw.snapshots: https://maven.aksw.org/repository/snapshots/org/aksw/jenax/jenax-arq-plugins-datatypes/4.5.0-1-SNAPSHOT/maven-metadata.xml (0 B at 0 B/s)
[INFO] Downloading from maven.aksw.internal: https://maven.aksw.org/repository/internal/org/aksw/jenax/jenax-models-dcat-api/4.5.0-1-SNAPSHOT/maven-metadata.xml
[INFO] Downloading from maven.aksw.snapshots: https://maven.aksw.org/repository/snapshots/org/aksw/jenax/jenax-models-dcat-api/4.5.0-1-SNAPSHOT/maven-metadata.xml
[INFO] Downloading from apache-repo-snapshots: https://repository.apache.org/content/repositories/snapshots/org/aksw/jenax/jenax-models-dcat-api/4.5.0-1-SNAPSHOT/maven-metadata.xml
[INFO] Downloaded from maven.aksw.snapshots: https://maven.aksw.org/repository/snapshots/org/aksw/jenax/jenax-models-dcat-api/4.5.0-1-SNAPSHOT/maven-metadata.xml (375 B at 54 kB/s)
[INFO] Downloading from maven.aksw.internal: https://maven.aksw.org/repository/internal/org/aksw/jenax/jenax-arq-plugins-service-vfs/4.5.0-1-SNAPSHOT/maven-metadata.xml
[INFO] Downloading from maven.aksw.snapshots: https://maven.aksw.org/repository/snapshots/org/aksw/jenax/jenax-arq-plugins-service-vfs/4.5.0-1-SNAPSHOT/maven-metadata.xml
[INFO] Downloading from apache-repo-snapshots: https://repository.apache.org/content/repositories/snapshots/org/aksw/jenax/jenax-arq-plugins-service-vfs/4.5.0-1-SNAPSHOT/maven-metadata.xml
[INFO] Downloaded from maven.aksw.snapshots: https://maven.aksw.org/repository/snapshots/org/aksw/jenax/jenax-arq-plugins-service-vfs/4.5.0-1-SNAPSHOT/maven-metadata.xml (383 B at 48 kB/s)
[INFO] Downloading from maven.aksw.internal: https://maven.aksw.org/repository/internal/org/aksw/jenax/jenax-arq-plugins-service-vfs/4.5.0-1-SNAPSHOT/jenax-arq-plugins-service-vfs-4.5.0-1-20220526.000316-49.pom
[INFO] Downloading from maven.aksw.snapshots: https://maven.aksw.org/repository/snapshots/org/aksw/jenax/jenax-arq-plugins-service-vfs/4.5.0-1-SNAPSHOT/jenax-arq-plugins-service-vfs-4.5.0-1-20220526.000316-49.pom
[INFO] Downloaded from maven.aksw.snapshots: https://maven.aksw.org/repository/snapshots/org/aksw/jenax/jenax-arq-plugins-service-vfs/4.5.0-1-SNAPSHOT/jenax-arq-plugins-service-vfs-4.5.0-1-20220526.000316-49.pom (1.2 kB at 199 kB/s)
[INFO] Downloading from maven.aksw.internal: https://maven.aksw.org/repository/internal/org/aksw/jenax/jenax-functionbinder-core/4.5.0-1-SNAPSHOT/maven-metadata.xml
[INFO] Downloading from maven.aksw.snapshots: https://maven.aksw.org/repository/snapshots/org/aksw/jenax/jenax-functionbinder-core/4.5.0-1-SNAPSHOT/maven-metadata.xml
[INFO] Downloading from apache-repo-snapshots: https://repository.apache.org/content/repositories/snapshots/org/aksw/jenax/jenax-functionbinder-core/4.5.0-1-SNAPSHOT/maven-metadata.xml
[INFO] Downloaded from maven.aksw.snapshots: https://maven.aksw.org/repository/snapshots/org/aksw/jenax/jenax-functionbinder-core/4.5.0-1-SNAPSHOT/maven-metadata.xml (379 B at 63 kB/s)
[INFO] Downloading from maven.aksw.internal: https://maven.aksw.org/repository/internal/org/aksw/jenax/jenax-functionbinder-core/4.5.0-1-SNAPSHOT/jenax-functionbinder-core-4.5.0-1-20220526.000325-42.pom
[INFO] Downloading from maven.aksw.snapshots: https://maven.aksw.org/repository/snapshots/org/aksw/jenax/jenax-functionbinder-core/4.5.0-1-SNAPSHOT/jenax-functionbinder-core-4.5.0-1-20220526.000325-42.pom
[INFO] Downloaded from maven.aksw.snapshots: https://maven.aksw.org/repository/snapshots/org/aksw/jenax/jenax-functionbinder-core/4.5.0-1-SNAPSHOT/jenax-functionbinder-core-4.5.0-1-20220526.000325-42.pom (1.6 kB at 271 kB/s)
[INFO] Downloading from maven.aksw.internal: https://maven.aksw.org/repository/internal/org/aksw/jenax/jenax-functionbinder-parent/4.5.0-1-SNAPSHOT/maven-metadata.xml
[INFO] Downloading from maven.aksw.snapshots: https://maven.aksw.org/repository/snapshots/org/aksw/jenax/jenax-functionbinder-parent/4.5.0-1-SNAPSHOT/maven-metadata.xml
[INFO] Downloading from apache-repo-snapshots: https://repository.apache.org/content/repositories/snapshots/org/aksw/jenax/jenax-functionbinder-parent/4.5.0-1-SNAPSHOT/maven-metadata.xml
[INFO] Downloaded from maven.aksw.snapshots: https://maven.aksw.org/repository/snapshots/org/aksw/jenax/jenax-functionbinder-parent/4.5.0-1-SNAPSHOT/maven-metadata.xml (381 B at 32 kB/s)
[INFO] Downloading from maven.aksw.snapshots: https://maven.aksw.org/repository/snapshots/org/aksw/jenax/jenax-functionbinder-parent/4.5.0-1-SNAPSHOT/jenax-functionbinder-parent-4.5.0-1-20220526.000321-43.pom
[INFO] Downloaded from maven.aksw.snapshots: https://maven.aksw.org/repository/snapshots/org/aksw/jenax/jenax-functionbinder-parent/4.5.0-1-SNAPSHOT/jenax-functionbinder-parent-4.5.0-1-20220526.000321-43.pom (581 B at 8.7 kB/s)
[INFO] Downloading from maven.aksw.internal: https://maven.aksw.org/repository/internal/org/aksw/jenax/jenax-arq-tika/4.5.0-1-SNAPSHOT/maven-metadata.xml
[INFO] Downloading from maven.aksw.snapshots: https://maven.aksw.org/repository/snapshots/org/aksw/jenax/jenax-arq-tika/4.5.0-1-SNAPSHOT/maven-metadata.xml
[INFO] Downloading from apache-repo-snapshots: https://repository.apache.org/content/repositories/snapshots/org/aksw/jenax/jenax-arq-tika/4.5.0-1-SNAPSHOT/maven-metadata.xml
[INFO] Downloaded from maven.aksw.snapshots: https://maven.aksw.org/repository/snapshots/org/aksw/jenax/jenax-arq-tika/4.5.0-1-SNAPSHOT/maven-metadata.xml (0 B at 0 B/s)
[INFO] Downloading from maven.aksw.snapshots: https://maven.aksw.org/repository/snapshots/org/aksw/jenax/jenax-arq-connection-core/4.6.0-1-SNAPSHOT/jenax-arq-connection-core-4.6.0-1-20220525.233129-5.jar
[INFO] Downloading from maven.aksw.snapshots: https://maven.aksw.org/repository/snapshots/org/aksw/jenax/jenax-fsrdfstore-system/4.6.0-1-SNAPSHOT/jenax-fsrdfstore-system-4.6.0-1-20220525.234232-4.jar
[INFO] Downloading from maven.aksw.snapshots: https://maven.aksw.org/repository/snapshots/org/aksw/jenax/jenax-arq-plugins-service-vfs/4.6.0-1-SNAPSHOT/jenax-arq-plugins-service-vfs-4.6.0-1-20220525.233938-4.jar
[INFO] Downloading from maven.aksw.snapshots: https://maven.aksw.org/repository/snapshots/org/aksw/jenax/jenax-fsrdfstore-facade/4.6.0-1-SNAPSHOT/jenax-fsrdfstore-facade-4.6.0-1-20220525.234147-4.jar
[INFO] Downloading from maven.aksw.snapshots: https://maven.aksw.org/repository/snapshots/org/aksw/jenax/jenax-fsrdfstore-core/4.6.0-1-SNAPSHOT/jenax-fsrdfstore-core-4.6.0-1-20220525.234134-4.jar
[INFO] Downloaded from maven.aksw.snapshots: https://maven.aksw.org/repository/snapshots/org/aksw/jenax/jenax-arq-plugins-service-vfs/4.6.0-1-SNAPSHOT/jenax-arq-plugins-service-vfs-4.6.0-1-20220525.233938-4.jar (15 kB at 338 kB/s)
[INFO] Downloading from maven.aksw.snapshots: https://maven.aksw.org/repository/snapshots/org/aksw/jenax/jenax-arq-datasets-diff/4.6.0-1-SNAPSHOT/jenax-arq-datasets-diff-4.6.0-1-20220525.233904-4.jar
[INFO] Downloaded from maven.aksw.snapshots: https://maven.aksw.org/repository/snapshots/org/aksw/jenax/jenax-fsrdfstore-system/4.6.0-1-SNAPSHOT/jenax-fsrdfstore-system-4.6.0-1-20220525.234232-4.jar (2.0 kB at 44 kB/s)
[INFO] Downloading from maven.aksw.snapshots: https://maven.aksw.org/repository/snapshots/org/aksw/jenax/jenax-arq-quadengine/4.6.0-1-SNAPSHOT/jenax-arq-quadengine-4.6.0-1-20220525.233725-4.jar
[INFO] Downloaded from maven.aksw.snapshots: https://maven.aksw.org/repository/snapshots/org/aksw/jenax/jenax-arq-datasets-diff/4.6.0-1-SNAPSHOT/jenax-arq-datasets-diff-4.6.0-1-20220525.233904-4.jar (18 kB at 270 kB/s)
[INFO] Downloading from maven.aksw.snapshots: https://maven.aksw.org/repository/snapshots/org/aksw/jenax/jenax-rx-ops-syscall/4.5.0-1-SNAPSHOT/jenax-rx-ops-syscall-4.5.0-1-20220526.000355-42.jar
[INFO] Downloaded from maven.aksw.snapshots: https://maven.aksw.org/repository/snapshots/org/aksw/jenax/jenax-arq-connection-core/4.6.0-1-SNAPSHOT/jenax-arq-connection-core-4.6.0-1-20220525.233129-5.jar (157 kB at 2.2 MB/s)
[INFO] Downloading from maven.aksw.snapshots: https://maven.aksw.org/repository/snapshots/org/aksw/jenax/jenax-arq-rx/4.5.0-1-SNAPSHOT/jenax-arq-rx-4.5.0-1-20220525.235959-46.jar
[INFO] Downloaded from maven.aksw.snapshots: https://maven.aksw.org/repository/snapshots/org/aksw/jenax/jenax-fsrdfstore-facade/4.6.0-1-SNAPSHOT/jenax-fsrdfstore-facade-4.6.0-1-20220525.234147-4.jar (14 kB at 191 kB/s)
[INFO] Downloading from maven.aksw.snapshots: https://maven.aksw.org/repository/snapshots/org/aksw/jenax/jenax-models-entityinfo/4.5.0-1-SNAPSHOT/jenax-models-entityinfo-4.5.0-1-20220525.235904-44.jar
[INFO] Downloaded from maven.aksw.snapshots: https://maven.aksw.org/repository/snapshots/org/aksw/jenax/jenax-arq-quadengine/4.6.0-1-SNAPSHOT/jenax-arq-quadengine-4.6.0-1-20220525.233725-4.jar (17 kB at 225 kB/s)
[INFO] Downloading from maven.aksw.snapshots: https://maven.aksw.org/repository/snapshots/org/aksw/jenax/jenax-arq-aggregators/4.5.0-1-SNAPSHOT/jenax-arq-aggregators-4.5.0-1-20220525.235925-45.jar
[INFO] Downloaded from maven.aksw.snapshots: https://maven.aksw.org/repository/snapshots/org/aksw/jenax/jenax-rx-ops-syscall/4.5.0-1-SNAPSHOT/jenax-rx-ops-syscall-4.5.0-1-20220526.000355-42.jar (15 kB at 169 kB/s)
[INFO] Downloading from maven.aksw.snapshots: https://maven.aksw.org/repository/snapshots/org/aksw/jenax/jenax-arq-rdfterm/4.5.0-1-SNAPSHOT/jenax-arq-rdfterm-4.5.0-1-20220525.235911-45.jar
[INFO] Downloaded from maven.aksw.snapshots: https://maven.aksw.org/repository/snapshots/org/aksw/jenax/jenax-arq-aggregators/4.5.0-1-SNAPSHOT/jenax-arq-aggregators-4.5.0-1-20220525.235925-45.jar (65 kB at 722 kB/s)
[INFO] Downloading from maven.aksw.snapshots: https://maven.aksw.org/repository/snapshots/org/aksw/jenax/jenax-arq-functions/4.5.0-1-SNAPSHOT/jenax-arq-functions-4.5.0-1-20220525.235918-45.jar
[INFO] Downloaded from maven.aksw.snapshots: https://maven.aksw.org/repository/snapshots/org/aksw/jenax/jenax-models-entityinfo/4.5.0-1-SNAPSHOT/jenax-models-entityinfo-4.5.0-1-20220525.235904-44.jar (9.1 kB at 99 kB/s)
[INFO] Downloading from maven.aksw.snapshots: https://maven.aksw.org/repository/snapshots/org/aksw/jenax/jenax-arq-datasets-orderaware/4.5.0-1-SNAPSHOT/jenax-arq-datasets-orderaware-4.5.0-1-20220525.235935-45.jar
[INFO] Downloaded from maven.aksw.snapshots: https://maven.aksw.org/repository/snapshots/org/aksw/jenax/jenax-arq-rx/4.5.0-1-SNAPSHOT/jenax-arq-rx-4.5.0-1-20220525.235959-46.jar (209 kB at 2.2 MB/s)
[INFO] Downloading from maven.aksw.snapshots: https://maven.aksw.org/repository/snapshots/org/aksw/jenax/jenax-arq-datasets-oneng/4.5.0-1-SNAPSHOT/jenax-arq-datasets-oneng-4.5.0-1-20220525.235942-45.jar
[INFO] Downloaded from maven.aksw.snapshots: https://maven.aksw.org/repository/snapshots/org/aksw/jenax/jenax-arq-datasets-orderaware/4.5.0-1-SNAPSHOT/jenax-arq-datasets-orderaware-4.5.0-1-20220525.235935-45.jar (32 kB at 313 kB/s)
[INFO] Downloading from maven.aksw.snapshots: https://maven.aksw.org/repository/snapshots/org/aksw/jenax/jenax-arq-rdfnode-in-dataset/4.5.0-1-SNAPSHOT/jenax-arq-rdfnode-in-dataset-4.5.0-1-20220525.235949-45.jar
[INFO] Downloaded from maven.aksw.snapshots: https://maven.aksw.org/repository/snapshots/org/aksw/jenax/jenax-arq-rdfterm/4.5.0-1-SNAPSHOT/jenax-arq-rdfterm-4.5.0-1-20220525.235911-45.jar (9.5 kB at 94 kB/s)
[INFO] Downloading from maven.aksw.snapshots: https://maven.aksw.org/repository/snapshots/org/aksw/jenax/jenax-arq-relations/4.5.0-1-SNAPSHOT/jenax-arq-relations-4.5.0-1-20220525.235724-46.jar
[INFO] Downloaded from maven.aksw.snapshots: https://maven.aksw.org/repository/snapshots/org/aksw/jenax/jenax-arq-functions/4.5.0-1-SNAPSHOT/jenax-arq-functions-4.5.0-1-20220525.235918-45.jar (3.4 kB at 34 kB/s)
[INFO] Downloading from maven.aksw.snapshots: https://maven.aksw.org/repository/snapshots/org/aksw/jenax/jenax-arq-algebra/4.5.0-1-SNAPSHOT/jenax-arq-algebra-4.5.0-1-20220526.000230-47.jar
[INFO] Downloaded from maven.aksw.snapshots: https://maven.aksw.org/repository/snapshots/org/aksw/jenax/jenax-arq-datasets-oneng/4.5.0-1-SNAPSHOT/jenax-arq-datasets-oneng-4.5.0-1-20220525.235942-45.jar (8.1 kB at 70 kB/s)
[INFO] Downloading from maven.aksw.snapshots: https://maven.aksw.org/repository/snapshots/org/aksw/jenax/jenax-arq-propertypaths/4.5.0-1-SNAPSHOT/jenax-arq-propertypaths-4.5.0-1-20220525.235716-46.jar
[INFO] Downloaded from maven.aksw.snapshots: https://maven.aksw.org/repository/snapshots/org/aksw/jenax/jenax-arq-rdfnode-in-dataset/4.5.0-1-SNAPSHOT/jenax-arq-rdfnode-in-dataset-4.5.0-1-20220525.235949-45.jar (14 kB at 117 kB/s)
[INFO] Downloading from maven.aksw.snapshots: https://maven.aksw.org/repository/snapshots/org/aksw/jenax/jenax-arq-utils/4.5.0-1-SNAPSHOT/jenax-arq-utils-4.5.0-1-20220525.235529-51.jar
[INFO] Downloaded from maven.aksw.snapshots: https://maven.aksw.org/repository/snapshots/org/aksw/jenax/jenax-arq-relations/4.5.0-1-SNAPSHOT/jenax-arq-relations-4.5.0-1-20220525.235724-46.jar (110 kB at 901 kB/s)
[INFO] Downloading from maven.aksw.snapshots: https://maven.aksw.org/repository/snapshots/org/aksw/jenax/jenax-arq-udf/4.5.0-1-SNAPSHOT/jenax-arq-udf-4.5.0-1-20220526.000222-45.jar
[INFO] Downloaded from maven.aksw.snapshots: https://maven.aksw.org/repository/snapshots/org/aksw/jenax/jenax-arq-algebra/4.5.0-1-SNAPSHOT/jenax-arq-algebra-4.5.0-1-20220526.000230-47.jar (193 kB at 1.4 MB/s)
[INFO] Downloading from maven.aksw.snapshots: https://maven.aksw.org/repository/snapshots/org/aksw/jenax/jenax-arq-hdt/4.5.0-1-SNAPSHOT/jenax-arq-hdt-4.5.0-1-20220526.000209-45.jar
[INFO] Downloaded from maven.aksw.snapshots: https://maven.aksw.org/repository/snapshots/org/aksw/jenax/jenax-arq-propertypaths/4.5.0-1-SNAPSHOT/jenax-arq-propertypaths-4.5.0-1-20220525.235716-46.jar (30 kB at 220 kB/s)
[INFO] Downloading from maven.aksw.snapshots: https://maven.aksw.org/repository/snapshots/org/aksw/jenax/jenax-arq-json/4.5.0-1-SNAPSHOT/jenax-arq-json-4.5.0-1-20220525.235706-46.jar
[INFO] Downloaded from maven.aksw.snapshots: https://maven.aksw.org/repository/snapshots/org/aksw/jenax/jenax-arq-udf/4.5.0-1-SNAPSHOT/jenax-arq-udf-4.5.0-1-20220526.000222-45.jar (15 kB at 111 kB/s)
[INFO] Downloading from maven.aksw.snapshots: https://maven.aksw.org/repository/snapshots/org/aksw/jenax/jenax-arq-stmt/4.5.0-1-SNAPSHOT/jenax-arq-stmt-4.5.0-1-20220525.235658-47.jar
[INFO] Downloaded from maven.aksw.snapshots: https://maven.aksw.org/repository/snapshots/org/aksw/jenax/jenax-fsrdfstore-core/4.6.0-1-SNAPSHOT/jenax-fsrdfstore-core-4.6.0-1-20220525.234134-4.jar (0 B at 0 B/s)
[INFO] Downloading from maven.aksw.snapshots: https://maven.aksw.org/repository/snapshots/org/aksw/jenax/jenax-resources-prefixes/4.5.0-1-SNAPSHOT/jenax-resources-prefixes-4.5.0-1-20220525.235537-46.jar
[INFO] Downloaded from maven.aksw.snapshots: https://maven.aksw.org/repository/snapshots/org/aksw/jenax/jenax-arq-utils/4.5.0-1-SNAPSHOT/jenax-arq-utils-4.5.0-1-20220525.235529-51.jar (258 kB at 1.8 MB/s)
[INFO] Downloading from maven.aksw.snapshots: https://maven.aksw.org/repository/snapshots/org/aksw/jenax/jenax-arq-plugins-bundle/4.5.0-1-SNAPSHOT/jenax-arq-plugins-bundle-4.5.0-1-20220526.000342-49.jar
[INFO] Downloaded from maven.aksw.snapshots: https://maven.aksw.org/repository/snapshots/org/aksw/jenax/jenax-arq-hdt/4.5.0-1-SNAPSHOT/jenax-arq-hdt-4.5.0-1-20220526.000209-45.jar (12 kB at 79 kB/s)
[INFO] Downloading from maven.aksw.snapshots: https://maven.aksw.org/repository/snapshots/org/aksw/jenax/jenax-arq-collections/4.5.0-1-SNAPSHOT/jenax-arq-collections-4.5.0-1-20220525.235804-46.jar
[INFO] Downloaded from maven.aksw.snapshots: https://maven.aksw.org/repository/snapshots/org/aksw/jenax/jenax-arq-json/4.5.0-1-SNAPSHOT/jenax-arq-json-4.5.0-1-20220525.235706-46.jar (9.7 kB at 63 kB/s)
[INFO] Downloading from maven.aksw.snapshots: https://maven.aksw.org/repository/snapshots/org/aksw/jenax/jenax-annotations-reprogen/4.5.0-1-SNAPSHOT/jenax-annotations-reprogen-4.5.0-1-20220525.235551-43.jar
[INFO] Downloaded from maven.aksw.snapshots: https://maven.aksw.org/repository/snapshots/org/aksw/jenax/jenax-arq-stmt/4.5.0-1-SNAPSHOT/jenax-arq-stmt-4.5.0-1-20220525.235658-47.jar (59 kB at 380 kB/s)
[INFO] Downloading from maven.aksw.snapshots: https://maven.aksw.org/repository/snapshots/org/aksw/jenax/jenax-arq-plugins-datatypes/4.5.0-1-SNAPSHOT/jenax-arq-plugins-datatypes-4.5.0-1-20220526.000303-49.jar
[INFO] Downloaded from maven.aksw.snapshots: https://maven.aksw.org/repository/snapshots/org/aksw/jenax/jenax-arq-collections/4.5.0-1-SNAPSHOT/jenax-arq-collections-4.5.0-1-20220525.235804-46.jar (92 kB at 566 kB/s)
[INFO] Downloading from maven.aksw.snapshots: https://maven.aksw.org/repository/snapshots/org/aksw/jenax/jenax-models-dcat-api/4.5.0-1-SNAPSHOT/jenax-models-dcat-api-4.5.0-1-20220526.000309-44.jar
[INFO] Downloaded from maven.aksw.snapshots: https://maven.aksw.org/repository/snapshots/org/aksw/jenax/jenax-resources-prefixes/4.5.0-1-SNAPSHOT/jenax-resources-prefixes-4.5.0-1-20220525.235537-46.jar (83 kB at 498 kB/s)
[INFO] Downloading from maven.aksw.snapshots: https://maven.aksw.org/repository/snapshots/org/aksw/jenax/jenax-functionbinder-core/4.5.0-1-SNAPSHOT/jenax-functionbinder-core-4.5.0-1-20220526.000325-42.jar
[INFO] Downloaded from maven.aksw.snapshots: https://maven.aksw.org/repository/snapshots/org/aksw/jenax/jenax-annotations-reprogen/4.5.0-1-SNAPSHOT/jenax-annotations-reprogen-4.5.0-1-20220525.235551-43.jar (14 kB at 67 kB/s)
[INFO] Downloading from maven.aksw.snapshots: https://maven.aksw.org/repository/snapshots/org/aksw/jenax/jenax-reprogen-shared/4.5.0-1-SNAPSHOT/jenax-reprogen-shared-4.5.0-1-20220525.235813-41.jar
[INFO] Downloaded from maven.aksw.snapshots: https://maven.aksw.org/repository/snapshots/org/aksw/jenax/jenax-models-dcat-api/4.5.0-1-SNAPSHOT/jenax-models-dcat-api-4.5.0-1-20220526.000309-44.jar (27 kB at 130 kB/s)
[INFO] Downloading from maven.aksw.snapshots: https://maven.aksw.org/repository/snapshots/org/aksw/jenax/jenax-arq-tika/4.5.0-1-SNAPSHOT/jenax-arq-tika-4.5.0-1-20220525.235648-46.jar
[INFO] Downloaded from maven.aksw.snapshots: https://maven.aksw.org/repository/snapshots/org/aksw/jenax/jenax-arq-plugins-datatypes/4.5.0-1-SNAPSHOT/jenax-arq-plugins-datatypes-4.5.0-1-20220526.000303-49.jar (8.8 kB at 43 kB/s)
[INFO] Downloading from maven.aksw.snapshots: https://maven.aksw.org/repository/snapshots/org/aksw/jenax/jenax-rx-dataaccess/4.5.0-1-SNAPSHOT/jenax-rx-dataaccess-4.5.0-1-20220526.000058-42.jar
[INFO] Downloaded from maven.aksw.snapshots: https://maven.aksw.org/repository/snapshots/org/aksw/jenax/jenax-functionbinder-core/4.5.0-1-SNAPSHOT/jenax-functionbinder-core-4.5.0-1-20220526.000325-42.jar (15 kB at 73 kB/s)
[INFO] Downloading from maven.aksw.snapshots: https://maven.aksw.org/repository/snapshots/org/aksw/jenax/jenax-io-kryo/4.5.0-1-SNAPSHOT/jenax-io-kryo-4.5.0-1-20220526.000007-41.jar
[INFO] Downloaded from maven.aksw.snapshots: https://maven.aksw.org/repository/snapshots/org/aksw/jenax/jenax-reprogen-shared/4.5.0-1-SNAPSHOT/jenax-reprogen-shared-4.5.0-1-20220525.235813-41.jar (5.3 kB at 25 kB/s)
[INFO] Downloading from maven.aksw.snapshots: https://maven.aksw.org/repository/snapshots/org/aksw/jenax/jenax-io-json/4.5.0-1-SNAPSHOT/jenax-io-json-4.5.0-1-20220525.235754-36.jar
[INFO] Downloaded from maven.aksw.snapshots: https://maven.aksw.org/repository/snapshots/org/aksw/jenax/jenax-arq-tika/4.5.0-1-SNAPSHOT/jenax-arq-tika-4.5.0-1-20220525.235648-46.jar (3.4 kB at 16 kB/s)
[INFO] Downloading from maven.aksw.snapshots: https://maven.aksw.org/repository/snapshots/org/aksw/jenax/jenax-analytics-core/4.5.0-1-SNAPSHOT/jenax-analytics-core-4.5.0-1-20220526.000024-43.jar
[INFO] Downloaded from maven.aksw.snapshots: https://maven.aksw.org/repository/snapshots/org/aksw/jenax/jenax-arq-plugins-bundle/4.5.0-1-SNAPSHOT/jenax-arq-plugins-bundle-4.5.0-1-20220526.000342-49.jar (175 kB at 789 kB/s)
[INFO] Downloading from maven.aksw.snapshots: https://maven.aksw.org/repository/snapshots/org/aksw/jenax/jenax-reprogen-core/4.5.0-1-SNAPSHOT/jenax-reprogen-core-4.5.0-1-20220525.235855-41.jar
[INFO] Downloaded from maven.aksw.snapshots: https://maven.aksw.org/repository/snapshots/org/aksw/jenax/jenax-io-json/4.5.0-1-SNAPSHOT/jenax-io-json-4.5.0-1-20220525.235754-36.jar (8.6 kB at 38 kB/s)
[INFO] Downloading from maven.aksw.snapshots: https://maven.aksw.org/repository/snapshots/org/aksw/jenax/jenax-arq-entityquery/4.5.0-1-SNAPSHOT/jenax-arq-entityquery-4.5.0-1-20220526.000030-45.jar
[INFO] Downloaded from maven.aksw.snapshots: https://maven.aksw.org/repository/snapshots/org/aksw/jenax/jenax-analytics-core/4.5.0-1-SNAPSHOT/jenax-analytics-core-4.5.0-1-20220526.000024-43.jar (66 kB at 285 kB/s)
[INFO] Downloading from maven.aksw.snapshots: https://maven.aksw.org/repository/snapshots/org/aksw/jenax/jenax-io-core/4.5.0-1-SNAPSHOT/jenax-io-core-4.5.0-1-20220526.000137-41.jar
[INFO] Downloaded from maven.aksw.snapshots: https://maven.aksw.org/repository/snapshots/org/aksw/jenax/jenax-rx-dataaccess/4.5.0-1-SNAPSHOT/jenax-rx-dataaccess-4.5.0-1-20220526.000058-42.jar (367 kB at 1.6 MB/s)
[INFO] Downloading from maven.aksw.snapshots: https://maven.aksw.org/repository/snapshots/org/aksw/jenax/jenax-server-standalone/4.5.0-1-SNAPSHOT/jenax-server-standalone-4.5.0-1-20220526.000449-43.jar
[INFO] Downloaded from maven.aksw.snapshots: https://maven.aksw.org/repository/snapshots/org/aksw/jenax/jenax-arq-entityquery/4.5.0-1-SNAPSHOT/jenax-arq-entityquery-4.5.0-1-20220526.000030-45.jar (44 kB at 188 kB/s)
[INFO] Downloading from maven.aksw.snapshots: https://maven.aksw.org/repository/snapshots/org/aksw/jenax/jenax-server-frontends/4.5.0-1-SNAPSHOT/jenax-server-frontends-4.5.0-1-20220526.000442-43.jar
[INFO] Downloaded from maven.aksw.snapshots: https://maven.aksw.org/repository/snapshots/org/aksw/jenax/jenax-io-kryo/4.5.0-1-SNAPSHOT/jenax-io-kryo-4.5.0-1-20220526.000007-41.jar (36 kB at 151 kB/s)
[INFO] Downloading from maven.aksw.snapshots: https://maven.aksw.org/repository/snapshots/org/aksw/jenax/jenax-server-core/4.5.0-1-SNAPSHOT/jenax-server-core-4.5.0-1-20220526.000436-43.jar
[INFO] Downloaded from maven.aksw.snapshots: https://maven.aksw.org/repository/snapshots/org/aksw/jenax/jenax-reprogen-core/4.5.0-1-SNAPSHOT/jenax-reprogen-core-4.5.0-1-20220525.235855-41.jar (67 kB at 279 kB/s)
[INFO] Downloaded from maven.aksw.snapshots: https://maven.aksw.org/repository/snapshots/org/aksw/jenax/jenax-server-standalone/4.5.0-1-SNAPSHOT/jenax-server-standalone-4.5.0-1-20220526.000449-43.jar (5.4 kB at 22 kB/s)
[INFO] Downloaded from maven.aksw.snapshots: https://maven.aksw.org/repository/snapshots/org/aksw/jenax/jenax-server-frontends/4.5.0-1-SNAPSHOT/jenax-server-frontends-4.5.0-1-20220526.000442-43.jar (9.9 kB at 40 kB/s)
[INFO] Downloaded from maven.aksw.snapshots: https://maven.aksw.org/repository/snapshots/org/aksw/jenax/jenax-io-core/4.5.0-1-SNAPSHOT/jenax-io-core-4.5.0-1-20220526.000137-41.jar (221 kB at 873 kB/s)
[INFO] Downloaded from maven.aksw.snapshots: https://maven.aksw.org/repository/snapshots/org/aksw/jenax/jenax-server-core/4.5.0-1-SNAPSHOT/jenax-server-core-4.5.0-1-20220526.000436-43.jar (412 kB at 1.5 MB/s)
[INFO] 
[INFO] --- maven-clean-plugin:2.5:clean (default-clean) @ rdf-processing-toolkit-cli ---
[INFO] Deleting /usr/share/tomcat8/.jenkins/jobs/sparql-integrate/workspace/rdf-processing-toolkit-cli/target
[INFO] 
[INFO] --- maven-resources-plugin:2.6:resources (default-resources) @ rdf-processing-toolkit-cli ---
[INFO] Using 'UTF-8' encoding to copy filtered resources.
[INFO] Copying 10 resources
[INFO] Copying 1 resource
[INFO] 
[INFO] --- maven-compiler-plugin:3.6.0:compile (default-compile) @ rdf-processing-toolkit-cli ---
[INFO] Changes detected - recompiling the module!
[INFO] Compiling 56 source files to /usr/share/tomcat8/.jenkins/jobs/sparql-integrate/workspace/rdf-processing-toolkit-cli/target/classes
[INFO] /usr/share/tomcat8/.jenkins/jobs/sparql-integrate/workspace/rdf-processing-toolkit-cli/src/main/java/org/aksw/sparql_integrate/cli/MainCliSparqlLoad.java: Some input files use or override a deprecated API.
[INFO] /usr/share/tomcat8/.jenkins/jobs/sparql-integrate/workspace/rdf-processing-toolkit-cli/src/main/java/org/aksw/sparql_integrate/cli/MainCliSparqlLoad.java: Recompile with -Xlint:deprecation for details.
[INFO] 
[INFO] --- maven-resources-plugin:2.6:testResources (default-testResources) @ rdf-processing-toolkit-cli ---
[INFO] Using 'UTF-8' encoding to copy filtered resources.
[INFO] Copying 11 resources
[INFO] 
[INFO] --- maven-compiler-plugin:3.6.0:testCompile (default-testCompile) @ rdf-processing-toolkit-cli ---
[INFO] Changes detected - recompiling the module!
[INFO] Compiling 2 source files to /usr/share/tomcat8/.jenkins/jobs/sparql-integrate/workspace/rdf-processing-toolkit-cli/target/test-classes
[INFO] 
[INFO] --- maven-surefire-plugin:2.19:test (default-test) @ rdf-processing-toolkit-cli ---

-------------------------------------------------------
 T E S T S
-------------------------------------------------------
NOTE: Picked up JDK_JAVA_OPTIONS:  --add-opens=java.base/java.lang=ALL-UNNAMED --add-opens=java.base/java.io=ALL-UNNAMED --add-opens=java.rmi/sun.rmi.transport=ALL-UNNAMED
Running org.aksw.sparql_integrate.ngs.cli.main.TestCliNgs
Tests run: 1, Failures: 0, Errors: 0, Skipped: 0, Time elapsed: 0.02 sec - in org.aksw.sparql_integrate.ngs.cli.main.TestCliNgs
Running org.aksw.sparql_integrate.ngs.cli.main.TestSparqlBindingStreamOperators
java.lang.RuntimeException: java.lang.RuntimeException: No lang found for label txt
	at org.aksw.commons.util.exception.ExceptionUtilsAksw.rethrowUnless(ExceptionUtilsAksw.java:40)
	at org.aksw.commons.util.exception.ExceptionUtilsAksw.rethrowIfNotBrokenPipe(ExceptionUtilsAksw.java:81)
	at org.aksw.rdf_processing_toolkit.cli.cmd.CmdUtils.lambda$callCmd$0(CmdUtils.java:69)
	at picocli.CommandLine.execute(CommandLine.java:2088)
	at org.aksw.rdf_processing_toolkit.cli.cmd.CmdUtils.callCmd(CmdUtils.java:75)
	at org.aksw.rdf_processing_toolkit.cli.cmd.CmdUtils.callCmd(CmdUtils.java:39)
	at org.aksw.sparql_integrate.ngs.cli.main.TestSparqlBindingStreamOperators.test1(TestSparqlBindingStreamOperators.java:15)
	at java.base/jdk.internal.reflect.NativeMethodAccessorImpl.invoke0(Native Method)
	at java.base/jdk.internal.reflect.NativeMethodAccessorImpl.invoke(NativeMethodAccessorImpl.java:62)
	at java.base/jdk.internal.reflect.DelegatingMethodAccessorImpl.invoke(DelegatingMethodAccessorImpl.java:43)
	at java.base/java.lang.reflect.Method.invoke(Method.java:566)
	at org.junit.runners.model.FrameworkMethod$1.runReflectiveCall(FrameworkMethod.java:59)
	at org.junit.internal.runners.model.ReflectiveCallable.run(ReflectiveCallable.java:12)
	at org.junit.runners.model.FrameworkMethod.invokeExplosively(FrameworkMethod.java:56)
	at org.junit.internal.runners.statements.InvokeMethod.evaluate(InvokeMethod.java:17)
	at org.junit.runners.ParentRunner$3.evaluate(ParentRunner.java:306)
	at org.junit.runners.BlockJUnit4ClassRunner$1.evaluate(BlockJUnit4ClassRunner.java:100)
	at org.junit.runners.ParentRunner.runLeaf(ParentRunner.java:366)
	at org.junit.runners.BlockJUnit4ClassRunner.runChild(BlockJUnit4ClassRunner.java:103)
	at org.junit.runners.BlockJUnit4ClassRunner.runChild(BlockJUnit4ClassRunner.java:63)
	at org.junit.runners.ParentRunner$4.run(ParentRunner.java:331)
	at org.junit.runners.ParentRunner$1.schedule(ParentRunner.java:79)
	at org.junit.runners.ParentRunner.runChildren(ParentRunner.java:329)
	at org.junit.runners.ParentRunner.access$100(ParentRunner.java:66)
	at org.junit.runners.ParentRunner$2.evaluate(ParentRunner.java:293)
	at org.junit.runners.ParentRunner$3.evaluate(ParentRunner.java:306)
	at org.junit.runners.ParentRunner.run(ParentRunner.java:413)
	at org.apache.maven.surefire.junit4.JUnit4Provider.execute(JUnit4Provider.java:344)
	at org.apache.maven.surefire.junit4.JUnit4Provider.executeWithRerun(JUnit4Provider.java:269)
	at org.apache.maven.surefire.junit4.JUnit4Provider.executeTestSet(JUnit4Provider.java:240)
	at org.apache.maven.surefire.junit4.JUnit4Provider.invoke(JUnit4Provider.java:184)
	at org.apache.maven.surefire.booter.ForkedBooter.invokeProviderInSameClassLoader(ForkedBooter.java:286)
	at org.apache.maven.surefire.booter.ForkedBooter.runSuitesInProcess(ForkedBooter.java:240)
	at org.apache.maven.surefire.booter.ForkedBooter.main(ForkedBooter.java:121)
Caused by: java.lang.RuntimeException: No lang found for label txt
	at org.aksw.jena_sparql_api.rx.RDFLanguagesEx.lambda$findLang$6(RDFLanguagesEx.java:209)
	at java.base/java.util.Optional.orElseThrow(Optional.java:408)
	at org.aksw.jena_sparql_api.rx.RDFLanguagesEx.findLang(RDFLanguagesEx.java:209)
	at org.aksw.sparql_binding_stream.cli.main.SbsCmdImpls.query(SbsCmdImpls.java:201)
	at org.aksw.sparql_binding_stream.cli.cmd.CmdSbsMap.call(CmdSbsMap.java:37)
	at org.aksw.sparql_binding_stream.cli.cmd.CmdSbsMap.call(CmdSbsMap.java:13)
	at picocli.CommandLine.executeUserObject(CommandLine.java:1953)
	at picocli.CommandLine.access$1300(CommandLine.java:145)
	at picocli.CommandLine$RunLast.executeUserObjectOfLastSubcommandWithSameParent(CommandLine.java:2358)
	at picocli.CommandLine$RunLast.handle(CommandLine.java:2352)
	at picocli.CommandLine$RunLast.handle(CommandLine.java:2314)
	at picocli.CommandLine$AbstractParseResultHandler.execute(CommandLine.java:2179)
	at picocli.CommandLine$RunLast.execute(CommandLine.java:2316)
	at picocli.CommandLine.execute(CommandLine.java:2078)
	... 30 more
java.lang.RuntimeException: java.lang.RuntimeException: No lang found for label txt
	at org.aksw.commons.util.exception.ExceptionUtilsAksw.rethrowUnless(ExceptionUtilsAksw.java:40)
	at org.aksw.commons.util.exception.ExceptionUtilsAksw.rethrowIfNotBrokenPipe(ExceptionUtilsAksw.java:81)
	at org.aksw.rdf_processing_toolkit.cli.cmd.CmdUtils.lambda$callCmd$0(CmdUtils.java:69)
	at picocli.CommandLine.execute(CommandLine.java:2088)
	at org.aksw.rdf_processing_toolkit.cli.cmd.CmdUtils.callCmd(CmdUtils.java:75)
	at org.aksw.rdf_processing_toolkit.cli.cmd.CmdUtils.callCmd(CmdUtils.java:39)
	at org.aksw.sparql_integrate.ngs.cli.main.TestSparqlBindingStreamOperators.test1(TestSparqlBindingStreamOperators.java:16)
	at java.base/jdk.internal.reflect.NativeMethodAccessorImpl.invoke0(Native Method)
	at java.base/jdk.internal.reflect.NativeMethodAccessorImpl.invoke(NativeMethodAccessorImpl.java:62)
	at java.base/jdk.internal.reflect.DelegatingMethodAccessorImpl.invoke(DelegatingMethodAccessorImpl.java:43)
	at java.base/java.lang.reflect.Method.invoke(Method.java:566)
	at org.junit.runners.model.FrameworkMethod$1.runReflectiveCall(FrameworkMethod.java:59)
	at org.junit.internal.runners.model.ReflectiveCallable.run(ReflectiveCallable.java:12)
	at org.junit.runners.model.FrameworkMethod.invokeExplosively(FrameworkMethod.java:56)
	at org.junit.internal.runners.statements.InvokeMethod.evaluate(InvokeMethod.java:17)
	at org.junit.runners.ParentRunner$3.evaluate(ParentRunner.java:306)
	at org.junit.runners.BlockJUnit4ClassRunner$1.evaluate(BlockJUnit4ClassRunner.java:100)
	at org.junit.runners.ParentRunner.runLeaf(ParentRunner.java:366)
	at org.junit.runners.BlockJUnit4ClassRunner.runChild(BlockJUnit4ClassRunner.java:103)
	at org.junit.runners.BlockJUnit4ClassRunner.runChild(BlockJUnit4ClassRunner.java:63)
	at org.junit.runners.ParentRunner$4.run(ParentRunner.java:331)
	at org.junit.runners.ParentRunner$1.schedule(ParentRunner.java:79)
	at org.junit.runners.ParentRunner.runChildren(ParentRunner.java:329)
	at org.junit.runners.ParentRunner.access$100(ParentRunner.java:66)
	at org.junit.runners.ParentRunner$2.evaluate(ParentRunner.java:293)
	at org.junit.runners.ParentRunner$3.evaluate(ParentRunner.java:306)
	at org.junit.runners.ParentRunner.run(ParentRunner.java:413)
	at org.apache.maven.surefire.junit4.JUnit4Provider.execute(JUnit4Provider.java:344)
	at org.apache.maven.surefire.junit4.JUnit4Provider.executeWithRerun(JUnit4Provider.java:269)
	at org.apache.maven.surefire.junit4.JUnit4Provider.executeTestSet(JUnit4Provider.java:240)
	at org.apache.maven.surefire.junit4.JUnit4Provider.invoke(JUnit4Provider.java:184)
	at org.apache.maven.surefire.booter.ForkedBooter.invokeProviderInSameClassLoader(ForkedBooter.java:286)
	at org.apache.maven.surefire.booter.ForkedBooter.runSuitesInProcess(ForkedBooter.java:240)
	at org.apache.maven.surefire.booter.ForkedBooter.main(ForkedBooter.java:121)
Caused by: java.lang.RuntimeException: No lang found for label txt
	at org.aksw.jena_sparql_api.rx.RDFLanguagesEx.lambda$findLang$6(RDFLanguagesEx.java:209)
	at java.base/java.util.Optional.orElseThrow(Optional.java:408)
	at org.aksw.jena_sparql_api.rx.RDFLanguagesEx.findLang(RDFLanguagesEx.java:209)
	at org.aksw.sparql_binding_stream.cli.main.SbsCmdImpls.query(SbsCmdImpls.java:201)
	at org.aksw.sparql_binding_stream.cli.cmd.CmdSbsMap.call(CmdSbsMap.java:37)
	at org.aksw.sparql_binding_stream.cli.cmd.CmdSbsMap.call(CmdSbsMap.java:13)
	at picocli.CommandLine.executeUserObject(CommandLine.java:1953)
	at picocli.CommandLine.access$1300(CommandLine.java:145)
	at picocli.CommandLine$RunLast.executeUserObjectOfLastSubcommandWithSameParent(CommandLine.java:2358)
	at picocli.CommandLine$RunLast.handle(CommandLine.java:2352)
	at picocli.CommandLine$RunLast.handle(CommandLine.java:2314)
	at picocli.CommandLine$AbstractParseResultHandler.execute(CommandLine.java:2179)
	at picocli.CommandLine$RunLast.execute(CommandLine.java:2316)
	at picocli.CommandLine.execute(CommandLine.java:2078)
	... 30 more
java.lang.RuntimeException: java.lang.RuntimeException: No lang found for label txt
	at org.aksw.commons.util.exception.ExceptionUtilsAksw.rethrowUnless(ExceptionUtilsAksw.java:40)
	at org.aksw.commons.util.exception.ExceptionUtilsAksw.rethrowIfNotBrokenPipe(ExceptionUtilsAksw.java:81)
	at org.aksw.rdf_processing_toolkit.cli.cmd.CmdUtils.lambda$callCmd$0(CmdUtils.java:69)
	at picocli.CommandLine.execute(CommandLine.java:2088)
	at org.aksw.rdf_processing_toolkit.cli.cmd.CmdUtils.callCmd(CmdUtils.java:75)
	at org.aksw.rdf_processing_toolkit.cli.cmd.CmdUtils.callCmd(CmdUtils.java:39)
	at org.aksw.sparql_integrate.ngs.cli.main.TestSparqlBindingStreamOperators.test1(TestSparqlBindingStreamOperators.java:17)
	at java.base/jdk.internal.reflect.NativeMethodAccessorImpl.invoke0(Native Method)
	at java.base/jdk.internal.reflect.NativeMethodAccessorImpl.invoke(NativeMethodAccessorImpl.java:62)
	at java.base/jdk.internal.reflect.DelegatingMethodAccessorImpl.invoke(DelegatingMethodAccessorImpl.java:43)
	at java.base/java.lang.reflect.Method.invoke(Method.java:566)
	at org.junit.runners.model.FrameworkMethod$1.runReflectiveCall(FrameworkMethod.java:59)
	at org.junit.internal.runners.model.ReflectiveCallable.run(ReflectiveCallable.java:12)
	at org.junit.runners.model.FrameworkMethod.invokeExplosively(FrameworkMethod.java:56)
	at org.junit.internal.runners.statements.InvokeMethod.evaluate(InvokeMethod.java:17)
	at org.junit.runners.ParentRunner$3.evaluate(ParentRunner.java:306)
	at org.junit.runners.BlockJUnit4ClassRunner$1.evaluate(BlockJUnit4ClassRunner.java:100)
	at org.junit.runners.ParentRunner.runLeaf(ParentRunner.java:366)
	at org.junit.runners.BlockJUnit4ClassRunner.runChild(BlockJUnit4ClassRunner.java:103)
	at org.junit.runners.BlockJUnit4ClassRunner.runChild(BlockJUnit4ClassRunner.java:63)
	at org.junit.runners.ParentRunner$4.run(ParentRunner.java:331)
	at org.junit.runners.ParentRunner$1.schedule(ParentRunner.java:79)
	at org.junit.runners.ParentRunner.runChildren(ParentRunner.java:329)
	at org.junit.runners.ParentRunner.access$100(ParentRunner.java:66)
	at org.junit.runners.ParentRunner$2.evaluate(ParentRunner.java:293)
	at org.junit.runners.ParentRunner$3.evaluate(ParentRunner.java:306)
	at org.junit.runners.ParentRunner.run(ParentRunner.java:413)
	at org.apache.maven.surefire.junit4.JUnit4Provider.execute(JUnit4Provider.java:344)
	at org.apache.maven.surefire.junit4.JUnit4Provider.executeWithRerun(JUnit4Provider.java:269)
	at org.apache.maven.surefire.junit4.JUnit4Provider.executeTestSet(JUnit4Provider.java:240)
	at org.apache.maven.surefire.junit4.JUnit4Provider.invoke(JUnit4Provider.java:184)
	at org.apache.maven.surefire.booter.ForkedBooter.invokeProviderInSameClassLoader(ForkedBooter.java:286)
	at org.apache.maven.surefire.booter.ForkedBooter.runSuitesInProcess(ForkedBooter.java:240)
	at org.apache.maven.surefire.booter.ForkedBooter.main(ForkedBooter.java:121)
Caused by: java.lang.RuntimeException: No lang found for label txt
	at org.aksw.jena_sparql_api.rx.RDFLanguagesEx.lambda$findLang$6(RDFLanguagesEx.java:209)
	at java.base/java.util.Optional.orElseThrow(Optional.java:408)
	at org.aksw.jena_sparql_api.rx.RDFLanguagesEx.findLang(RDFLanguagesEx.java:209)
	at org.aksw.sparql_binding_stream.cli.main.SbsCmdImpls.query(SbsCmdImpls.java:201)
	at org.aksw.sparql_binding_stream.cli.cmd.CmdSbsMap.call(CmdSbsMap.java:37)
	at org.aksw.sparql_binding_stream.cli.cmd.CmdSbsMap.call(CmdSbsMap.java:13)
	at picocli.CommandLine.executeUserObject(CommandLine.java:1953)
	at picocli.CommandLine.access$1300(CommandLine.java:145)
	at picocli.CommandLine$RunLast.executeUserObjectOfLastSubcommandWithSameParent(CommandLine.java:2358)
	at picocli.CommandLine$RunLast.handle(CommandLine.java:2352)
	at picocli.CommandLine$RunLast.handle(CommandLine.java:2314)
	at picocli.CommandLine$AbstractParseResultHandler.execute(CommandLine.java:2179)
	at picocli.CommandLine$RunLast.execute(CommandLine.java:2316)
	at picocli.CommandLine.execute(CommandLine.java:2078)
	... 30 more
java.lang.RuntimeException: java.lang.RuntimeException: No lang found for label txt
	at org.aksw.commons.util.exception.ExceptionUtilsAksw.rethrowUnless(ExceptionUtilsAksw.java:40)
	at org.aksw.commons.util.exception.ExceptionUtilsAksw.rethrowIfNotBrokenPipe(ExceptionUtilsAksw.java:81)
	at org.aksw.rdf_processing_toolkit.cli.cmd.CmdUtils.lambda$callCmd$0(CmdUtils.java:69)
	at picocli.CommandLine.execute(CommandLine.java:2088)
	at org.aksw.rdf_processing_toolkit.cli.cmd.CmdUtils.callCmd(CmdUtils.java:75)
	at org.aksw.rdf_processing_toolkit.cli.cmd.CmdUtils.callCmd(CmdUtils.java:39)
	at org.aksw.sparql_integrate.ngs.cli.main.TestSparqlBindingStreamOperators.test1(TestSparqlBindingStreamOperators.java:18)
	at java.base/jdk.internal.reflect.NativeMethodAccessorImpl.invoke0(Native Method)
	at java.base/jdk.internal.reflect.NativeMethodAccessorImpl.invoke(NativeMethodAccessorImpl.java:62)
	at java.base/jdk.internal.reflect.DelegatingMethodAccessorImpl.invoke(DelegatingMethodAccessorImpl.java:43)
	at java.base/java.lang.reflect.Method.invoke(Method.java:566)
	at org.junit.runners.model.FrameworkMethod$1.runReflectiveCall(FrameworkMethod.java:59)
	at org.junit.internal.runners.model.ReflectiveCallable.run(ReflectiveCallable.java:12)
	at org.junit.runners.model.FrameworkMethod.invokeExplosively(FrameworkMethod.java:56)
	at org.junit.internal.runners.statements.InvokeMethod.evaluate(InvokeMethod.java:17)
	at org.junit.runners.ParentRunner$3.evaluate(ParentRunner.java:306)
	at org.junit.runners.BlockJUnit4ClassRunner$1.evaluate(BlockJUnit4ClassRunner.java:100)
	at org.junit.runners.ParentRunner.runLeaf(ParentRunner.java:366)
	at org.junit.runners.BlockJUnit4ClassRunner.runChild(BlockJUnit4ClassRunner.java:103)
	at org.junit.runners.BlockJUnit4ClassRunner.runChild(BlockJUnit4ClassRunner.java:63)
	at org.junit.runners.ParentRunner$4.run(ParentRunner.java:331)
	at org.junit.runners.ParentRunner$1.schedule(ParentRunner.java:79)
	at org.junit.runners.ParentRunner.runChildren(ParentRunner.java:329)
	at org.junit.runners.ParentRunner.access$100(ParentRunner.java:66)
	at org.junit.runners.ParentRunner$2.evaluate(ParentRunner.java:293)
	at org.junit.runners.ParentRunner$3.evaluate(ParentRunner.java:306)
	at org.junit.runners.ParentRunner.run(ParentRunner.java:413)
	at org.apache.maven.surefire.junit4.JUnit4Provider.execute(JUnit4Provider.java:344)
	at org.apache.maven.surefire.junit4.JUnit4Provider.executeWithRerun(JUnit4Provider.java:269)
	at org.apache.maven.surefire.junit4.JUnit4Provider.executeTestSet(JUnit4Provider.java:240)
	at org.apache.maven.surefire.junit4.JUnit4Provider.invoke(JUnit4Provider.java:184)
	at org.apache.maven.surefire.booter.ForkedBooter.invokeProviderInSameClassLoader(ForkedBooter.java:286)
	at org.apache.maven.surefire.booter.ForkedBooter.runSuitesInProcess(ForkedBooter.java:240)
	at org.apache.maven.surefire.booter.ForkedBooter.main(ForkedBooter.java:121)
Caused by: java.lang.RuntimeException: No lang found for label txt
	at org.aksw.jena_sparql_api.rx.RDFLanguagesEx.lambda$findLang$6(RDFLanguagesEx.java:209)
	at java.base/java.util.Optional.orElseThrow(Optional.java:408)
	at org.aksw.jena_sparql_api.rx.RDFLanguagesEx.findLang(RDFLanguagesEx.java:209)
	at org.aksw.sparql_binding_stream.cli.main.SbsCmdImpls.query(SbsCmdImpls.java:201)
	at org.aksw.sparql_binding_stream.cli.cmd.CmdSbsMap.call(CmdSbsMap.java:37)
	at org.aksw.sparql_binding_stream.cli.cmd.CmdSbsMap.call(CmdSbsMap.java:13)
	at picocli.CommandLine.executeUserObject(CommandLine.java:1953)
	at picocli.CommandLine.access$1300(CommandLine.java:145)
	at picocli.CommandLine$RunLast.executeUserObjectOfLastSubcommandWithSameParent(CommandLine.java:2358)
	at picocli.CommandLine$RunLast.handle(CommandLine.java:2352)
	at picocli.CommandLine$RunLast.handle(CommandLine.java:2314)
	at picocli.CommandLine$AbstractParseResultHandler.execute(CommandLine.java:2179)
	at picocli.CommandLine$RunLast.execute(CommandLine.java:2316)
	at picocli.CommandLine.execute(CommandLine.java:2078)
	... 30 more
java.lang.RuntimeException: java.lang.RuntimeException: No lang found for label txt
	at org.aksw.commons.util.exception.ExceptionUtilsAksw.rethrowUnless(ExceptionUtilsAksw.java:40)
	at org.aksw.commons.util.exception.ExceptionUtilsAksw.rethrowIfNotBrokenPipe(ExceptionUtilsAksw.java:81)
	at org.aksw.rdf_processing_toolkit.cli.cmd.CmdUtils.lambda$callCmd$0(CmdUtils.java:69)
	at picocli.CommandLine.execute(CommandLine.java:2088)
	at org.aksw.rdf_processing_toolkit.cli.cmd.CmdUtils.callCmd(CmdUtils.java:75)
	at org.aksw.rdf_processing_toolkit.cli.cmd.CmdUtils.callCmd(CmdUtils.java:39)
	at org.aksw.sparql_integrate.ngs.cli.main.TestSparqlBindingStreamOperators.test1(TestSparqlBindingStreamOperators.java:20)
	at java.base/jdk.internal.reflect.NativeMethodAccessorImpl.invoke0(Native Method)
	at java.base/jdk.internal.reflect.NativeMethodAccessorImpl.invoke(NativeMethodAccessorImpl.java:62)
	at java.base/jdk.internal.reflect.DelegatingMethodAccessorImpl.invoke(DelegatingMethodAccessorImpl.java:43)
	at java.base/java.lang.reflect.Method.invoke(Method.java:566)
	at org.junit.runners.model.FrameworkMethod$1.runReflectiveCall(FrameworkMethod.java:59)
	at org.junit.internal.runners.model.ReflectiveCallable.run(ReflectiveCallable.java:12)
	at org.junit.runners.model.FrameworkMethod.invokeExplosively(FrameworkMethod.java:56)
	at org.junit.internal.runners.statements.InvokeMethod.evaluate(InvokeMethod.java:17)
	at org.junit.runners.ParentRunner$3.evaluate(ParentRunner.java:306)
	at org.junit.runners.BlockJUnit4ClassRunner$1.evaluate(BlockJUnit4ClassRunner.java:100)
	at org.junit.runners.ParentRunner.runLeaf(ParentRunner.java:366)
	at org.junit.runners.BlockJUnit4ClassRunner.runChild(BlockJUnit4ClassRunner.java:103)
	at org.junit.runners.BlockJUnit4ClassRunner.runChild(BlockJUnit4ClassRunner.java:63)
	at org.junit.runners.ParentRunner$4.run(ParentRunner.java:331)
	at org.junit.runners.ParentRunner$1.schedule(ParentRunner.java:79)
	at org.junit.runners.ParentRunner.runChildren(ParentRunner.java:329)
	at org.junit.runners.ParentRunner.access$100(ParentRunner.java:66)
	at org.junit.runners.ParentRunner$2.evaluate(ParentRunner.java:293)
	at org.junit.runners.ParentRunner$3.evaluate(ParentRunner.java:306)
	at org.junit.runners.ParentRunner.run(ParentRunner.java:413)
	at org.apache.maven.surefire.junit4.JUnit4Provider.execute(JUnit4Provider.java:344)
	at org.apache.maven.surefire.junit4.JUnit4Provider.executeWithRerun(JUnit4Provider.java:269)
	at org.apache.maven.surefire.junit4.JUnit4Provider.executeTestSet(JUnit4Provider.java:240)
	at org.apache.maven.surefire.junit4.JUnit4Provider.invoke(JUnit4Provider.java:184)
	at org.apache.maven.surefire.booter.ForkedBooter.invokeProviderInSameClassLoader(ForkedBooter.java:286)
	at org.apache.maven.surefire.booter.ForkedBooter.runSuitesInProcess(ForkedBooter.java:240)
	at org.apache.maven.surefire.booter.ForkedBooter.main(ForkedBooter.java:121)
Caused by: java.lang.RuntimeException: No lang found for label txt
	at org.aksw.jena_sparql_api.rx.RDFLanguagesEx.lambda$findLang$6(RDFLanguagesEx.java:209)
	at java.base/java.util.Optional.orElseThrow(Optional.java:408)
	at org.aksw.jena_sparql_api.rx.RDFLanguagesEx.findLang(RDFLanguagesEx.java:209)
	at org.aksw.sparql_binding_stream.cli.main.SbsCmdImpls.query(SbsCmdImpls.java:201)
	at org.aksw.sparql_binding_stream.cli.cmd.CmdSbsMap.call(CmdSbsMap.java:37)
	at org.aksw.sparql_binding_stream.cli.cmd.CmdSbsMap.call(CmdSbsMap.java:13)
	at picocli.CommandLine.executeUserObject(CommandLine.java:1953)
	at picocli.CommandLine.access$1300(CommandLine.java:145)
	at picocli.CommandLine$RunLast.executeUserObjectOfLastSubcommandWithSameParent(CommandLine.java:2358)
	at picocli.CommandLine$RunLast.handle(CommandLine.java:2352)
	at picocli.CommandLine$RunLast.handle(CommandLine.java:2314)
	at picocli.CommandLine$AbstractParseResultHandler.execute(CommandLine.java:2179)
	at picocli.CommandLine$RunLast.execute(CommandLine.java:2316)
	at picocli.CommandLine.execute(CommandLine.java:2078)
	... 30 more
Tests run: 1, Failures: 0, Errors: 0, Skipped: 0, Time elapsed: 5.612 sec - in org.aksw.sparql_integrate.ngs.cli.main.TestSparqlBindingStreamOperators

Results :

Tests run: 2, Failures: 0, Errors: 0, Skipped: 0

[JENKINS] Recording test results
[INFO] 
[INFO] --- maven-jar-plugin:2.4:jar (default-jar) @ rdf-processing-toolkit-cli ---
[INFO] Building jar: /usr/share/tomcat8/.jenkins/jobs/sparql-integrate/workspace/rdf-processing-toolkit-cli/target/rdf-processing-toolkit-cli-1.9.1-SNAPSHOT.jar
[INFO] 
[INFO] --- maven-javadoc-plugin:2.9.1:jar (attach-javadocs) @ rdf-processing-toolkit-cli ---
[INFO] 
Loading source file /usr/share/tomcat8/.jenkins/jobs/sparql-integrate/workspace/rdf-processing-toolkit-cli/src/main/java/sbs.java...
Loading source file /usr/share/tomcat8/.jenkins/jobs/sparql-integrate/workspace/rdf-processing-toolkit-cli/src/main/java/rpt.java...
Loading source file /usr/share/tomcat8/.jenkins/jobs/sparql-integrate/workspace/rdf-processing-toolkit-cli/src/main/java/ngs.java...
Loading source file /usr/share/tomcat8/.jenkins/jobs/sparql-integrate/workspace/rdf-processing-toolkit-cli/src/main/java/integrate.java...
Loading source files for package org.aksw.named_graph_stream.cli.main...
Loading source files for package org.aksw.named_graph_stream.cli.cmd...
Loading source files for package org.aksw.sparql_integrate.cli...
Loading source files for package org.aksw.sparql_integrate.cli.main...
Loading source files for package org.aksw.sparql_integrate.cli.cmd...
Loading source files for package org.aksw.rdf_processing_toolkit.cli.main...
Loading source files for package org.aksw.rdf_processing_toolkit.cli.cmd...
Loading source files for package org.aksw.jena_sparql_api.rx.op.api...
Loading source files for package org.aksw.sparql_binding_stream.cli.main...
Loading source files for package org.aksw.sparql_binding_stream.cli.cmd...
Constructing Javadoc information...
Standard Doclet version 11.0.13
Building tree for all the packages and classes...
Generating /usr/share/tomcat8/.jenkins/jobs/sparql-integrate/workspace/rdf-processing-toolkit-cli/target/apidocs/integrate.html...
Generating /usr/share/tomcat8/.jenkins/jobs/sparql-integrate/workspace/rdf-processing-toolkit-cli/target/apidocs/ngs.html...
Generating /usr/share/tomcat8/.jenkins/jobs/sparql-integrate/workspace/rdf-processing-toolkit-cli/target/apidocs/rpt.html...
Generating /usr/share/tomcat8/.jenkins/jobs/sparql-integrate/workspace/rdf-processing-toolkit-cli/target/apidocs/sbs.html...
Generating /usr/share/tomcat8/.jenkins/jobs/sparql-integrate/workspace/rdf-processing-toolkit-cli/target/apidocs/org/aksw/jena_sparql_api/rx/op/api/OpConfigSort.html...
Generating /usr/share/tomcat8/.jenkins/jobs/sparql-integrate/workspace/rdf-processing-toolkit-cli/target/apidocs/org/aksw/named_graph_stream/cli/cmd/CmdNgJoin.html...
Generating /usr/share/tomcat8/.jenkins/jobs/sparql-integrate/workspace/rdf-processing-toolkit-cli/target/apidocs/org/aksw/named_graph_stream/cli/cmd/CmdNgsCat.html...
Generating /usr/share/tomcat8/.jenkins/jobs/sparql-integrate/workspace/rdf-processing-toolkit-cli/target/apidocs/org/aksw/named_graph_stream/cli/cmd/CmdNgsFilter.html...
Generating /usr/share/tomcat8/.jenkins/jobs/sparql-integrate/workspace/rdf-processing-toolkit-cli/target/apidocs/org/aksw/named_graph_stream/cli/cmd/CmdNgsGit.html...
Generating /usr/share/tomcat8/.jenkins/jobs/sparql-integrate/workspace/rdf-processing-toolkit-cli/target/apidocs/org/aksw/named_graph_stream/cli/cmd/CmdNgsHead.html...
Generating /usr/share/tomcat8/.jenkins/jobs/sparql-integrate/workspace/rdf-processing-toolkit-cli/target/apidocs/org/aksw/named_graph_stream/cli/cmd/CmdNgsMain.html...
Generating /usr/share/tomcat8/.jenkins/jobs/sparql-integrate/workspace/rdf-processing-toolkit-cli/target/apidocs/org/aksw/named_graph_stream/cli/cmd/CmdNgsMap.html...
Generating /usr/share/tomcat8/.jenkins/jobs/sparql-integrate/workspace/rdf-processing-toolkit-cli/target/apidocs/org/aksw/named_graph_stream/cli/cmd/CmdNgsMap.MapSpec.html...
Generating /usr/share/tomcat8/.jenkins/jobs/sparql-integrate/workspace/rdf-processing-toolkit-cli/target/apidocs/org/aksw/named_graph_stream/cli/cmd/CmdNgsMerge.html...
Generating /usr/share/tomcat8/.jenkins/jobs/sparql-integrate/workspace/rdf-processing-toolkit-cli/target/apidocs/org/aksw/named_graph_stream/cli/cmd/CmdNgsProbe.html...
Generating /usr/share/tomcat8/.jenkins/jobs/sparql-integrate/workspace/rdf-processing-toolkit-cli/target/apidocs/org/aksw/named_graph_stream/cli/cmd/CmdNgsSort.html...
Generating /usr/share/tomcat8/.jenkins/jobs/sparql-integrate/workspace/rdf-processing-toolkit-cli/target/apidocs/org/aksw/named_graph_stream/cli/cmd/CmdNgsSubjects.html...
Generating /usr/share/tomcat8/.jenkins/jobs/sparql-integrate/workspace/rdf-processing-toolkit-cli/target/apidocs/org/aksw/named_graph_stream/cli/cmd/CmdNgsTail.html...
Generating /usr/share/tomcat8/.jenkins/jobs/sparql-integrate/workspace/rdf-processing-toolkit-cli/target/apidocs/org/aksw/named_graph_stream/cli/cmd/CmdNgsUntil.html...
Generating /usr/share/tomcat8/.jenkins/jobs/sparql-integrate/workspace/rdf-processing-toolkit-cli/target/apidocs/org/aksw/named_graph_stream/cli/cmd/CmdNgsWc.html...
Generating /usr/share/tomcat8/.jenkins/jobs/sparql-integrate/workspace/rdf-processing-toolkit-cli/target/apidocs/org/aksw/named_graph_stream/cli/cmd/CmdNgsWhile.html...
Generating /usr/share/tomcat8/.jenkins/jobs/sparql-integrate/workspace/rdf-processing-toolkit-cli/target/apidocs/org/aksw/named_graph_stream/cli/cmd/IParameterConsumerFlaggedLong.html...
Generating /usr/share/tomcat8/.jenkins/jobs/sparql-integrate/workspace/rdf-processing-toolkit-cli/target/apidocs/org/aksw/named_graph_stream/cli/main/DatasetFlowOps.html...
Generating /usr/share/tomcat8/.jenkins/jobs/sparql-integrate/workspace/rdf-processing-toolkit-cli/target/apidocs/org/aksw/named_graph_stream/cli/main/MainCliNamedGraphStream.html...
Generating /usr/share/tomcat8/.jenkins/jobs/sparql-integrate/workspace/rdf-processing-toolkit-cli/target/apidocs/org/aksw/named_graph_stream/cli/main/MainPlaygroundScanTrig.html...
Generating /usr/share/tomcat8/.jenkins/jobs/sparql-integrate/workspace/rdf-processing-toolkit-cli/target/apidocs/org/aksw/named_graph_stream/cli/main/NamedGraphFluent.html...
Generating /usr/share/tomcat8/.jenkins/jobs/sparql-integrate/workspace/rdf-processing-toolkit-cli/target/apidocs/org/aksw/named_graph_stream/cli/main/NamedGraphStreamOps.html...
Generating /usr/share/tomcat8/.jenkins/jobs/sparql-integrate/workspace/rdf-processing-toolkit-cli/target/apidocs/org/aksw/named_graph_stream/cli/main/NgsCmdImpls.html...
Generating /usr/share/tomcat8/.jenkins/jobs/sparql-integrate/workspace/rdf-processing-toolkit-cli/target/apidocs/org/aksw/named_graph_stream/cli/main/NgsGitCmdImpls.html...
Generating /usr/share/tomcat8/.jenkins/jobs/sparql-integrate/workspace/rdf-processing-toolkit-cli/target/apidocs/org/aksw/named_graph_stream/cli/main/QueryEvaluatorForTuple.html...
Generating /usr/share/tomcat8/.jenkins/jobs/sparql-integrate/workspace/rdf-processing-toolkit-cli/target/apidocs/org/aksw/rdf_processing_toolkit/cli/cmd/CliUtils.html...
Generating /usr/share/tomcat8/.jenkins/jobs/sparql-integrate/workspace/rdf-processing-toolkit-cli/target/apidocs/org/aksw/rdf_processing_toolkit/cli/cmd/CmdCommonBase.html...
Generating /usr/share/tomcat8/.jenkins/jobs/sparql-integrate/workspace/rdf-processing-toolkit-cli/target/apidocs/org/aksw/rdf_processing_toolkit/cli/cmd/CmdRptMain.html...
Generating /usr/share/tomcat8/.jenkins/jobs/sparql-integrate/workspace/rdf-processing-toolkit-cli/target/apidocs/org/aksw/rdf_processing_toolkit/cli/cmd/CmdUtils.html...
Generating /usr/share/tomcat8/.jenkins/jobs/sparql-integrate/workspace/rdf-processing-toolkit-cli/target/apidocs/org/aksw/rdf_processing_toolkit/cli/cmd/HasDebugMode.html...
Generating /usr/share/tomcat8/.jenkins/jobs/sparql-integrate/workspace/rdf-processing-toolkit-cli/target/apidocs/org/aksw/rdf_processing_toolkit/cli/cmd/VersionProviderFromClasspathProperties.html...
Generating /usr/share/tomcat8/.jenkins/jobs/sparql-integrate/workspace/rdf-processing-toolkit-cli/target/apidocs/org/aksw/rdf_processing_toolkit/cli/cmd/VersionProviderRdfProcessingToolkit.html...
Generating /usr/share/tomcat8/.jenkins/jobs/sparql-integrate/workspace/rdf-processing-toolkit-cli/target/apidocs/org/aksw/rdf_processing_toolkit/cli/main/MainCliRdfProcessingToolkit.html...
Generating /usr/share/tomcat8/.jenkins/jobs/sparql-integrate/workspace/rdf-processing-toolkit-cli/target/apidocs/org/aksw/sparql_binding_stream/cli/cmd/CmdSbsFilter.html...
Generating /usr/share/tomcat8/.jenkins/jobs/sparql-integrate/workspace/rdf-processing-toolkit-cli/target/apidocs/org/aksw/sparql_binding_stream/cli/cmd/CmdSbsMain.html...
Generating /usr/share/tomcat8/.jenkins/jobs/sparql-integrate/workspace/rdf-processing-toolkit-cli/target/apidocs/org/aksw/sparql_binding_stream/cli/cmd/CmdSbsMap.html...
Generating /usr/share/tomcat8/.jenkins/jobs/sparql-integrate/workspace/rdf-processing-toolkit-cli/target/apidocs/org/aksw/sparql_binding_stream/cli/cmd/CmdSbsSplit.html...
Generating /usr/share/tomcat8/.jenkins/jobs/sparql-integrate/workspace/rdf-processing-toolkit-cli/target/apidocs/org/aksw/sparql_binding_stream/cli/main/MainCliSparqlBindingStream.html...
Generating /usr/share/tomcat8/.jenkins/jobs/sparql-integrate/workspace/rdf-processing-toolkit-cli/target/apidocs/org/aksw/sparql_binding_stream/cli/main/SbsCmdImpls.html...
Generating /usr/share/tomcat8/.jenkins/jobs/sparql-integrate/workspace/rdf-processing-toolkit-cli/target/apidocs/org/aksw/sparql_integrate/cli/CommandMain.html...
Generating /usr/share/tomcat8/.jenkins/jobs/sparql-integrate/workspace/rdf-processing-toolkit-cli/target/apidocs/org/aksw/sparql_integrate/cli/DerbyUtil.html...
Generating /usr/share/tomcat8/.jenkins/jobs/sparql-integrate/workspace/rdf-processing-toolkit-cli/target/apidocs/org/aksw/sparql_integrate/cli/MainCliSparqlIntegrateOld.html...
Generating /usr/share/tomcat8/.jenkins/jobs/sparql-integrate/workspace/rdf-processing-toolkit-cli/target/apidocs/org/aksw/sparql_integrate/cli/MainCliSparqlLoad.html...
Generating /usr/share/tomcat8/.jenkins/jobs/sparql-integrate/workspace/rdf-processing-toolkit-cli/target/apidocs/org/aksw/sparql_integrate/cli/SparqlStmtProcessor.html...
Generating /usr/share/tomcat8/.jenkins/jobs/sparql-integrate/workspace/rdf-processing-toolkit-cli/target/apidocs/org/aksw/sparql_integrate/cli/cmd/CmdSparqlIntegrateMain.html...
Generating /usr/share/tomcat8/.jenkins/jobs/sparql-integrate/workspace/rdf-processing-toolkit-cli/target/apidocs/org/aksw/sparql_integrate/cli/cmd/CmdSparqlIntegrateMain.OutputSpec.html...
Generating /usr/share/tomcat8/.jenkins/jobs/sparql-integrate/workspace/rdf-processing-toolkit-cli/target/apidocs/org/aksw/sparql_integrate/cli/main/MainCliSparqlIntegrate.html...
Generating /usr/share/tomcat8/.jenkins/jobs/sparql-integrate/workspace/rdf-processing-toolkit-cli/target/apidocs/org/aksw/sparql_integrate/cli/main/SparqlIntegrateCmdImpls.html...
Generating /usr/share/tomcat8/.jenkins/jobs/sparql-integrate/workspace/rdf-processing-toolkit-cli/target/apidocs/org/aksw/sparql_integrate/cli/main/SparqlIntegrateLegacyDataSources.html...
Generating /usr/share/tomcat8/.jenkins/jobs/sparql-integrate/workspace/rdf-processing-toolkit-cli/target/apidocs/package-summary.html...
Generating /usr/share/tomcat8/.jenkins/jobs/sparql-integrate/workspace/rdf-processing-toolkit-cli/target/apidocs/package-tree.html...
Generating /usr/share/tomcat8/.jenkins/jobs/sparql-integrate/workspace/rdf-processing-toolkit-cli/target/apidocs/org/aksw/jena_sparql_api/rx/op/api/package-summary.html...
Generating /usr/share/tomcat8/.jenkins/jobs/sparql-integrate/workspace/rdf-processing-toolkit-cli/target/apidocs/org/aksw/jena_sparql_api/rx/op/api/package-tree.html...
Generating /usr/share/tomcat8/.jenkins/jobs/sparql-integrate/workspace/rdf-processing-toolkit-cli/target/apidocs/org/aksw/named_graph_stream/cli/cmd/package-summary.html...
Generating /usr/share/tomcat8/.jenkins/jobs/sparql-integrate/workspace/rdf-processing-toolkit-cli/target/apidocs/org/aksw/named_graph_stream/cli/cmd/package-tree.html...
Generating /usr/share/tomcat8/.jenkins/jobs/sparql-integrate/workspace/rdf-processing-toolkit-cli/target/apidocs/org/aksw/named_graph_stream/cli/main/package-summary.html...
Generating /usr/share/tomcat8/.jenkins/jobs/sparql-integrate/workspace/rdf-processing-toolkit-cli/target/apidocs/org/aksw/named_graph_stream/cli/main/package-tree.html...
Generating /usr/share/tomcat8/.jenkins/jobs/sparql-integrate/workspace/rdf-processing-toolkit-cli/target/apidocs/org/aksw/rdf_processing_toolkit/cli/cmd/package-summary.html...
Generating /usr/share/tomcat8/.jenkins/jobs/sparql-integrate/workspace/rdf-processing-toolkit-cli/target/apidocs/org/aksw/rdf_processing_toolkit/cli/cmd/package-tree.html...
Generating /usr/share/tomcat8/.jenkins/jobs/sparql-integrate/workspace/rdf-processing-toolkit-cli/target/apidocs/org/aksw/rdf_processing_toolkit/cli/main/package-summary.html...
Generating /usr/share/tomcat8/.jenkins/jobs/sparql-integrate/workspace/rdf-processing-toolkit-cli/target/apidocs/org/aksw/rdf_processing_toolkit/cli/main/package-tree.html...
Generating /usr/share/tomcat8/.jenkins/jobs/sparql-integrate/workspace/rdf-processing-toolkit-cli/target/apidocs/org/aksw/sparql_binding_stream/cli/cmd/package-summary.html...
Generating /usr/share/tomcat8/.jenkins/jobs/sparql-integrate/workspace/rdf-processing-toolkit-cli/target/apidocs/org/aksw/sparql_binding_stream/cli/cmd/package-tree.html...
Generating /usr/share/tomcat8/.jenkins/jobs/sparql-integrate/workspace/rdf-processing-toolkit-cli/target/apidocs/org/aksw/sparql_binding_stream/cli/main/package-summary.html...
Generating /usr/share/tomcat8/.jenkins/jobs/sparql-integrate/workspace/rdf-processing-toolkit-cli/target/apidocs/org/aksw/sparql_binding_stream/cli/main/package-tree.html...
Generating /usr/share/tomcat8/.jenkins/jobs/sparql-integrate/workspace/rdf-processing-toolkit-cli/target/apidocs/org/aksw/sparql_integrate/cli/package-summary.html...
Generating /usr/share/tomcat8/.jenkins/jobs/sparql-integrate/workspace/rdf-processing-toolkit-cli/target/apidocs/org/aksw/sparql_integrate/cli/package-tree.html...
Generating /usr/share/tomcat8/.jenkins/jobs/sparql-integrate/workspace/rdf-processing-toolkit-cli/target/apidocs/org/aksw/sparql_integrate/cli/cmd/package-summary.html...
Generating /usr/share/tomcat8/.jenkins/jobs/sparql-integrate/workspace/rdf-processing-toolkit-cli/target/apidocs/org/aksw/sparql_integrate/cli/cmd/package-tree.html...
Generating /usr/share/tomcat8/.jenkins/jobs/sparql-integrate/workspace/rdf-processing-toolkit-cli/target/apidocs/org/aksw/sparql_integrate/cli/main/package-summary.html...
Generating /usr/share/tomcat8/.jenkins/jobs/sparql-integrate/workspace/rdf-processing-toolkit-cli/target/apidocs/org/aksw/sparql_integrate/cli/main/package-tree.html...
Generating /usr/share/tomcat8/.jenkins/jobs/sparql-integrate/workspace/rdf-processing-toolkit-cli/target/apidocs/constant-values.html...
Generating /usr/share/tomcat8/.jenkins/jobs/sparql-integrate/workspace/rdf-processing-toolkit-cli/target/apidocs/org/aksw/named_graph_stream/cli/main/class-use/NgsGitCmdImpls.html...
Generating /usr/share/tomcat8/.jenkins/jobs/sparql-integrate/workspace/rdf-processing-toolkit-cli/target/apidocs/org/aksw/named_graph_stream/cli/main/class-use/QueryEvaluatorForTuple.html...
Generating /usr/share/tomcat8/.jenkins/jobs/sparql-integrate/workspace/rdf-processing-toolkit-cli/target/apidocs/org/aksw/named_graph_stream/cli/main/class-use/NamedGraphStreamOps.html...
Generating /usr/share/tomcat8/.jenkins/jobs/sparql-integrate/workspace/rdf-processing-toolkit-cli/target/apidocs/org/aksw/named_graph_stream/cli/main/class-use/NamedGraphFluent.html...
Generating /usr/share/tomcat8/.jenkins/jobs/sparql-integrate/workspace/rdf-processing-toolkit-cli/target/apidocs/org/aksw/named_graph_stream/cli/main/class-use/MainPlaygroundScanTrig.html...
Generating /usr/share/tomcat8/.jenkins/jobs/sparql-integrate/workspace/rdf-processing-toolkit-cli/target/apidocs/org/aksw/named_graph_stream/cli/main/class-use/NgsCmdImpls.html...
Generating /usr/share/tomcat8/.jenkins/jobs/sparql-integrate/workspace/rdf-processing-toolkit-cli/target/apidocs/org/aksw/named_graph_stream/cli/main/class-use/DatasetFlowOps.html...
Generating /usr/share/tomcat8/.jenkins/jobs/sparql-integrate/workspace/rdf-processing-toolkit-cli/target/apidocs/org/aksw/named_graph_stream/cli/main/class-use/MainCliNamedGraphStream.html...
Generating /usr/share/tomcat8/.jenkins/jobs/sparql-integrate/workspace/rdf-processing-toolkit-cli/target/apidocs/org/aksw/named_graph_stream/cli/cmd/class-use/CmdNgsWhile.html...
Generating /usr/share/tomcat8/.jenkins/jobs/sparql-integrate/workspace/rdf-processing-toolkit-cli/target/apidocs/org/aksw/named_graph_stream/cli/cmd/class-use/CmdNgJoin.html...
Generating /usr/share/tomcat8/.jenkins/jobs/sparql-integrate/workspace/rdf-processing-toolkit-cli/target/apidocs/org/aksw/named_graph_stream/cli/cmd/class-use/CmdNgsMain.html...
Generating /usr/share/tomcat8/.jenkins/jobs/sparql-integrate/workspace/rdf-processing-toolkit-cli/target/apidocs/org/aksw/named_graph_stream/cli/cmd/class-use/CmdNgsMerge.html...
Generating /usr/share/tomcat8/.jenkins/jobs/sparql-integrate/workspace/rdf-processing-toolkit-cli/target/apidocs/org/aksw/named_graph_stream/cli/cmd/class-use/CmdNgsMap.html...
Generating /usr/share/tomcat8/.jenkins/jobs/sparql-integrate/workspace/rdf-processing-toolkit-cli/target/apidocs/org/aksw/named_graph_stream/cli/cmd/class-use/CmdNgsMap.MapSpec.html...
Generating /usr/share/tomcat8/.jenkins/jobs/sparql-integrate/workspace/rdf-processing-toolkit-cli/target/apidocs/org/aksw/named_graph_stream/cli/cmd/class-use/IParameterConsumerFlaggedLong.html...
Generating /usr/share/tomcat8/.jenkins/jobs/sparql-integrate/workspace/rdf-processing-toolkit-cli/target/apidocs/org/aksw/named_graph_stream/cli/cmd/class-use/CmdNgsSubjects.html...
Generating /usr/share/tomcat8/.jenkins/jobs/sparql-integrate/workspace/rdf-processing-toolkit-cli/target/apidocs/org/aksw/named_graph_stream/cli/cmd/class-use/CmdNgsUntil.html...
Generating /usr/share/tomcat8/.jenkins/jobs/sparql-integrate/workspace/rdf-processing-toolkit-cli/target/apidocs/org/aksw/named_graph_stream/cli/cmd/class-use/CmdNgsTail.html...
Generating /usr/share/tomcat8/.jenkins/jobs/sparql-integrate/workspace/rdf-processing-toolkit-cli/target/apidocs/org/aksw/named_graph_stream/cli/cmd/class-use/CmdNgsCat.html...
Generating /usr/share/tomcat8/.jenkins/jobs/sparql-integrate/workspace/rdf-processing-toolkit-cli/target/apidocs/org/aksw/named_graph_stream/cli/cmd/class-use/CmdNgsWc.html...
Generating /usr/share/tomcat8/.jenkins/jobs/sparql-integrate/workspace/rdf-processing-toolkit-cli/target/apidocs/org/aksw/named_graph_stream/cli/cmd/class-use/CmdNgsProbe.html...
Generating /usr/share/tomcat8/.jenkins/jobs/sparql-integrate/workspace/rdf-processing-toolkit-cli/target/apidocs/org/aksw/named_graph_stream/cli/cmd/class-use/CmdNgsGit.html...
Generating /usr/share/tomcat8/.jenkins/jobs/sparql-integrate/workspace/rdf-processing-toolkit-cli/target/apidocs/org/aksw/named_graph_stream/cli/cmd/class-use/CmdNgsHead.html...
Generating /usr/share/tomcat8/.jenkins/jobs/sparql-integrate/workspace/rdf-processing-toolkit-cli/target/apidocs/org/aksw/named_graph_stream/cli/cmd/class-use/CmdNgsFilter.html...
Generating /usr/share/tomcat8/.jenkins/jobs/sparql-integrate/workspace/rdf-processing-toolkit-cli/target/apidocs/org/aksw/named_graph_stream/cli/cmd/class-use/CmdNgsSort.html...
Generating /usr/share/tomcat8/.jenkins/jobs/sparql-integrate/workspace/rdf-processing-toolkit-cli/target/apidocs/org/aksw/sparql_integrate/cli/class-use/DerbyUtil.html...
Generating /usr/share/tomcat8/.jenkins/jobs/sparql-integrate/workspace/rdf-processing-toolkit-cli/target/apidocs/org/aksw/sparql_integrate/cli/class-use/MainCliSparqlIntegrateOld.html...
Generating /usr/share/tomcat8/.jenkins/jobs/sparql-integrate/workspace/rdf-processing-toolkit-cli/target/apidocs/org/aksw/sparql_integrate/cli/class-use/SparqlStmtProcessor.html...
Generating /usr/share/tomcat8/.jenkins/jobs/sparql-integrate/workspace/rdf-processing-toolkit-cli/target/apidocs/org/aksw/sparql_integrate/cli/class-use/MainCliSparqlLoad.html...
Generating /usr/share/tomcat8/.jenkins/jobs/sparql-integrate/workspace/rdf-processing-toolkit-cli/target/apidocs/org/aksw/sparql_integrate/cli/class-use/CommandMain.html...
Generating /usr/share/tomcat8/.jenkins/jobs/sparql-integrate/workspace/rdf-processing-toolkit-cli/target/apidocs/org/aksw/sparql_integrate/cli/main/class-use/SparqlIntegrateLegacyDataSources.html...
Generating /usr/share/tomcat8/.jenkins/jobs/sparql-integrate/workspace/rdf-processing-toolkit-cli/target/apidocs/org/aksw/sparql_integrate/cli/main/class-use/MainCliSparqlIntegrate.html...
Generating /usr/share/tomcat8/.jenkins/jobs/sparql-integrate/workspace/rdf-processing-toolkit-cli/target/apidocs/org/aksw/sparql_integrate/cli/main/class-use/SparqlIntegrateCmdImpls.html...
Generating /usr/share/tomcat8/.jenkins/jobs/sparql-integrate/workspace/rdf-processing-toolkit-cli/target/apidocs/org/aksw/sparql_integrate/cli/cmd/class-use/CmdSparqlIntegrateMain.html...
Generating /usr/share/tomcat8/.jenkins/jobs/sparql-integrate/workspace/rdf-processing-toolkit-cli/target/apidocs/org/aksw/sparql_integrate/cli/cmd/class-use/CmdSparqlIntegrateMain.OutputSpec.html...
Generating /usr/share/tomcat8/.jenkins/jobs/sparql-integrate/workspace/rdf-processing-toolkit-cli/target/apidocs/org/aksw/rdf_processing_toolkit/cli/main/class-use/MainCliRdfProcessingToolkit.html...
Generating /usr/share/tomcat8/.jenkins/jobs/sparql-integrate/workspace/rdf-processing-toolkit-cli/target/apidocs/org/aksw/rdf_processing_toolkit/cli/cmd/class-use/HasDebugMode.html...
Generating /usr/share/tomcat8/.jenkins/jobs/sparql-integrate/workspace/rdf-processing-toolkit-cli/target/apidocs/org/aksw/rdf_processing_toolkit/cli/cmd/class-use/CmdCommonBase.html...
Generating /usr/share/tomcat8/.jenkins/jobs/sparql-integrate/workspace/rdf-processing-toolkit-cli/target/apidocs/org/aksw/rdf_processing_toolkit/cli/cmd/class-use/VersionProviderRdfProcessingToolkit.html...
Generating /usr/share/tomcat8/.jenkins/jobs/sparql-integrate/workspace/rdf-processing-toolkit-cli/target/apidocs/org/aksw/rdf_processing_toolkit/cli/cmd/class-use/CliUtils.html...
Generating /usr/share/tomcat8/.jenkins/jobs/sparql-integrate/workspace/rdf-processing-toolkit-cli/target/apidocs/org/aksw/rdf_processing_toolkit/cli/cmd/class-use/CmdUtils.html...
Generating /usr/share/tomcat8/.jenkins/jobs/sparql-integrate/workspace/rdf-processing-toolkit-cli/target/apidocs/org/aksw/rdf_processing_toolkit/cli/cmd/class-use/CmdRptMain.html...
Generating /usr/share/tomcat8/.jenkins/jobs/sparql-integrate/workspace/rdf-processing-toolkit-cli/target/apidocs/org/aksw/rdf_processing_toolkit/cli/cmd/class-use/VersionProviderFromClasspathProperties.html...
Generating /usr/share/tomcat8/.jenkins/jobs/sparql-integrate/workspace/rdf-processing-toolkit-cli/target/apidocs/org/aksw/jena_sparql_api/rx/op/api/class-use/OpConfigSort.html...
Generating /usr/share/tomcat8/.jenkins/jobs/sparql-integrate/workspace/rdf-processing-toolkit-cli/target/apidocs/org/aksw/sparql_binding_stream/cli/main/class-use/SbsCmdImpls.html...
Generating /usr/share/tomcat8/.jenkins/jobs/sparql-integrate/workspace/rdf-processing-toolkit-cli/target/apidocs/org/aksw/sparql_binding_stream/cli/main/class-use/MainCliSparqlBindingStream.html...
Generating /usr/share/tomcat8/.jenkins/jobs/sparql-integrate/workspace/rdf-processing-toolkit-cli/target/apidocs/org/aksw/sparql_binding_stream/cli/cmd/class-use/CmdSbsMain.html...
Generating /usr/share/tomcat8/.jenkins/jobs/sparql-integrate/workspace/rdf-processing-toolkit-cli/target/apidocs/org/aksw/sparql_binding_stream/cli/cmd/class-use/CmdSbsMap.html...
Generating /usr/share/tomcat8/.jenkins/jobs/sparql-integrate/workspace/rdf-processing-toolkit-cli/target/apidocs/org/aksw/sparql_binding_stream/cli/cmd/class-use/CmdSbsSplit.html...
Generating /usr/share/tomcat8/.jenkins/jobs/sparql-integrate/workspace/rdf-processing-toolkit-cli/target/apidocs/org/aksw/sparql_binding_stream/cli/cmd/class-use/CmdSbsFilter.html...
Generating /usr/share/tomcat8/.jenkins/jobs/sparql-integrate/workspace/rdf-processing-toolkit-cli/target/apidocs/class-use/sbs.html...
Generating /usr/share/tomcat8/.jenkins/jobs/sparql-integrate/workspace/rdf-processing-toolkit-cli/target/apidocs/class-use/rpt.html...
Generating /usr/share/tomcat8/.jenkins/jobs/sparql-integrate/workspace/rdf-processing-toolkit-cli/target/apidocs/class-use/ngs.html...
Generating /usr/share/tomcat8/.jenkins/jobs/sparql-integrate/workspace/rdf-processing-toolkit-cli/target/apidocs/class-use/integrate.html...
Generating /usr/share/tomcat8/.jenkins/jobs/sparql-integrate/workspace/rdf-processing-toolkit-cli/target/apidocs/package-use.html...
Generating /usr/share/tomcat8/.jenkins/jobs/sparql-integrate/workspace/rdf-processing-toolkit-cli/target/apidocs/org/aksw/jena_sparql_api/rx/op/api/package-use.html...
Generating /usr/share/tomcat8/.jenkins/jobs/sparql-integrate/workspace/rdf-processing-toolkit-cli/target/apidocs/org/aksw/named_graph_stream/cli/cmd/package-use.html...
Generating /usr/share/tomcat8/.jenkins/jobs/sparql-integrate/workspace/rdf-processing-toolkit-cli/target/apidocs/org/aksw/named_graph_stream/cli/main/package-use.html...
Generating /usr/share/tomcat8/.jenkins/jobs/sparql-integrate/workspace/rdf-processing-toolkit-cli/target/apidocs/org/aksw/rdf_processing_toolkit/cli/cmd/package-use.html...
Generating /usr/share/tomcat8/.jenkins/jobs/sparql-integrate/workspace/rdf-processing-toolkit-cli/target/apidocs/org/aksw/rdf_processing_toolkit/cli/main/package-use.html...
Generating /usr/share/tomcat8/.jenkins/jobs/sparql-integrate/workspace/rdf-processing-toolkit-cli/target/apidocs/org/aksw/sparql_binding_stream/cli/cmd/package-use.html...
Generating /usr/share/tomcat8/.jenkins/jobs/sparql-integrate/workspace/rdf-processing-toolkit-cli/target/apidocs/org/aksw/sparql_binding_stream/cli/main/package-use.html...
Generating /usr/share/tomcat8/.jenkins/jobs/sparql-integrate/workspace/rdf-processing-toolkit-cli/target/apidocs/org/aksw/sparql_integrate/cli/package-use.html...
Generating /usr/share/tomcat8/.jenkins/jobs/sparql-integrate/workspace/rdf-processing-toolkit-cli/target/apidocs/org/aksw/sparql_integrate/cli/cmd/package-use.html...
Generating /usr/share/tomcat8/.jenkins/jobs/sparql-integrate/workspace/rdf-processing-toolkit-cli/target/apidocs/org/aksw/sparql_integrate/cli/main/package-use.html...
Building index for all the packages and classes...
Generating /usr/share/tomcat8/.jenkins/jobs/sparql-integrate/workspace/rdf-processing-toolkit-cli/target/apidocs/overview-tree.html...
Generating /usr/share/tomcat8/.jenkins/jobs/sparql-integrate/workspace/rdf-processing-toolkit-cli/target/apidocs/index-all.html...
Building index for all classes...
Generating /usr/share/tomcat8/.jenkins/jobs/sparql-integrate/workspace/rdf-processing-toolkit-cli/target/apidocs/allclasses-index.html...
Generating /usr/share/tomcat8/.jenkins/jobs/sparql-integrate/workspace/rdf-processing-toolkit-cli/target/apidocs/allpackages-index.html...
Generating /usr/share/tomcat8/.jenkins/jobs/sparql-integrate/workspace/rdf-processing-toolkit-cli/target/apidocs/deprecated-list.html...
Building index for all classes...
Generating /usr/share/tomcat8/.jenkins/jobs/sparql-integrate/workspace/rdf-processing-toolkit-cli/target/apidocs/allclasses.html...
Generating /usr/share/tomcat8/.jenkins/jobs/sparql-integrate/workspace/rdf-processing-toolkit-cli/target/apidocs/allclasses.html...
Generating /usr/share/tomcat8/.jenkins/jobs/sparql-integrate/workspace/rdf-processing-toolkit-cli/target/apidocs/index.html...
Generating /usr/share/tomcat8/.jenkins/jobs/sparql-integrate/workspace/rdf-processing-toolkit-cli/target/apidocs/overview-summary.html...
Generating /usr/share/tomcat8/.jenkins/jobs/sparql-integrate/workspace/rdf-processing-toolkit-cli/target/apidocs/help-doc.html...
100 warnings
[WARNING] Javadoc Warnings
[WARNING] javadoc: warning - The code being documented uses modules but the packages defined in http://docs.oracle.com/javase/7/docs/api/ are in the unnamed module.
[WARNING] javadoc: warning - The code being documented uses modules but the packages defined in http://docs.oracle.com/javase/7/docs/api/ are in the unnamed module.
[WARNING] javadoc: warning - The code being documented uses modules but the packages defined in http://docs.oracle.com/javase/7/docs/api/ are in the unnamed module.
[WARNING] javadoc: warning - The code being documented uses modules but the packages defined in http://docs.oracle.com/javase/7/docs/api/ are in the unnamed module.
[WARNING] javadoc: warning - The code being documented uses modules but the packages defined in http://docs.oracle.com/javase/7/docs/api/ are in the unnamed module.
[WARNING] javadoc: warning - The code being documented uses modules but the packages defined in http://docs.oracle.com/javase/7/docs/api/ are in the unnamed module.
[WARNING] javadoc: warning - The code being documented uses modules but the packages defined in http://docs.oracle.com/javase/7/docs/api/ are in the unnamed module.
[WARNING] javadoc: warning - The code being documented uses modules but the packages defined in http://docs.oracle.com/javase/7/docs/api/ are in the unnamed module.
[WARNING] javadoc: warning - The code being documented uses modules but the packages defined in http://docs.oracle.com/javase/7/docs/api/ are in the unnamed module.
[WARNING] javadoc: warning - The code being documented uses modules but the packages defined in http://docs.oracle.com/javase/7/docs/api/ are in the unnamed module.
[WARNING] javadoc: warning - The code being documented uses modules but the packages defined in http://docs.oracle.com/javase/7/docs/api/ are in the unnamed module.
[WARNING] javadoc: warning - The code being documented uses modules but the packages defined in http://docs.oracle.com/javase/7/docs/api/ are in the unnamed module.
[WARNING] javadoc: warning - The code being documented uses modules but the packages defined in http://docs.oracle.com/javase/7/docs/api/ are in the unnamed module.
[WARNING] javadoc: warning - The code being documented uses modules but the packages defined in http://docs.oracle.com/javase/7/docs/api/ are in the unnamed module.
[WARNING] javadoc: warning - The code being documented uses modules but the packages defined in http://docs.oracle.com/javase/7/docs/api/ are in the unnamed module.
[WARNING] javadoc: warning - The code being documented uses modules but the packages defined in http://docs.oracle.com/javase/7/docs/api/ are in the unnamed module.
[WARNING] javadoc: warning - The code being documented uses modules but the packages defined in http://docs.oracle.com/javase/7/docs/api/ are in the unnamed module.
[WARNING] javadoc: warning - The code being documented uses modules but the packages defined in http://docs.oracle.com/javase/7/docs/api/ are in the unnamed module.
[WARNING] javadoc: warning - The code being documented uses modules but the packages defined in http://docs.oracle.com/javase/7/docs/api/ are in the unnamed module.
[WARNING] javadoc: warning - The code being documented uses modules but the packages defined in http://docs.oracle.com/javase/7/docs/api/ are in the unnamed module.
[WARNING] javadoc: warning - The code being documented uses modules but the packages defined in http://docs.oracle.com/javase/7/docs/api/ are in the unnamed module.
[WARNING] javadoc: warning - The code being documented uses modules but the packages defined in http://docs.oracle.com/javase/7/docs/api/ are in the unnamed module.
[WARNING] javadoc: warning - The code being documented uses modules but the packages defined in http://docs.oracle.com/javase/7/docs/api/ are in the unnamed module.
[WARNING] javadoc: warning - The code being documented uses modules but the packages defined in http://docs.oracle.com/javase/7/docs/api/ are in the unnamed module.
[WARNING] javadoc: warning - The code being documented uses modules but the packages defined in http://docs.oracle.com/javase/7/docs/api/ are in the unnamed module.
[WARNING] javadoc: warning - The code being documented uses modules but the packages defined in http://docs.oracle.com/javase/7/docs/api/ are in the unnamed module.
[WARNING] javadoc: warning - The code being documented uses modules but the packages defined in http://docs.oracle.com/javase/7/docs/api/ are in the unnamed module.
[WARNING] javadoc: warning - The code being documented uses modules but the packages defined in http://docs.oracle.com/javase/7/docs/api/ are in the unnamed module.
[WARNING] javadoc: warning - The code being documented uses modules but the packages defined in http://docs.oracle.com/javase/7/docs/api/ are in the unnamed module.
[WARNING] javadoc: warning - The code being documented uses modules but the packages defined in http://docs.oracle.com/javase/7/docs/api/ are in the unnamed module.
[WARNING] javadoc: warning - The code being documented uses modules but the packages defined in http://docs.oracle.com/javase/7/docs/api/ are in the unnamed module.
[WARNING] javadoc: warning - The code being documented uses modules but the packages defined in http://docs.oracle.com/javase/7/docs/api/ are in the unnamed module.
[WARNING] javadoc: warning - The code being documented uses modules but the packages defined in http://docs.oracle.com/javase/7/docs/api/ are in the unnamed module.
[WARNING] javadoc: warning - The code being documented uses modules but the packages defined in http://docs.oracle.com/javase/7/docs/api/ are in the unnamed module.
[WARNING] javadoc: warning - The code being documented uses modules but the packages defined in http://docs.oracle.com/javase/7/docs/api/ are in the unnamed module.
[WARNING] javadoc: warning - The code being documented uses modules but the packages defined in http://docs.oracle.com/javase/7/docs/api/ are in the unnamed module.
[WARNING] javadoc: warning - The code being documented uses modules but the packages defined in http://docs.oracle.com/javase/7/docs/api/ are in the unnamed module.
[WARNING] javadoc: warning - The code being documented uses modules but the packages defined in http://docs.oracle.com/javase/7/docs/api/ are in the unnamed module.
[WARNING] javadoc: warning - The code being documented uses modules but the packages defined in http://docs.oracle.com/javase/7/docs/api/ are in the unnamed module.
[WARNING] javadoc: warning - The code being documented uses modules but the packages defined in http://docs.oracle.com/javase/7/docs/api/ are in the unnamed module.
[WARNING] javadoc: warning - The code being documented uses modules but the packages defined in http://docs.oracle.com/javase/7/docs/api/ are in the unnamed module.
[WARNING] javadoc: warning - The code being documented uses modules but the packages defined in http://docs.oracle.com/javase/7/docs/api/ are in the unnamed module.
[WARNING] javadoc: warning - The code being documented uses modules but the packages defined in http://docs.oracle.com/javase/7/docs/api/ are in the unnamed module.
[WARNING] javadoc: warning - The code being documented uses modules but the packages defined in http://docs.oracle.com/javase/7/docs/api/ are in the unnamed module.
[WARNING] javadoc: warning - The code being documented uses modules but the packages defined in http://docs.oracle.com/javase/7/docs/api/ are in the unnamed module.
[WARNING] javadoc: warning - The code being documented uses modules but the packages defined in http://docs.oracle.com/javase/7/docs/api/ are in the unnamed module.
[WARNING] javadoc: warning - The code being documented uses modules but the packages defined in http://docs.oracle.com/javase/7/docs/api/ are in the unnamed module.
[WARNING] javadoc: warning - The code being documented uses modules but the packages defined in http://docs.oracle.com/javase/7/docs/api/ are in the unnamed module.
[WARNING] javadoc: warning - The code being documented uses modules but the packages defined in http://docs.oracle.com/javase/7/docs/api/ are in the unnamed module.
[WARNING] javadoc: warning - The code being documented uses modules but the packages defined in http://docs.oracle.com/javase/7/docs/api/ are in the unnamed module.
[WARNING] javadoc: warning - The code being documented uses modules but the packages defined in http://docs.oracle.com/javase/7/docs/api/ are in the unnamed module.
[WARNING] javadoc: warning - The code being documented uses modules but the packages defined in http://docs.oracle.com/javase/7/docs/api/ are in the unnamed module.
[WARNING] javadoc: warning - The code being documented uses modules but the packages defined in http://docs.oracle.com/javase/7/docs/api/ are in the unnamed module.
[WARNING] javadoc: warning - The code being documented uses modules but the packages defined in http://docs.oracle.com/javase/7/docs/api/ are in the unnamed module.
[WARNING] javadoc: warning - The code being documented uses modules but the packages defined in http://docs.oracle.com/javase/7/docs/api/ are in the unnamed module.
[WARNING] javadoc: warning - The code being documented uses modules but the packages defined in http://docs.oracle.com/javase/7/docs/api/ are in the unnamed module.
[WARNING] javadoc: warning - The code being documented uses modules but the packages defined in http://docs.oracle.com/javase/7/docs/api/ are in the unnamed module.
[WARNING] javadoc: warning - The code being documented uses modules but the packages defined in http://docs.oracle.com/javase/7/docs/api/ are in the unnamed module.
[WARNING] javadoc: warning - The code being documented uses modules but the packages defined in http://docs.oracle.com/javase/7/docs/api/ are in the unnamed module.
[WARNING] javadoc: warning - The code being documented uses modules but the packages defined in http://docs.oracle.com/javase/7/docs/api/ are in the unnamed module.
[WARNING] javadoc: warning - The code being documented uses modules but the packages defined in http://docs.oracle.com/javase/7/docs/api/ are in the unnamed module.
[WARNING] javadoc: warning - The code being documented uses modules but the packages defined in http://docs.oracle.com/javase/7/docs/api/ are in the unnamed module.
[WARNING] javadoc: warning - The code being documented uses modules but the packages defined in http://docs.oracle.com/javase/7/docs/api/ are in the unnamed module.
[WARNING] javadoc: warning - The code being documented uses modules but the packages defined in http://docs.oracle.com/javase/7/docs/api/ are in the unnamed module.
[WARNING] javadoc: warning - The code being documented uses modules but the packages defined in http://docs.oracle.com/javase/7/docs/api/ are in the unnamed module.
[WARNING] javadoc: warning - The code being documented uses modules but the packages defined in http://docs.oracle.com/javase/7/docs/api/ are in the unnamed module.
[WARNING] javadoc: warning - The code being documented uses modules but the packages defined in http://docs.oracle.com/javase/7/docs/api/ are in the unnamed module.
[WARNING] javadoc: warning - The code being documented uses modules but the packages defined in http://docs.oracle.com/javase/7/docs/api/ are in the unnamed module.
[WARNING] javadoc: warning - The code being documented uses modules but the packages defined in http://docs.oracle.com/javase/7/docs/api/ are in the unnamed module.
[WARNING] javadoc: warning - The code being documented uses modules but the packages defined in http://docs.oracle.com/javase/7/docs/api/ are in the unnamed module.
[WARNING] javadoc: warning - The code being documented uses modules but the packages defined in http://docs.oracle.com/javase/7/docs/api/ are in the unnamed module.
[WARNING] javadoc: warning - The code being documented uses modules but the packages defined in http://docs.oracle.com/javase/7/docs/api/ are in the unnamed module.
[WARNING] javadoc: warning - The code being documented uses modules but the packages defined in http://docs.oracle.com/javase/7/docs/api/ are in the unnamed module.
[WARNING] javadoc: warning - The code being documented uses modules but the packages defined in http://docs.oracle.com/javase/7/docs/api/ are in the unnamed module.
[WARNING] javadoc: warning - The code being documented uses modules but the packages defined in http://docs.oracle.com/javase/7/docs/api/ are in the unnamed module.
[WARNING] javadoc: warning - The code being documented uses modules but the packages defined in http://docs.oracle.com/javase/7/docs/api/ are in the unnamed module.
[WARNING] javadoc: warning - The code being documented uses modules but the packages defined in http://docs.oracle.com/javase/7/docs/api/ are in the unnamed module.
[WARNING] javadoc: warning - The code being documented uses modules but the packages defined in http://docs.oracle.com/javase/7/docs/api/ are in the unnamed module.
[WARNING] javadoc: warning - The code being documented uses modules but the packages defined in http://docs.oracle.com/javase/7/docs/api/ are in the unnamed module.
[WARNING] javadoc: warning - The code being documented uses modules but the packages defined in http://docs.oracle.com/javase/7/docs/api/ are in the unnamed module.
[WARNING] javadoc: warning - The code being documented uses modules but the packages defined in http://docs.oracle.com/javase/7/docs/api/ are in the unnamed module.
[WARNING] javadoc: warning - The code being documented uses modules but the packages defined in http://docs.oracle.com/javase/7/docs/api/ are in the unnamed module.
[WARNING] javadoc: warning - The code being documented uses modules but the packages defined in http://docs.oracle.com/javase/7/docs/api/ are in the unnamed module.
[WARNING] javadoc: warning - The code being documented uses modules but the packages defined in http://docs.oracle.com/javase/7/docs/api/ are in the unnamed module.
[WARNING] javadoc: warning - The code being documented uses modules but the packages defined in http://docs.oracle.com/javase/7/docs/api/ are in the unnamed module.
[WARNING] javadoc: warning - The code being documented uses modules but the packages defined in http://docs.oracle.com/javase/7/docs/api/ are in the unnamed module.
[WARNING] javadoc: warning - The code being documented uses modules but the packages defined in http://docs.oracle.com/javase/7/docs/api/ are in the unnamed module.
[WARNING] javadoc: warning - The code being documented uses modules but the packages defined in http://docs.oracle.com/javase/7/docs/api/ are in the unnamed module.
[WARNING] javadoc: warning - The code being documented uses modules but the packages defined in http://docs.oracle.com/javase/7/docs/api/ are in the unnamed module.
[WARNING] javadoc: warning - The code being documented uses modules but the packages defined in http://docs.oracle.com/javase/7/docs/api/ are in the unnamed module.
[WARNING] javadoc: warning - The code being documented uses modules but the packages defined in http://docs.oracle.com/javase/7/docs/api/ are in the unnamed module.
[WARNING] javadoc: warning - The code being documented uses modules but the packages defined in http://docs.oracle.com/javase/7/docs/api/ are in the unnamed module.
[WARNING] javadoc: warning - The code being documented uses modules but the packages defined in http://docs.oracle.com/javase/7/docs/api/ are in the unnamed module.
[WARNING] javadoc: warning - The code being documented uses modules but the packages defined in http://docs.oracle.com/javase/7/docs/api/ are in the unnamed module.
[WARNING] javadoc: warning - The code being documented uses modules but the packages defined in http://docs.oracle.com/javase/7/docs/api/ are in the unnamed module.
[WARNING] javadoc: warning - The code being documented uses modules but the packages defined in http://docs.oracle.com/javase/7/docs/api/ are in the unnamed module.
[WARNING] javadoc: warning - The code being documented uses modules but the packages defined in http://docs.oracle.com/javase/7/docs/api/ are in the unnamed module.
[WARNING] javadoc: warning - The code being documented uses modules but the packages defined in http://docs.oracle.com/javase/7/docs/api/ are in the unnamed module.
[WARNING] javadoc: warning - The code being documented uses modules but the packages defined in http://docs.oracle.com/javase/7/docs/api/ are in the unnamed module.
[WARNING] javadoc: warning - The code being documented uses modules but the packages defined in http://docs.oracle.com/javase/7/docs/api/ are in the unnamed module.
[INFO] Building jar: /usr/share/tomcat8/.jenkins/jobs/sparql-integrate/workspace/rdf-processing-toolkit-cli/target/rdf-processing-toolkit-cli-1.9.1-SNAPSHOT-javadoc.jar
[INFO] 
[INFO] --- maven-source-plugin:3.0.1:jar-no-fork (attach-sources) @ rdf-processing-toolkit-cli ---
[INFO] Building jar: /usr/share/tomcat8/.jenkins/jobs/sparql-integrate/workspace/rdf-processing-toolkit-cli/target/rdf-processing-toolkit-cli-1.9.1-SNAPSHOT-sources.jar
[INFO] 
[INFO] --- maven-install-plugin:2.4:install (default-install) @ rdf-processing-toolkit-cli ---
[INFO] Installing /usr/share/tomcat8/.jenkins/jobs/sparql-integrate/workspace/rdf-processing-toolkit-cli/target/rdf-processing-toolkit-cli-1.9.1-SNAPSHOT.jar to /usr/share/tomcat8/.m2/repository/org/aksw/rdf-processing-toolkit/rdf-processing-toolkit-cli/1.9.1-SNAPSHOT/rdf-processing-toolkit-cli-1.9.1-SNAPSHOT.jar
[INFO] Installing /usr/share/tomcat8/.jenkins/jobs/sparql-integrate/workspace/rdf-processing-toolkit-cli/pom.xml to /usr/share/tomcat8/.m2/repository/org/aksw/rdf-processing-toolkit/rdf-processing-toolkit-cli/1.9.1-SNAPSHOT/rdf-processing-toolkit-cli-1.9.1-SNAPSHOT.pom
[INFO] Installing /usr/share/tomcat8/.jenkins/jobs/sparql-integrate/workspace/rdf-processing-toolkit-cli/target/rdf-processing-toolkit-cli-1.9.1-SNAPSHOT-javadoc.jar to /usr/share/tomcat8/.m2/repository/org/aksw/rdf-processing-toolkit/rdf-processing-toolkit-cli/1.9.1-SNAPSHOT/rdf-processing-toolkit-cli-1.9.1-SNAPSHOT-javadoc.jar
[INFO] Installing /usr/share/tomcat8/.jenkins/jobs/sparql-integrate/workspace/rdf-processing-toolkit-cli/target/rdf-processing-toolkit-cli-1.9.1-SNAPSHOT-sources.jar to /usr/share/tomcat8/.m2/repository/org/aksw/rdf-processing-toolkit/rdf-processing-toolkit-cli/1.9.1-SNAPSHOT/rdf-processing-toolkit-cli-1.9.1-SNAPSHOT-sources.jar